{"text_format":"1","workbook":"xlsx","n_sheets":10,"sheets":["CAMP PILOTO EVOL","CAMP EQUIPE EVOL","PRESENÇAS","TROCA KART","TABELA","Classificação Geral","Class. elimin. 2 piores res","Tabela Equipes","Class Elimin 2 Piores Equip","Posição x Pontos"],"not_rendered":{"charts":0,"images":0,"macros":1,"external_links":1,"defined_names":3,"comments":4,"pivot_tables":0},"unopened":[],"bounds":{"document_bytes":16777216,"sheet_cells":100000,"rows_first":2000,"rows_last":500,"rows_between":2000,"halvings":0,"cell_chars":16384,"cell_head_chars":4096},"cells_cut":0,"cells_raw":0,"read":"whole","date_system":"1900"}

{"sheet":"CAMP PILOTO EVOL","index":0,"n_rows":49,"n_cols":33,"rows_kept":49,"cut":false,"hidden":false,"merged":[[1,21,1,22],[1,23,1,24],[1,28,1,29],[1,19,1,20],[0,25,3,25],[0,32,3,32],[1,3,1,4],[1,5,1,6],[1,7,1,8],[1,9,1,10],[1,11,1,12],[1,13,1,14],[1,15,1,16],[1,17,1,18],[2,3,2,4],[2,5,2,6],[2,7,2,8],[2,9,2,10],[2,11,2,12],[2,13,2,14],[2,17,2,18],[0,26,3,26],[0,27,3,27],[0,28,0,29],[0,30,3,30],[0,31,3,31],[2,28,2,29],[0,23,0,24],[0,0,3,0],[0,3,0,4],[0,5,0,6],[0,7,0,8],[0,9,0,10],[0,11,0,12],[0,13,0,14],[0,15,0,16],[0,17,0,18],[0,19,0,20],[0,21,0,22],[2,15,2,16],[2,19,2,20],[2,21,2,22],[2,23,2,24]]}
["PARA DESTACAR UM PILOTO MARQUE/DESMARQUE COM UM \"X\" AO LADO DO NOME E CLIQUE NO BOTÃO. =>",null,null,"OK",null,"OK",null,"OK",null,"OK",null,"OK",null,"OK",null,"OK",null,"OK",null,"OK",null,"OK",null,"OK",null,"DIF. LIDER","DIF. 5º","DIF. PRÓXIMO","OK",null,"DIF. LIDER","DIF. 5º","DIF. PRÓXIMO"]
[null,null,null,"1ª etapa",null,"2ª etapa",null,"3ª etapa",null,"4ª etapa",null,"5ª etapa",null,"6ª etapa",null,"7ª etapa",null,"8ª etapa",null,"9ª etapa",null,"10ª etapa",null,"11ª etapa",null,null,null,null,"12ª etapa"]
[]
[null,"Nome do (a) Piloto (a)",null,"PILOTO","PONTOS","PILOTO","PONTOS","PILOTO","PONTOS","PILOTO","PONTOS","PILOTO","PONTOS","PILOTO","PONTOS","PILOTO","PONTOS","PILOTO","PONTOS","PILOTO","PONTOS","PILOTO","PONTOS","PILOTO","PONTOS",null,null,null,"PILOTO","PONTOS"]
[null,"Alexandre Melillo",1,"Daniel Nahum",45,"Daniel Nahum",81,"Wesley Bambirra",83,"Marcelo Campos",87,"Wesley Bambirra",124,"Wesley Bambirra",169,"Wesley Bambirra",203,"Wesley Bambirra",244,"Marcelo Campos",272,"Marcelo Campos",304,"Marcelo Campos",350,"-","-","-","Marcelo Campos",378,"-","-","-"]
[null,"Bernardo Freitas",2,"Marcelo Campos",42,"Marcelo Pereira",76,"Daniel Nahum",81,"Daniel Nahum",84,"Marcelo Campos",123,"Marcelo Campos",158,"Marcelo Campos",200,"Marcelo Campos",234,"Wesley Bambirra",268,"Daniel Nahum",302,"Daniel Nahum",332,{"$f":"Y$5-Y6","v":18},"-",{"$f":"Y5-Y6","v":18},"Daniel Nahum",378,{"$f":"AD$5-AD6","v":0},"-",{"$f":"AD5-AD6","v":0}]
[null,"Cláudio Dumont",3,"Marcelo Pereira",38,"Marcelo Campos",70,"Marcelo Pereira",80,"Wesley Bambirra",83,"Daniel Nahum",120,"Daniel Nahum",158,"Daniel Nahum",196,"Daniel Nahum",230,"Daniel Nahum",266,"Wesley Bambirra",288,"Wesley Bambirra",316,34,"-",16,"Wesley Bambirra",350,28,"-",28]
[null,"Cláudio Naves",4,"Luciano Robervine",36,"Wesley Bambirra",69,"Marcelo Campos",78,"Cláudio Dumont",77,"Cláudio Dumont",105,"Alexandre Melillo",136,"Alexandre Melillo",172,"Marcelo Clemente",201,"Marcelo Clemente",227,"Alexandre Melillo",242,"Wesley Canuto",275,75,"-",41,"Wesley Canuto",313,65,"-",37]
["X","Daniel Nahum",5,"Frederico Papatella",34,"Cláudio Dumont",69,"Cláudio Dumont",69,"Rodrigo Mercadante",64,"Jarbas Reis",100,"Marcelo Pereira",136,"Marcelo Clemente",156,"Alexandre Melillo",194,"Marcelo Pereira",214,"Marcelo Clemente",241,"Alexandre Melillo",266,84,"-",9,"Jarbas Reis",296,82,"-",17]
[null,"SSSSS",6,"Jarbas Reis",32,"Rodrigo Mercadante",64,"Rodrigo Mercadante",64,"Jarbas Reis",64,"Marcelo Pereira",98,"Jarbas Reis",128,"Jarbas Reis",150,"Wesley Canuto",178,"Alexandre Melillo",208,"Wesley Canuto",239,"Jarbas Reis",260,90,{"$f":"Y$9-Y10","v":6},6,"Marcelo Clemente",291,87,{"$f":"AD$9-AD10","v":5},5]
[null,"Eduardo Henrique",7,"Rodrigo Mercadante",30,"Jarbas Reis",64,"Jarbas Reis",64,"Alexandre Melillo",63,"Alexandre Melillo",95,"Cláudio Dumont",121,"Marcelo Pereira",143,"Jarbas Reis",172,"Jarbas Reis",200,"Jarbas Reis",230,"Marcelo Clemente",250,100,16,10,"Alexandre Melillo",286,92,10,5]
[null,"Frederico Papatella",8,"Cláudio Dumont",28,"Frederico Papatella",51,"Marcelo Marcondes",55,"Marcelo Pereira",60,"Marcelo Marcondes",85,"Wesley Canuto",112,"Wesley Canuto",140,"Marcelo Pereira",169,"Wesley Canuto",198,"Marcelo Pereira",219,"Eduardo Henrique",233,117,33,17,"Marcelo Marcondes",238,140,58,48]
[null,"Guilherme Alves",9,"Guilherme Alves",26,"Guilherme Alves",48,"Maurício Júnior",52,"Marcelo Marcondes",55,"Marcelo Clemente",85,"Marcelo Clemente",111,"Rodrigo Mercadante",135,"Guilherme Alves",157,"Eduardo Henrique",182,"Marcelo Marcondes",204,"Guilherme Alves",233,117,33,0,"Guilherme Alves",234,144,62,4]
[null,"Felipe Bouhid",10,"Wesley Bambirra",24,"Maurício Júnior",44,"Guilherme Alves",50,"Wesley Canuto",54,"Wesley Canuto",78,"Rodrigo Mercadante",105,"Marcelo Marcondes",122,"Marcelo Marcondes",146,"Guilherme Alves",179,"Guilherme Alves",201,"Maurício Júnior",231,119,35,2,"Marcelo Pereira",231,147,65,3]
[null,"Hélio Chagas",11,"Alexandre Melillo",22,"Alexandre Melillo",42,"Wesley Canuto",44,"Maurício Júnior",52,"Maurício Júnior",76,"Eduardo Henrique",95,"Cláudio Dumont",122,"Eduardo Henrique",141,"Marcelo Marcondes",158,"Eduardo Henrique",199,"Marcelo Pereira",226,124,40,5,"Maurício Júnior",231,147,65,0]
[null,"Hugo Denucci",12,"Raphael Reis",20,"Marcelo Marcondes",40,"Alexandre Melillo",42,"Guilherme Alves",50,"Rodrigo Mercadante",75,"Marcelo Marcondes",89,"Eduardo Henrique",121,"Maurício Júnior",137,"Maurício Júnior",155,"Maurício Júnior",193,"Marcelo Marcondes",211,139,55,15,"Eduardo Henrique",228,150,68,3]
["X","Jarbas Reis",13,"Maurício Júnior",18,"Luciano Robervine",37,"Luciano Robervine",37,"Bernardo Freitas",46,"Guilherme Alves",72,"Guilherme Alves",87,"Guilherme Alves",121,"Rodrigo Mercadante",135,"Rodrigo Mercadante",135,"Rodrigo Ricardo",148,"Marcelo Chagas",171,179,95,40,"Rodrigo Ricardo",190,188,106,38]
[null,"Leandro Malias",14,"Rodrigo Ricardo",17,"Rodrigo Ricardo",33,"Frederico Papatella",37,"Marcelo Clemente",39,"Bernardo Gatti",68,"Maurício Júnior",85,"Maurício Júnior",117,"Cláudio Dumont",117,"Rodrigo Ricardo",126,"Rodrigo Mercadante",135,"Rodrigo Ricardo",170,180,96,1,"Marcelo Chagas",186,192,110,4]
[null,"Lucas Guimarães",15,"Renato Amaral",16,"Raphael Reis",29,"Bernardo Freitas",37,"Bernardo Gatti",38,"Bernardo Freitas",62,"Marcelo Chagas",75,"Marcelo Chagas",93,"Marcelo Chagas",105,"Marcelo Chagas",113,"Marcelo Chagas",130,"Rodrigo Mercadante",135,215,131,35,"Rodrigo Mercadante",135,243,161,51]
[null,"Luciano Robervine",16,"Leandro Malias",15,"Wesley Canuto",27,"Marcelo Clemente",37,"Luciano Robervine",37,"Eduardo Henrique",59,"Bernardo Gatti",74,"Rodrigo Ricardo",86,"Rodrigo Ricardo",102,"Cláudio Dumont",112,"Cláudio Dumont",107,"Renato Amaral",116,234,150,19,"Vitor Gatti",127,251,169,8]
["X","Marcelo Campos",17,"Marcelo Sant'anna",14,"SSSSS",25,"Bernardo Gatti",36,"Frederico Papatella",37,"Frederico Papatella",54,"Rodrigo Ricardo",70,"Bernardo Freitas",71,"Lucas Guimarães",74,"Reila Ricardo",86,"Renato Amaral",106,"Cláudio Dumont",102,248,164,14,"Renato Amaral",116,262,180,11]
[null,"Marcelo Chagas",18,"SSSSS",13,"Bernardo Gatti",24,"Rodrigo Ricardo",35,"Rodrigo Ricardo",35,"Rodrigo Ricardo",52,"Luciano Robervine",68,"Luciano Robervine",63,"Bernardo Freitas",71,"Renato Amaral",82,"Hélio Chagas",83,"Vitor Gatti",97,253,169,5,"Jucimar Vieira",115,263,181,1]
[null,"Marcelo Clemente",19,"Marcelo Chagas",12,"Marcelo Sant'anna",24,"Raphael Reis",33,"Raphael Reis",33,"Raphael Reis",46,"Bernardo Freitas",66,"Jucimar Vieira",59,"Jucimar Vieira",71,"Jucimar Vieira",75,"Jucimar Vieira",82,"Jucimar Vieira",97,253,169,0,"Hélio Chagas",112,266,184,3]
[null,"Marcelo Marcondes",20,"Reila Ricardo",11,"Reila Ricardo",24,"Marcelo Chagas",28,"Renato Amaral",25,"Renato Amaral",39,"Marcelo Sant'anna",57,"Marcelo Sant'anna",57,"Reila Ricardo",70,"Lucas Guimarães",69,"Reila Ricardo",81,"Hélio Chagas",95,255,171,2,"Cláudio Dumont",102,276,194,10]
[null,"Marcelo Pereira",21,"Marcelo Marcondes",10,"Renato Amaral",23,"Felipe Bouhid",27,"Reila Ricardo",24,"Luciano Robervine",32,"Raphael Reis",55,"Reila Ricardo",55,"Luciano Robervine",58,"Tati Marcondes",69,"Tati Marcondes",74,"Frederico Papatella",88,262,178,7,"Raphael Reis",97,281,199,5]
[null,"Marcelo Sant'anna",22,"Hélio Chagas",9,"Leandro Malias",21,"Renato Amaral",25,"Izabella Rodrigues",23,"Jucimar Vieira",32,"Frederico Papatella",54,"Raphael Reis",55,"Marcelo Sant'anna",57,"Bernardo Freitas",66,"Bernardo Freitas",71,"Tati Marcondes",88,262,178,0,"Felipe Bouhid",96,282,200,1]
[null,"Bernardo Gatti",23,"Tati Marcondes",8,"Marcelo Clemente",19,"Reila Ricardo",24,"Eduardo Henrique",21,"Reila Ricardo",31,"Reila Ricardo",53,"Renato Amaral",53,"Hélio Chagas",57,"Hélio Chagas",65,"Vitor Gatti",71,"Reila Ricardo",76,274,190,12,"Cláudio Naves",95,283,201,1]
[null,"Maurício Júnior",24,"Cláudio Naves",7,"Hélio Chagas",17,"Leandro Malias",21,"Tati Marcondes",19,"Tati Marcondes",31,"Renato Amaral",51,"Frederico Papatella",49,"Raphael Reis",55,"Marcelo Sant'anna",57,"Frederico Papatella",70,"Raphael Reis",75,275,191,1,"Tati Marcondes",90,288,206,5]
[null,"Pedro Mello",25,"Bernardo Gatti",6,"Felipe Bouhid",15,"Tati Marcondes",19,"Jucimar Vieira",19,"Felipe Bouhid",29,"SSSSS",45,"Lucas Guimarães",46,"Tati Marcondes",51,"Cláudio Naves",54,"Lucas Guimarães",64,"Bernardo Freitas",71,279,195,4,"Frederico Papatella",88,290,208,2]
[null,"Raphael Reis",26,"Bernardo Freitas",5,"Tati Marcondes",13,"Eduardo Henrique",18,"Felipe Bouhid",17,"Marcelo Sant'anna",25,"Jucimar Vieira",45,"Cláudio Naves",43,"Cláudio Naves",50,"Luciano Robervine",53,"Marcelo Sant'anna",57,"Felipe Bouhid",70,280,196,1,"Reila Ricardo",71,307,225,17]
[null,"Reila Ricardo",27,"Marcelo Clemente",4,"Marcelo Chagas",12,"Hélio Chagas",17,"Marcelo Sant'anna",11,"Marcelo Chagas",23,"Andre Resende",39,"Hélio Chagas",43,"Frederico Papatella",49,"Raphael Reis",50,"Cláudio Naves",54,"Cláudio Naves",67,283,199,3,"Leandro Malias",70,308,226,1]
[null,"Renato Amaral",28,"Wesley Canuto",3,"Jucimar Vieira",11,"Jucimar Vieira",15,"Leandro Malias",10,"SSSSS",23,"Hélio Chagas",38,"Tati Marcondes",41,"Renato Amaral",48,"Frederico Papatella",44,"Felipe Bouhid",53,"Lucas Guimarães",59,291,207,8,"Bernardo Freitas",66,312,230,4]
[null,"Rodrigo Mercadante",29,"Eduardo Henrique",0,"Cláudio Naves",11,"Cláudio Naves",14,"Andre Resende",10,"Andre Resende",19,"Tati Marcondes",32,"SSSSS",40,"Leandro Malias",38,"Vitor Gatti",43,"Raphael Reis",50,"Marcelo Sant'anna",57,293,209,2,"Marcelo Sant'anna",57,321,239,9]
[null,"Rodrigo Ricardo",30,"Felipe Bouhid",0,"Bernardo Freitas",5,"Marcelo Sant'anna",11,"SSSSS",8,"Izabella Rodrigues",18,"Leandro Malias",27,"Leandro Malias",38,"Lucca Veloso",33,"Leandro Malias",38,"Luciano Robervine",48,"Leandro Malias",54,296,212,3,"Lucas Guimarães",54,324,242,3]
[null,"Tati Marcondes",31,"Jucimar Vieira",0,"Roberta Epifânio",3,"SSSSS",8,"Cláudio Naves",8,"Leandro Malias",16,"Cláudio Naves",26,"Izabella Rodrigues",24,"Roberta Epifânio",28,"Lucca Veloso",33,"Leandro Malias",38,"Luciano Robervine",43,307,223,11,"Luciano Robervine",38,340,258,16]
["X","Wesley Bambirra",32,"Andre Resende",0,"Pedro Mello",2,"Izabella Rodrigues",6,"Hélio Chagas",4,"Hélio Chagas",14,"Felipe Bouhid",24,"Roberta Epifânio",19,"Izabella Rodrigues",25,"Felipe Bouhid",33,"Lucca Veloso",33,"Roberta Epifânio",34,316,232,9,"Lucca Veloso",34,344,262,4]
[null,"Wesley Camargos",33,"Roberta Epifânio",0,"Eduardo Henrique",1,"Andre Resende",5,"Roberta Epifânio",4,"Cláudio Naves",9,"Lucas Guimarães",22,"Pedro Mello",15,"Vitor Gatti",17,"Bernardo Gatti",32,"Bernardo Gatti",32,"Lucca Veloso",33,317,233,1,"Roberta Epifânio",34,344,262,0]
["X","Wesley Canuto",34,"Pedro Mello",0,"Lucas Guimarães",1,"Roberta Epifânio",4,"Pedro Mello",2,"Roberta Epifânio",5,"Pedro Mello",16,"Wesley Camargos",5,"Pedro Mello",15,"Roberta Epifânio",28,"Roberta Epifânio",23,"Bernardo Gatti",32,318,234,1,"Bernardo Gatti",27,351,269,7]
[null,"Roberta Epifânio",35,"Lucas Guimarães",0,"Andre Resende",0,"Pedro Mello",2,"Wesley Camargos",1,"Pedro Mello",2,"Izabella Rodrigues",13,"Bernardo Gatti",0,"Felipe Bouhid",13,"Izabella Rodrigues",20,"Izabella Rodrigues",15,"Pedro Mello",15,335,251,17,"Pedro Mello",15,363,281,12]
[null,"Jucimar Vieira",36,"Hugo Denucci",0,"Hugo Denucci",0,"Lucas Guimarães",0,"Marcelo Chagas",0,"Lucas Guimarães",0,"Roberta Epifânio",6,"Andre Resende",0,"Andre Resende",11,"Pedro Mello",15,"Pedro Mello",15,"Izabella Rodrigues",10,340,256,5,"Izabella Rodrigues",5,373,291,10]
[null,"Andre Resende",37,"Wesley Camargos",0,"Wesley Camargos",0,"Hugo Denucci",0,"Lucas Guimarães",0,"Wesley Camargos",0,"Wesley Camargos",0,"Felipe Bouhid",0,"Bernardo Gatti",0,"Andre Resende",6,"Andre Resende",1,"Wesley Camargos",1,349,265,9,"Andre Resende",0,378,296,5]
[null,"Izabella Rodrigues",38,"Izabella Rodrigues",0,"Izabella Rodrigues",0,"Wesley Camargos",0,"Hugo Denucci",0,"Hugo Denucci",0,"Hugo Denucci",0,"Hugo Denucci",0,"SSSSS",0,"SSSSS",0,"SSSSS",0,"Andre Resende",0,350,266,1,"SSSSS",0,378,296,0]
[null,"Lucca Veloso",39,null,null,null,null,null,null,null,null,null,null,null,null,"Lucca Veloso",0,"Wesley Camargos",0,"Wesley Camargos",0,"Wesley Camargos",0,"SSSSS",0,350,266,0,"Wesley Camargos",0,378,296,0]
[null,"Gabriel Garabini",40,null,null,null,null,null,null,null,null,null,null,null,null,"Vitor Gatti",0,"Hugo Denucci",0,"Hugo Denucci",0,"Hugo Denucci",0,"Hugo Denucci",0,350,266,0,"Hugo Denucci",0,378,296,0]
[null,"Vitor Gatti",41,null,null,null,null,null,null,null,null,null,null,null,null,null,0,"Gabriel Garabini",0,"Gabriel Garabini",0,"Gabriel Garabini",0,"Gabriel Garabini",0,350,266,0,"Gabriel Garabini",0,378,296,0]
[null,"Bernardo Gatti",42,null,null,null,null,null,null,null,null,null,null,null,null,null,0,null,null,null,null,null,null,null,null,350,266,0,null,null,378,296,0]
[null,null,43,null,null,null,null,null,null,null,null,null,null,null,null,null,null,null,null,null,null,null,null,null,null,350,266,0,null,null,378,296,0]
[null,null,44,null,null,null,null,null,null,null,null,null,null,null,null,null,null,null,null,null,null,null,null,null,null,350,266,0,null,null,378,296,0]
[null,null,45,null,null,null,null,null,null,null,null,null,null,null,null,null,null,null,null,null,null,null,null,null,null,350,266,0,null,null,378,296,0]

{"sheet":"CAMP EQUIPE EVOL","index":1,"n_rows":58,"n_cols":31,"rows_kept":58,"cut":false,"hidden":false,"merged":[[28,0,33,0],[34,0,39,0],[40,0,45,0],[46,0,51,0],[52,0,57,0],[4,0,9,0],[10,0,15,0],[16,0,21,0],[22,0,27,0],[1,21,1,22],[2,5,2,6],[2,7,2,8],[2,9,2,10],[2,21,2,22],[2,11,2,12],[2,13,2,14],[2,15,2,16],[2,17,2,18],[0,30,3,30],[2,19,2,20],[1,1,2,2],[1,3,2,4],[1,5,1,6],[1,7,1,8],[1,9,1,10],[1,11,1,12],[2,26,2,27],[1,26,1,27],[0,24,3,24],[0,25,3,25],[0,26,0,27],[0,28,3,28],[0,29,3,29],[0,21,0,22],[0,23,3,23],[1,13,1,14],[1,15,1,16],[1,17,1,18],[1,19,1,20],[0,11,0,12],[0,13,0,14],[0,15,0,16],[0,17,0,18],[0,19,0,20],[0,1,0,2],[0,3,0,4],[0,5,0,6],[0,7,0,8],[0,9,0,10]]}
[2022,"OK",null,"OK",null,"OK",null,"OK",null,"OK",null,"OK",null,"OK",null,"OK",null,"OK",null,"OK",null,"OK",null,"DIF. LIDER","DIF. 3º","DIF. PRÓXIMO","OK",null,"DIF. LIDER","DIF. 3º","DIF. PRÓXIMO"]
[null,"1ª etapa",null,"2ª etapa",null,"3ª etapa",null,"4ª etapa",null,"5ª etapa",null,"6ª etapa",null,"7ª etapa",null,"8ª etapa",null,"9ª etapa",null,"10ª etapa",null,"11ª etapa",null,null,null,null,"12ª etapa"]
[null,null,null,0,null,"00:00:00",null,"00:00:00",null,"00:00:00",null,"00:00:00",null,"00:00:00",null,"00:00:00",null,"00:00:00",null,"00:00:00",null,"00:00:00",null,null,null,null,"00:00:00"]
["EQUIPES","EQUIPES","Pontuação Geral","EQUIPES","Pontuação Geral","EQUIPES","Pontuação Geral","EQUIPES","Pontuação Geral","EQUIPES","Pontuação Geral","EQUIPES","Pontuação Geral","Posição","Pontos","Posição","Pontos","Posição","Pontos","Posição","Pontos","Posição","Pontos",null,null,null,"Posição","Pontos"]
["1º","Incosel",98,"Incosel",171,"LQN",192,"LQN",200,"LQN",295,"LQN",385,"LQN",483,"LQN",581,"LQN",640,"LQN",720,"LQN",777,"-","-","-","LQN",844,"-","-","-"]
[null,"Rodrigo Mercadante",30,"Rodrigo Mercadante",64,"Alexandre Melillo",34,"Alexandre Melillo",55,"Alexandre Melillo",75,"Alexandre Melillo",116,"Alexandre Melillo",148,"Alexandre Melillo",148,"Alexandre Melillo",170,"Alexandre Melillo",204,"Alexandre Melillo",228,"-","-","-","Alexandre Melillo",228,"-","-","-"]
[null,"Jarbas Reis",32,"Jarbas Reis",64,"Wesley Bambirra",83,"Wesley Bambirra",72,"Wesley Bambirra",117,"Wesley Bambirra",162,"Wesley Bambirra",203,"Wesley Bambirra",244,"Wesley Bambirra",268,"Wesley Bambirra",268,"Wesley Bambirra",296,"-","-","-","Wesley Bambirra",330,"-","-","-"]
[null,"Luciano Robervine",36,"Luciano Robervine",36,"SSSSS",0,"SSSSS",0,"SSSSS",0,"SSSSS",0,"SSSSS",15,"SSSSS",15,"SSSSS",28,"SSSSS",28,"SSSSS",28,"-","-","-","SSSSS",28,"-","-","-"]
[null,"Renato Amaral",0,"Renato Amaral",7,"Marcelo Marcondes",75,"Marcelo Marcondes",73,"Marcelo Marcondes",103,"Marcelo Marcondes",107,"Marcelo Marcondes",117,"Marcelo Marcondes",141,"Marcelo Marcondes",141,"Marcelo Marcondes",187,"Marcelo Marcondes",192,"-","-","-","Marcelo Marcondes",224,"-","-","-"]
[null,"XXXXXXXX",0,"XXXXXXXX",0,"XXXXX",null,"XXXXX",null,"XXXXX",null,"XXXXX",null,"Lucca Veloso",0,"Lucca Veloso",33,"Lucca Veloso",33,"Lucca Veloso",33,"Lucca Veloso",33,"-","-","-","Lucca Veloso",34,"-","-","-"]
["2º","Lider",80,"Clemente Car",165,"Incosel",171,"Incosel",171,"Clemente Car",242,"Clemente Car",313,"Clemente Car",390,"Clemente Car",454,"Clemente Car",500,"Incosel",572,"Incosel",638,{"$f":"W5-W11","v":139},"-",{"$f":"W5-W11","v":139},"Incosel",704,{"$f":"AB5-AB11","v":140},"-",{"$f":"AB5-AB11","v":140}]
[null,"Marcelo Campos",42,"Marcelo Clemente",1,"Rodrigo Mercadante",64,"Rodrigo Mercadante",64,"Marcelo Clemente",18,"Marcelo Clemente",63,"Marcelo Clemente",108,"Marcelo Clemente",130,"Marcelo Clemente",176,"Rodrigo Mercadante",135,"Rodrigo Mercadante",135,"-","-","-","Rodrigo Mercadante",135,"-","-","-"]
[null,"Marcelo Pereira",38,"Cláudio Dumont",69,"Jarbas Reis",64,"Jarbas Reis",64,"Cláudio Dumont",105,"Cláudio Dumont",111,"Cláudio Dumont",111,"Cláudio Dumont",127,"Cláudio Dumont",127,"Jarbas Reis",230,"Jarbas Reis",260,"-","-","-","Jarbas Reis",296,"-","-","-"]
[null,"Wesley Camargos",0,"Frederico Papatella",51,"Luciano Robervine",36,"Luciano Robervine",36,"Frederico Papatella",51,"Frederico Papatella",51,"Frederico Papatella",51,"Frederico Papatella",51,"Frederico Papatella",51,"Luciano Robervine",62,"Luciano Robervine",62,"-","-","-","Luciano Robervine",62,"-","-","-"]
[null,"Hugo Denucci",0,"Maurício Júnior",44,"Renato Amaral",7,"Renato Amaral",7,"Maurício Júnior",68,"Maurício Júnior",88,"Maurício Júnior",120,"Maurício Júnior",146,"Maurício Júnior",146,"Renato Amaral",91,"Renato Amaral",101,"-","-","-","Renato Amaral",101,"-","-","-"]
[null,"X",null,"XXXXXX",0,"XXXXXXXX",0,"XXXXXXXX",0,"XXXXXX",0,"XXXXXX",0,"XXXXXX",0,"XXXXXX",0,"XXXXXX",0,"Vitor Gatti",54,"Vitor Gatti",80,"-","-","-","Vitor Gatti",110,"-","-","-"]
["3º","Clemente Car",80,"LQN",154,"Clemente Car",165,"Clemente Car",165,"Incosel",232,"Lider",294,"Lider",357,"Lider",417,"Lider",500,"Clemente Car",564,"Clemente Car",629,{"$f":"W5-W17","v":148},"-",{"$f":"W11-W17","v":9},"Clemente Car",672,{"$f":"AB5-AB17","v":172},"-",{"$f":"AB11-AB17","v":32}]
[null,"Marcelo Clemente",0,"Alexandre Melillo",42,"Marcelo Clemente",1,"Marcelo Clemente",1,"Rodrigo Mercadante",75,"Marcelo Campos",152,"Marcelo Campos",194,"Marcelo Campos",228,"Marcelo Campos",266,"Marcelo Clemente",176,"Marcelo Clemente",185,"-","-","-","Marcelo Clemente",215,"-","-","-"]
[null,"Cláudio Dumont",28,"Wesley Bambirra",69,"Cláudio Dumont",69,"Cláudio Dumont",69,"Jarbas Reis",100,"Marcelo Pereira",136,"Marcelo Pereira",143,"Marcelo Pereira",169,"Marcelo Pereira",214,"Cláudio Dumont",127,"Cláudio Dumont",127,"-","-","-","Cláudio Dumont",127,"-","-","-"]
[null,"Frederico Papatella",34,"SSSSS",13,"Frederico Papatella",51,"Frederico Papatella",51,"Luciano Robervine",36,"Wesley Camargos",6,"Wesley Camargos",20,"Wesley Camargos",20,"Wesley Camargos",20,"Frederico Papatella",77,"Frederico Papatella",95,"-","-","-","Frederico Papatella",95,"-","-","-"]
[null,"Maurício Júnior",18,"Marcelo Marcondes",30,"Maurício Júnior",44,"Maurício Júnior",44,"Renato Amaral",21,"Hugo Denucci",0,"Hugo Denucci",0,"Hugo Denucci",0,"Hugo Denucci",0,"Maurício Júnior",184,"Maurício Júnior",222,"-","-","-","Maurício Júnior",235,"-","-","-"]
[null,"XXXXXX",0,"XXXXX",null,"XXXXXX",0,"XXXXXX",0,"XXXXXXXX",0,"X",null,"X",null,"X",null,"X",null,"XXXXXX",0,"XXXXXX",0,"-","-","-","XXXXXX",0,"-","-","-"]
["4º","Santiago",60,"Lider",146,"Lider",158,"Lider",158,"Lider",227,"Incosel",292,"Incosel",350,"Incosel",402,"Incosel",490,"Lider",552,"Lider",616,{"$f":"W$5-W23","v":161},{"$f":"W$17-W23","v":13},{"$f":"W17-W23","v":13},"Lider",653,{"$f":"AB$5-AB23","v":191},{"$f":"AB$17-AB23","v":19},{"$f":"AB17-AB23","v":19}]
[null,"Daniel Nahum",45,"Marcelo Campos",70,"Marcelo Campos",78,"Marcelo Campos",78,"Marcelo Campos",123,"Rodrigo Mercadante",75,"Rodrigo Mercadante",105,"Rodrigo Mercadante",135,"Rodrigo Mercadante",135,"Marcelo Campos",300,"Marcelo Campos",346,"-","-","-","Marcelo Campos",378,"-","-","-"]
[null,"Pedro Mello",0,"Marcelo Pereira",76,"Marcelo Pereira",80,"Marcelo Pereira",80,"Marcelo Pereira",98,"Jarbas Reis",122,"Jarbas Reis",150,"Jarbas Reis",172,"Jarbas Reis",200,"Marcelo Pereira",232,"Marcelo Pereira",239,"-","-","-","Marcelo Pereira",244,"-","-","-"]
[null,"Leandro Malias",15,"Wesley Camargos",0,"Wesley Camargos",0,"Wesley Camargos",0,"Wesley Camargos",6,"Luciano Robervine",62,"Luciano Robervine",62,"Luciano Robervine",62,"Luciano Robervine",62,"Wesley Camargos",20,"Wesley Camargos",31,"-","-","-","Wesley Camargos",31,"-","-","-"]
[null,"Lucas Guimarães",0,"Hugo Denucci",0,"Hugo Denucci",0,"Hugo Denucci",0,"Hugo Denucci",0,"Renato Amaral",33,"Renato Amaral",33,"Renato Amaral",33,"Renato Amaral",67,"Hugo Denucci",0,"Hugo Denucci",0,"-","-","-","Hugo Denucci",0,"-","-","-"]
[null,"Roberta Epifânio",0,"X",null,"X",null,"X",null,"X",null,"XXXXXXXX",0,"Vitor Gatti",0,"Vitor Gatti",0,"Vitor Gatti",26,"X",null,"X",null,"-","-","-","X",null,"-","-","-"]
["5º","LQN",59,"Santiago",105,"Alpha",124,"Alpha",124,"Delcar",182,"Delcar",246,"Ventura",299,"Santiago",349,"Delcar",433,"Delcar",459,"Ventura",526,{"$f":"W$5-W29","v":251},{"$f":"W$17-W29","v":103},{"$f":"W23-W29","v":90},"Ventura",607,{"$f":"AB$5-AB29","v":237},{"$f":"AB$17-AB29","v":65},{"$f":"AB23-AB29","v":46}]
[null,"Alexandre Melillo",22,"Daniel Nahum",81,"Guilherme Alves",50,"Guilherme Alves",50,"Bernardo Gatti",88,"Bernardo Gatti",94,"Marcelo Sant'anna",42,"Daniel Nahum",226,"Bernardo Gatti",144,"Bernardo Gatti",144,"Marcelo Sant'anna",56,"-","-","-","Marcelo Sant'anna",56,"-","-","-"]
[null,"Wesley Bambirra",24,"Pedro Mello",0,"Raphael Reis",33,"Raphael Reis",33,"Eduardo Henrique",75,"Eduardo Henrique",111,"Wesley Canuto",130,"Pedro Mello",13,"Eduardo Henrique",172,"Eduardo Henrique",198,"Wesley Canuto",245,"-","-","-","Wesley Canuto",283,"-","-","-"]
[null,"SSSSS",13,"Leandro Malias",21,"Bernardo Freitas",32,"Bernardo Freitas",32,"Felipe Bouhid",12,"Felipe Bouhid",12,"Cláudio Naves",29,"Leandro Malias",31,"Felipe Bouhid",60,"Felipe Bouhid",60,"Cláudio Naves",49,"-","-","-","Cláudio Naves",77,"-","-","-"]
[null,"Marcelo Marcondes",0,"Lucas Guimarães",0,"Hélio Chagas",9,"Hélio Chagas",9,"Reila Ricardo",7,"Reila Ricardo",29,"Marcelo Chagas",98,"Lucas Guimarães",53,"Reila Ricardo",57,"Reila Ricardo",57,"Marcelo Chagas",176,"-","-","-","Marcelo Chagas",191,"-","-","-"]
[null,"XXXXX",null,"Roberta Epifânio",3,"Izabella Rodrigues",0,"Izabella Rodrigues",0,"XXXXXXX",0,"XXXXXXX",0,"XXXX",null,"Roberta Epifânio",26,"XXXXXXX",0,"XXXXXXX",0,"XXXX",null,"-","-","-","XXXX",null,"-","-","-"]
["6º","Alpha",55,"Alpha",94,"Santiago",105,"Delcar",118,"Alpha",172,"Ventura",236,"Delcar",292,"Ventura",345,"Santiago",387,"Ventura",436,"Delcar",510,{"$f":"W$5-W35","v":267},{"$f":"W$17-W35","v":119},{"$f":"W29-W35","v":16},"Delcar",536,{"$f":"AB$5-AB35","v":308},{"$f":"AB$17-AB35","v":136},{"$f":"AB29-AB35","v":71}]
[null,"Guilherme Alves",26,"Guilherme Alves",48,"Daniel Nahum",81,"Bernardo Gatti",62,"Guilherme Alves",72,"Marcelo Sant'anna",42,"Bernardo Gatti",112,"Marcelo Sant'anna",42,"Daniel Nahum",234,"Marcelo Sant'anna",56,"Bernardo Gatti",144,"-","-","-","Bernardo Gatti",144,"-","-","-"]
[null,"Raphael Reis",20,"Raphael Reis",29,"Pedro Mello",0,"Eduardo Henrique",37,"Raphael Reis",33,"Wesley Canuto",102,"Eduardo Henrique",111,"Wesley Canuto",168,"Pedro Mello",13,"Wesley Canuto",209,"Eduardo Henrique",232,"-","-","-","Eduardo Henrique",232,"-","-","-"]
[null,"Bernardo Freitas",0,"Bernardo Freitas",0,"Leandro Malias",21,"Felipe Bouhid",12,"Bernardo Freitas",48,"Cláudio Naves",12,"Felipe Bouhid",27,"Cláudio Naves",29,"Leandro Malias",31,"Cláudio Naves",36,"Felipe Bouhid",77,"-","-","-","Felipe Bouhid",103,"-","-","-"]
[null,"Hélio Chagas",9,"Hélio Chagas",17,"Lucas Guimarães",0,"Reila Ricardo",7,"Hélio Chagas",19,"Marcelo Chagas",80,"Reila Ricardo",42,"Marcelo Chagas",106,"Lucas Guimarães",83,"Marcelo Chagas",135,"Reila Ricardo",57,"-","-","-","Reila Ricardo",57,"-","-","-"]
[null,"Izabella Rodrigues",0,"Izabella Rodrigues",0,"Roberta Epifânio",3,"XXXXXXX",0,"Izabella Rodrigues",0,"XXXX",null,"XXXXXXX",0,"XXXX",null,"Roberta Epifânio",26,"XXXX",null,"XXXXXXX",0,"-","-","-","XXXXXXX",0,"-","-","-"]
["7º","Ventura",33,"Ventura",71,"Delcar",105,"Santiago",106,"Santiago",146,"Alpha",218,"Santiago",282,"Delcar",340,"Ventura",378,"Santiago",423,"Alpha",462,{"$f":"W$5-W41","v":315},{"$f":"W$17-W41","v":167},{"$f":"W35-W41","v":48},"Santiago",521,{"$f":"AB$5-AB41","v":323},{"$f":"AB$17-AB41","v":151},{"$f":"AB35-AB41","v":15}]
[null,"Marcelo Sant'anna",14,"Marcelo Sant'anna",24,"Bernardo Gatti",48,"Daniel Nahum",82,"Daniel Nahum",120,"Guilherme Alves",87,"Daniel Nahum",196,"Bernardo Gatti",112,"Marcelo Sant'anna",56,"Daniel Nahum",270,"Guilherme Alves",226,"-","-","-","Daniel Nahum",352,"-","-","-"]
[null,"Wesley Canuto",0,"Wesley Canuto",24,"Eduardo Henrique",17,"Pedro Mello",0,"Pedro Mello",0,"Raphael Reis",33,"Pedro Mello",13,"Eduardo Henrique",131,"Wesley Canuto",168,"Pedro Mello",13,"Raphael Reis",62,"-","-","-","Pedro Mello",13,"-","-","-"]
[null,"Cláudio Naves",7,"Cláudio Naves",11,"Felipe Bouhid",27,"Leandro Malias",21,"Leandro Malias",21,"Bernardo Freitas",62,"Leandro Malias",31,"Felipe Bouhid",40,"Cláudio Naves",36,"Leandro Malias",31,"Bernardo Freitas",66,"-","-","-","Leandro Malias",47,"-","-","-"]
[null,"Marcelo Chagas",12,"Marcelo Chagas",12,"Reila Ricardo",13,"Lucas Guimarães",0,"Lucas Guimarães",1,"Hélio Chagas",19,"Lucas Guimarães",25,"Reila Ricardo",57,"Marcelo Chagas",118,"Lucas Guimarães",83,"Hélio Chagas",74,"-","-","-","Lucas Guimarães",83,"-","-","-"]
[null,"XXXX",null,"XXXX",null,"XXXXXXX",0,"Roberta Epifânio",3,"Roberta Epifânio",4,"Izabella Rodrigues",17,"Roberta Epifânio",17,"XXXXXXX",0,"XXXX",null,"Roberta Epifânio",26,"Izabella Rodrigues",34,"-","-","-","Roberta Epifânio",26,"-","-","-"]
["8º","Lokamig",25,"Delcar",63,"Ventura",93,"Ventura",93,"Ventura",146,"Santiago",209,"Alpha",273,"Alpha",324,"Alpha",363,"Alpha",398,"Santiago",459,{"$f":"W$5-W47","v":318},{"$f":"W$17-W47","v":170},{"$f":"W41-W47","v":3},"Alpha",502,{"$f":"AB$5-AB47","v":342},{"$f":"AB$17-AB47","v":170},{"$f":"AB41-AB47","v":19}]
[null,"Rodrigo Ricardo",17,"Bernardo Gatti",24,"Marcelo Sant'anna",10,"Marcelo Sant'anna",10,"Marcelo Sant'anna",10,"Daniel Nahum",158,"Guilherme Alves",121,"Guilherme Alves",157,"Guilherme Alves",179,"Guilherme Alves",194,"Daniel Nahum",306,"-","-","-","Guilherme Alves",227,"-","-","-"]
[null,"Tati Marcondes",8,"Eduardo Henrique",0,"Wesley Canuto",44,"Wesley Canuto",44,"Wesley Canuto",68,"Pedro Mello",14,"Raphael Reis",33,"Raphael Reis",33,"Raphael Reis",42,"Raphael Reis",42,"Pedro Mello",13,"-","-","-","Raphael Reis",84,"-","-","-"]
[null,"Jucimar Vieira",0,"Felipe Bouhid",15,"Cláudio Naves",11,"Cláudio Naves",11,"Cláudio Naves",12,"Leandro Malias",32,"Bernardo Freitas",62,"Bernardo Freitas",62,"Bernardo Freitas",62,"Bernardo Freitas",66,"Leandro Malias",31,"-","-","-","Bernardo Freitas",66,"-","-","-"]
[null,"Andre Resende",0,"Reila Ricardo",24,"Marcelo Chagas",28,"Marcelo Chagas",28,"Marcelo Chagas",56,"Lucas Guimarães",1,"Hélio Chagas",24,"Hélio Chagas",38,"Hélio Chagas",46,"Hélio Chagas",62,"Lucas Guimarães",83,"-","-","-","Hélio Chagas",91,"-","-","-"]
[null,"XXXXXXXX",0,"XXXXXXX",0,"XXXX",null,"XXXX",null,"XXXX",null,"Roberta Epifânio",4,"Izabella Rodrigues",33,"Izabella Rodrigues",34,"Izabella Rodrigues",34,"Izabella Rodrigues",34,"Roberta Epifânio",26,"-","-","-","Izabella Rodrigues",34,"-","-","-"]
["9º","Delcar",17,"Lokamig",57,"Lokamig",66,"Lokamig",66,"Lokamig",108,"Lokamig",159,"Lokamig",186,"Lokamig",225,"Lokamig",267,"Lokamig",296,"Lokamig",347,{"$f":"W$5-W53","v":430},{"$f":"W$17-W53","v":282},{"$f":"W47-W53","v":112},"Lokamig",387,{"$f":"AB$5-AB53","v":457},{"$f":"AB$17-AB53","v":285},{"$f":"AB47-AB53","v":115}]
[null,"Bernardo Gatti",6,"Rodrigo Ricardo",33,"Rodrigo Ricardo",34,"Rodrigo Ricardo",34,"Rodrigo Ricardo",51,"Rodrigo Ricardo",69,"Rodrigo Ricardo",80,"Rodrigo Ricardo",96,"Rodrigo Ricardo",120,"Rodrigo Ricardo",142,"Rodrigo Ricardo",164,"-","-","-","Rodrigo Ricardo",184,"-","-","-"]
[null,"Eduardo Henrique",0,"Tati Marcondes",13,"Tati Marcondes",16,"Tati Marcondes",16,"Tati Marcondes",28,"Tati Marcondes",28,"Tati Marcondes",37,"Tati Marcondes",37,"Tati Marcondes",55,"Tati Marcondes",55,"Tati Marcondes",69,"-","-","-","Tati Marcondes",71,"-","-","-"]
[null,"Felipe Bouhid",0,"Jucimar Vieira",11,"Jucimar Vieira",11,"Jucimar Vieira",11,"Jucimar Vieira",24,"Jucimar Vieira",37,"Jucimar Vieira",44,"Jucimar Vieira",56,"Jucimar Vieira",56,"Jucimar Vieira",63,"Jucimar Vieira",78,"-","-","-","Jucimar Vieira",96,"-","-","-"]
[null,"Reila Ricardo",11,"Andre Resende",0,"Andre Resende",5,"Andre Resende",5,"Andre Resende",5,"Andre Resende",25,"Andre Resende",25,"Andre Resende",36,"Andre Resende",36,"Andre Resende",36,"Andre Resende",36,"-","-","-","Andre Resende",36,"-","-","-"]
[null,"XXXXXXX",0,"XXXXXXXX",0,"XXXXXXXX",0,"XXXXXXXX",0,"XXXXXXXX",0,"XXXXXXXX",0,"XXXXXXXX",0,"Gabriel Garabini",0,"Gabriel Garabini",0,"Gabriel Garabini",0,"Gabriel Garabini",0,"-","-","-","Gabriel Garabini",0,"-","-","-"]

{"sheet":"PRESENÇAS","index":2,"n_rows":46,"n_cols":15,"rows_kept":46,"cut":false,"hidden":false,"merged":[]}
["PILOTO","1 ETAPA","2 ETAPA","3 ETAPA","4 ETAPA","5 ETAPA","6 ETAPA","7 ETAPA","8 ETAPA","9 ETAPA","10 ETAPA","11 ETAPA","12 ETAPA","Faltou","PUNIÇÕES"]
["Alexandre Melillo","ok","ok","ok","ok","ok","ok","ok","ok","ok","ok","ok","Faltou",0,{"$f":"COUNTIF(TABELA!$B5:$AY5,\"SIM\")","v":1}]
["Bernardo Freitas","ok","Faltou","ok","ok","ok","ok","Faltou","Faltou","Faltou","Faltou","Faltou","Faltou",4,{"$f":"COUNTIF(TABELA!$B6:$AY6,\"SIM\")","v":1}]
["Cláudio Dumont","ok","ok","ok","ok","ok","Faltou","Faltou","Faltou","Faltou","Faltou","Faltou","Faltou",4,{"$f":"COUNTIF(TABELA!$B7:$AY7,\"SIM\")","v":0}]
["Cláudio Naves","ok","ok","ok","ok","ok","ok","ok","Faltou","Faltou","Faltou","ok","ok",2,{"$f":"COUNTIF(TABELA!$B8:$AY8,\"SIM\")","v":2}]
["Daniel Nahum","ok","ok","ok","ok","ok","ok","ok","ok","ok","ok","ok","ok",0,{"$f":"COUNTIF(TABELA!$B9:$AY9,\"SIM\")","v":0}]
["SSSSS","Faltou","Faltou","Faltou","Faltou","Faltou","Faltou","Faltou","Faltou","Faltou","Faltou","Faltou","Faltou",9,{"$f":"COUNTIF(TABELA!$B10:$AY10,\"SIM\")","v":0}]
["Eduardo Henrique","Faltou","ok","ok","ok","ok","ok","ok","ok","ok","Faltou","ok","Faltou",1,{"$f":"COUNTIF(TABELA!$B11:$AY11,\"SIM\")","v":1}]
["Frederico Papatella","ok","ok","ok","Faltou","Faltou","Faltou","Faltou","Faltou","Faltou","ok","ok","Faltou",6,{"$f":"COUNTIF(TABELA!$B12:$AY12,\"SIM\")","v":1}]
["Guilherme Alves","ok","ok","ok","ok","ok","ok","ok","ok","ok","Faltou","ok","ok",0,{"$f":"COUNTIF(TABELA!$B13:$AY13,\"SIM\")","v":2}]
["Felipe Bouhid","Faltou","Faltou","Faltou","Faltou","Faltou","Faltou","Faltou","ok","ok","ok","ok","ok",7,{"$f":"COUNTIF(TABELA!$B14:$AY14,\"SIM\")","v":0}]
["Hélio Chagas","ok","ok","ok","Faltou","ok","ok","ok","ok","Faltou","ok","ok","ok",2,{"$f":"COUNTIF(TABELA!$B15:$AY15,\"SIM\")","v":1}]
["Hugo Denucci","Faltou","Faltou","Faltou","Faltou","Faltou","Faltou","Faltou","Faltou","Faltou","Faltou","Faltou","Faltou",9,{"$f":"COUNTIF(TABELA!$B16:$AY16,\"SIM\")","v":0}]
["Jarbas Reis","ok","ok","ok","ok","ok","ok","ok","ok","ok","ok","ok","ok",0,{"$f":"COUNTIF(TABELA!$B17:$AY17,\"SIM\")","v":0}]
["Leandro Malias","ok","ok","Faltou","Faltou","Faltou","ok","ok","Faltou","Faltou","Faltou","ok","ok",5,{"$f":"COUNTIF(TABELA!$B18:$AY18,\"SIM\")","v":0}]
["Lucas Guimarães","Faltou","ok","Faltou","ok","ok","Faltou","ok","ok","Faltou","Faltou","Faltou","Faltou",4,{"$f":"COUNTIF(TABELA!$B19:$AY19,\"SIM\")","v":2}]
["Luciano Robervine","ok","ok","ok","ok","Faltou","Faltou","Faltou","Faltou","Faltou","Faltou","Faltou","Faltou",5,{"$f":"COUNTIF(TABELA!$B20:$AY20,\"SIM\")","v":1}]
["Marcelo Campos","ok","ok","ok","ok","ok","ok","ok","ok","ok","ok","ok","ok",0,{"$f":"COUNTIF(TABELA!$B21:$AY21,\"SIM\")","v":0}]
["Marcelo Chagas","ok","ok","ok","Faltou","ok","ok","ok","ok","Faltou","ok","ok","ok",2,{"$f":"COUNTIF(TABELA!$B22:$AY22,\"SIM\")","v":1}]
["Marcelo Clemente","ok","ok","ok","ok","ok","ok","ok","ok","ok","Faltou","ok","ok",0,{"$f":"COUNTIF(TABELA!$B23:$AY23,\"SIM\")","v":1}]
["Marcelo Marcondes","ok","ok","ok","ok","ok","ok","Faltou","ok","ok","ok","ok","ok",1,{"$f":"COUNTIF(TABELA!$B24:$AY24,\"SIM\")","v":2}]
["Marcelo Pereira","ok","ok","ok","ok","ok","Faltou","ok","ok","ok","ok","ok","ok",1,{"$f":"COUNTIF(TABELA!$B25:$AY25,\"SIM\")","v":5}]
["Marcelo Sant'anna","ok","ok","ok","Faltou","Faltou","ok","Faltou","Faltou","Faltou","Faltou","Faltou","Faltou",5,{"$f":"COUNTIF(TABELA!$B26:$AY26,\"SIM\")","v":2}]
["Bernardo Gatti","Faltou","Faltou","Faltou","Faltou","Faltou","Faltou","Faltou","Faltou","ok","Faltou","Faltou","Faltou",9,{"$f":"COUNTIF(TABELA!$B27:$AY27,\"SIM\")","v":0}]
["Maurício Júnior","ok","ok","ok","ok","ok","ok","ok","Faltou","ok","ok","ok","ok",1,{"$f":"COUNTIF(TABELA!$B28:$AY28,\"SIM\")","v":1}]
["Pedro Mello","Faltou","ok","Faltou","Faltou","Faltou","ok","Faltou","Faltou","Faltou","Faltou","Faltou","Faltou",7,{"$f":"COUNTIF(TABELA!$B29:$AY29,\"SIM\")","v":0}]
["Raphael Reis","ok","ok","ok","ok","Faltou","Faltou","Faltou","Faltou","Faltou","Faltou","ok","ok",5,{"$f":"COUNTIF(TABELA!$B30:$AY30,\"SIM\")","v":0}]
["Reila Ricardo","ok","ok","ok","ok","Faltou","ok","Faltou","ok","ok","Faltou","Faltou","Faltou",2,{"$f":"COUNTIF(TABELA!$B31:$AY31,\"SIM\")","v":0}]
["Renato Amaral","ok","ok","ok","ok","ok","Faltou","Faltou","Faltou","ok","ok","ok","Faltou",3,{"$f":"COUNTIF(TABELA!$B32:$AY32,\"SIM\")","v":1}]
["Rodrigo Mercadante","ok","ok","Faltou","Faltou","ok","ok","ok","Faltou","Faltou","Faltou","Faltou","Faltou",4,{"$f":"COUNTIF(TABELA!$B33:$AY33,\"SIM\")","v":1}]
["Rodrigo Ricardo","ok","ok","ok","ok","ok","ok","Faltou","ok","ok","ok","ok","ok",1,{"$f":"COUNTIF(TABELA!$B34:$AY34,\"SIM\")","v":0}]
["Tati Marcondes","ok","ok","ok","ok","ok","ok","Faltou","ok","ok","Faltou","ok","ok",1,{"$f":"COUNTIF(TABELA!$B35:$AY35,\"SIM\")","v":3}]
["Wesley Bambirra","ok","ok","ok","ok","ok","ok","ok","ok","ok","Faltou","ok","ok",0,{"$f":"COUNTIF(TABELA!$B36:$AY36,\"SIM\")","v":0}]
["Wesley Camargos","Faltou","Faltou","Faltou","ok","Faltou","Faltou","ok","Faltou","Faltou","Faltou","ok","Faltou",7,{"$f":"COUNTIF(TABELA!$B37:$AY37,\"SIM\")","v":0}]
["Wesley Canuto","ok","ok","ok","ok","ok","ok","ok","ok","ok","ok","ok","ok",0,{"$f":"COUNTIF(TABELA!$B38:$AY38,\"SIM\")","v":0}]
["Roberta Epifânio","Faltou","ok","ok","ok","Faltou","ok","ok","ok","Faltou","Faltou","ok","Faltou",3,{"$f":"COUNTIF(TABELA!$B39:$AY39,\"SIM\")","v":1}]
["Jucimar Vieira","Faltou","ok","ok","ok","ok","ok","ok","ok","Faltou","ok","ok","ok",2,{"$f":"COUNTIF(TABELA!$B40:$AY40,\"SIM\")","v":1}]
["Andre Resende","Faltou","Faltou","Faltou","Faltou","Faltou","Faltou","Faltou","ok","Faltou","Faltou","Faltou","Faltou",8,{"$f":"COUNTIF(TABELA!$B41:$AY41,\"SIM\")","v":0}]
["Izabella Rodrigues","Faltou","Faltou","ok","ok","Faltou","Faltou","ok","ok","Faltou","Faltou","Faltou","Faltou",5,{"$f":"COUNTIF(TABELA!$B42:$AY42,\"SIM\")","v":1}]
["Lucca Veloso","Faltou","Faltou","Faltou","Faltou","Faltou","Faltou","Faltou","ok","ok","Faltou","Faltou","ok",7,{"$f":"COUNTIF(TABELA!$B43:$AY43,\"SIM\")","v":2}]
["Vitor Gatti","Faltou","Faltou","Faltou","Faltou","Faltou","Faltou","Faltou","ok","ok","ok","ok","ok",7,{"$f":"COUNTIF(TABELA!$B44:$AY44,\"SIM\")","v":0}]
["Gabriel Garabini","Faltou","Faltou","Faltou","Faltou","Faltou","Faltou","Faltou","Faltou","Faltou","Faltou","Faltou","Faltou",9,{"$f":"COUNTIF(TABELA!$B45:$AY45,\"SIM\")","v":0}]
[null,null,null,null,null,null,null,null,null,null,null,null,null,0,{"$f":"COUNTIF(TABELA!$B46:$AY46,\"SIM\")","v":0}]
[null,null,null,null,null,null,null,null,null,null,null,null,null,0,{"$f":"COUNTIF(TABELA!$B47:$AY47,\"SIM\")","v":0}]
[null,null,null,null,null,null,null,null,null,null,null,null,null,0,{"$f":"COUNTIF(TABELA!$B48:$AY48,\"SIM\")","v":0}]
[null,null,null,null,null,null,null,null,null,null,null,null,null,0,{"$f":"COUNTIF(TABELA!$B49:$AY49,\"SIM\")","v":0}]

{"sheet":"TROCA KART","index":3,"n_rows":46,"n_cols":14,"rows_kept":46,"cut":false,"hidden":false,"merged":[]}
["PILOTO","1 ETAPA","2 ETAPA","3 ETAPA","4 ETAPA","5 ETAPA","6 ETAPA","7 ETAPA","8 ETAPA","9 ETAPA","10 ETAPA","11 ETAPA","12 ETAPA","Troca"]
["Alexandre Melillo",{"$f":"IF(ISERROR(VLOOKUP($A2,[1]BD!$E$2:$K$29,7,FALSE)),\"\",IF(VLOOKUP($A2,[1]BD!$E$2:$K$29,7,FALSE)=\"\",\"\",VLOOKUP($A2,[1]BD!$E$2:$K$29,7,FALSE)))","v":"TROCA"},{"$f":"IF(ISERROR(VLOOKUP($A2,[1]BD!$E$30:$K$62,7,FALSE)),\"\",IF(VLOOKUP($A2,[1]BD!$E$30:$K$62,7,FALSE)=\"\",\"\",VLOOKUP($A2,[1]BD!$E$30:$K$62,7,FALSE)))","v":""},{"$f":"IF(ISERROR(VLOOKUP($A2,[1]BD!$E$63:$K$93,7,FALSE)),\"\",IF(VLOOKUP($A2,[1]BD!$E$63:$K$93,7,FALSE)=\"\",\"\",VLOOKUP($A2,[1]BD!$E$63:$K$93,7,FALSE)))","v":""},{"$f":"IF(ISERROR(VLOOKUP($A2,[1]BD!$E$94:$K$124,7,FALSE)),\"\",IF(VLOOKUP($A2,[1]BD!$E$94:$K$124,7,FALSE)=\"\",\"\",VLOOKUP($A2,[1]BD!$E$94:$K$124,7,FALSE)))","v":""},{"$f":"IF(ISERROR(VLOOKUP($A2,[1]BD!$E$125:$K$150,7,FALSE)),\"\",IF(VLOOKUP($A2,[1]BD!$E$125:$K$150,7,FALSE)=\"\",\"\",VLOOKUP($A2,[1]BD!$E$125:$K$150,7,FALSE)))","v":""},{"$f":"IF(ISERROR(VLOOKUP($A2,[1]BD!$E$151:$K$176,7,FALSE)),\"\",IF(VLOOKUP($A2,[1]BD!$E$151:$K$176,7,FALSE)=\"\",\"\",VLOOKUP($A2,[1]BD!$E$151:$K$176,7,FALSE)))","v":""},{"$f":"IF(ISERROR(VLOOKUP($A2,[1]BD!$E$177:$K$197,7,FALSE)),\"\",IF(VLOOKUP($A2,[1]BD!$E$177:$K$197,7,FALSE)=\"\",\"\",VLOOKUP($A2,[1]BD!$E$177:$K$197,7,FALSE)))","v":""},{"$f":"IF(ISERROR(VLOOKUP($A2,[1]BD!$E$198:$K$224,7,FALSE)),\"\",IF(VLOOKUP($A2,[1]BD!$E$198:$K$224,7,FALSE)=\"\",\"\",VLOOKUP($A2,[1]BD!$E$198:$K$224,7,FALSE)))","v":""},{"$f":"IF(ISERROR(VLOOKUP($A2,[1]BD!$E$225:$K$244,7,FALSE)),\"\",IF(VLOOKUP($A2,[1]BD!$E$225:$K$244,7,FALSE)=\"\",\"\",VLOOKUP($A2,[1]BD!$E$225:$K$244,7,FALSE)))","v":""},{"$f":"IF(ISERROR(VLOOKUP($A2,[1]BD!$E$245:$K$260,7,FALSE)),\"\",IF(VLOOKUP($A2,[1]BD!$E$245:$K$260,7,FALSE)=\"\",\"\",VLOOKUP($A2,[1]BD!$E$245:$K$260,7,FALSE)))","v":""},{"$f":"IF(ISERROR(VLOOKUP($A2,[1]BD!$E$261:$K$288,7,FALSE)),\"\",IF(VLOOKUP($A2,[1]BD!$E$261:$K$288,7,FALSE)=\"\",\"\",VLOOKUP($A2,[1]BD!$E$261:$K$288,7,FALSE)))","v":""},{"$f":"IF(ISERROR(VLOOKUP($A2,[1]BD!$E$289:$K$309,7,FALSE)),\"\",IF(VLOOKUP($A2,[1]BD!$E$289:$K$309,7,FALSE)=\"\",\"\",VLOOKUP($A2,[1]BD!$E$289:$K$309,7,FALSE)))","v":""},{"$f":"COUNTIF(B2:M2,$N$1)","v":1}]
["Bernardo Freitas",{"$f":"IF(ISERROR(VLOOKUP($A3,[1]BD!$E$2:$K$29,7,FALSE)),\"\",IF(VLOOKUP($A3,[1]BD!$E$2:$K$29,7,FALSE)=\"\",\"\",VLOOKUP($A3,[1]BD!$E$2:$K$29,7,FALSE)))","v":"TROCA"},{"$f":"IF(ISERROR(VLOOKUP($A3,[1]BD!$E$30:$K$62,7,FALSE)),\"\",IF(VLOOKUP($A3,[1]BD!$E$30:$K$62,7,FALSE)=\"\",\"\",VLOOKUP($A3,[1]BD!$E$30:$K$62,7,FALSE)))","v":""},{"$f":"IF(ISERROR(VLOOKUP($A3,[1]BD!$E$63:$K$93,7,FALSE)),\"\",IF(VLOOKUP($A3,[1]BD!$E$63:$K$93,7,FALSE)=\"\",\"\",VLOOKUP($A3,[1]BD!$E$63:$K$93,7,FALSE)))","v":""},{"$f":"IF(ISERROR(VLOOKUP($A3,[1]BD!$E$94:$K$124,7,FALSE)),\"\",IF(VLOOKUP($A3,[1]BD!$E$94:$K$124,7,FALSE)=\"\",\"\",VLOOKUP($A3,[1]BD!$E$94:$K$124,7,FALSE)))","v":""},{"$f":"IF(ISERROR(VLOOKUP($A3,[1]BD!$E$125:$K$150,7,FALSE)),\"\",IF(VLOOKUP($A3,[1]BD!$E$125:$K$150,7,FALSE)=\"\",\"\",VLOOKUP($A3,[1]BD!$E$125:$K$150,7,FALSE)))","v":""},{"$f":"IF(ISERROR(VLOOKUP($A3,[1]BD!$E$151:$K$176,7,FALSE)),\"\",IF(VLOOKUP($A3,[1]BD!$E$151:$K$176,7,FALSE)=\"\",\"\",VLOOKUP($A3,[1]BD!$E$151:$K$176,7,FALSE)))","v":""},{"$f":"IF(ISERROR(VLOOKUP($A3,[1]BD!$E$177:$K$197,7,FALSE)),\"\",IF(VLOOKUP($A3,[1]BD!$E$177:$K$197,7,FALSE)=\"\",\"\",VLOOKUP($A3,[1]BD!$E$177:$K$197,7,FALSE)))","v":""},{"$f":"IF(ISERROR(VLOOKUP($A3,[1]BD!$E$198:$K$224,7,FALSE)),\"\",IF(VLOOKUP($A3,[1]BD!$E$198:$K$224,7,FALSE)=\"\",\"\",VLOOKUP($A3,[1]BD!$E$198:$K$224,7,FALSE)))","v":""},{"$f":"IF(ISERROR(VLOOKUP($A3,[1]BD!$E$225:$K$244,7,FALSE)),\"\",IF(VLOOKUP($A3,[1]BD!$E$225:$K$244,7,FALSE)=\"\",\"\",VLOOKUP($A3,[1]BD!$E$225:$K$244,7,FALSE)))","v":""},{"$f":"IF(ISERROR(VLOOKUP($A3,[1]BD!$E$245:$K$260,7,FALSE)),\"\",IF(VLOOKUP($A3,[1]BD!$E$245:$K$260,7,FALSE)=\"\",\"\",VLOOKUP($A3,[1]BD!$E$245:$K$260,7,FALSE)))","v":""},{"$f":"IF(ISERROR(VLOOKUP($A3,[1]BD!$E$261:$K$288,7,FALSE)),\"\",IF(VLOOKUP($A3,[1]BD!$E$261:$K$288,7,FALSE)=\"\",\"\",VLOOKUP($A3,[1]BD!$E$261:$K$288,7,FALSE)))","v":""},{"$f":"IF(ISERROR(VLOOKUP($A3,[1]BD!$E$289:$K$309,7,FALSE)),\"\",IF(VLOOKUP($A3,[1]BD!$E$289:$K$309,7,FALSE)=\"\",\"\",VLOOKUP($A3,[1]BD!$E$289:$K$309,7,FALSE)))","v":""},1]
["Cláudio Dumont",{"$f":"IF(ISERROR(VLOOKUP($A4,[1]BD!$E$2:$K$29,7,FALSE)),\"\",IF(VLOOKUP($A4,[1]BD!$E$2:$K$29,7,FALSE)=\"\",\"\",VLOOKUP($A4,[1]BD!$E$2:$K$29,7,FALSE)))","v":"TROCA"},{"$f":"IF(ISERROR(VLOOKUP($A4,[1]BD!$E$30:$K$62,7,FALSE)),\"\",IF(VLOOKUP($A4,[1]BD!$E$30:$K$62,7,FALSE)=\"\",\"\",VLOOKUP($A4,[1]BD!$E$30:$K$62,7,FALSE)))","v":""},{"$f":"IF(ISERROR(VLOOKUP($A4,[1]BD!$E$63:$K$93,7,FALSE)),\"\",IF(VLOOKUP($A4,[1]BD!$E$63:$K$93,7,FALSE)=\"\",\"\",VLOOKUP($A4,[1]BD!$E$63:$K$93,7,FALSE)))","v":""},{"$f":"IF(ISERROR(VLOOKUP($A4,[1]BD!$E$94:$K$124,7,FALSE)),\"\",IF(VLOOKUP($A4,[1]BD!$E$94:$K$124,7,FALSE)=\"\",\"\",VLOOKUP($A4,[1]BD!$E$94:$K$124,7,FALSE)))","v":""},{"$f":"IF(ISERROR(VLOOKUP($A4,[1]BD!$E$125:$K$150,7,FALSE)),\"\",IF(VLOOKUP($A4,[1]BD!$E$125:$K$150,7,FALSE)=\"\",\"\",VLOOKUP($A4,[1]BD!$E$125:$K$150,7,FALSE)))","v":"TROCA"},{"$f":"IF(ISERROR(VLOOKUP($A4,[1]BD!$E$151:$K$176,7,FALSE)),\"\",IF(VLOOKUP($A4,[1]BD!$E$151:$K$176,7,FALSE)=\"\",\"\",VLOOKUP($A4,[1]BD!$E$151:$K$176,7,FALSE)))","v":""},{"$f":"IF(ISERROR(VLOOKUP($A4,[1]BD!$E$177:$K$197,7,FALSE)),\"\",IF(VLOOKUP($A4,[1]BD!$E$177:$K$197,7,FALSE)=\"\",\"\",VLOOKUP($A4,[1]BD!$E$177:$K$197,7,FALSE)))","v":""},{"$f":"IF(ISERROR(VLOOKUP($A4,[1]BD!$E$198:$K$224,7,FALSE)),\"\",IF(VLOOKUP($A4,[1]BD!$E$198:$K$224,7,FALSE)=\"\",\"\",VLOOKUP($A4,[1]BD!$E$198:$K$224,7,FALSE)))","v":""},{"$f":"IF(ISERROR(VLOOKUP($A4,[1]BD!$E$225:$K$244,7,FALSE)),\"\",IF(VLOOKUP($A4,[1]BD!$E$225:$K$244,7,FALSE)=\"\",\"\",VLOOKUP($A4,[1]BD!$E$225:$K$244,7,FALSE)))","v":""},{"$f":"IF(ISERROR(VLOOKUP($A4,[1]BD!$E$245:$K$260,7,FALSE)),\"\",IF(VLOOKUP($A4,[1]BD!$E$245:$K$260,7,FALSE)=\"\",\"\",VLOOKUP($A4,[1]BD!$E$245:$K$260,7,FALSE)))","v":""},{"$f":"IF(ISERROR(VLOOKUP($A4,[1]BD!$E$261:$K$288,7,FALSE)),\"\",IF(VLOOKUP($A4,[1]BD!$E$261:$K$288,7,FALSE)=\"\",\"\",VLOOKUP($A4,[1]BD!$E$261:$K$288,7,FALSE)))","v":""},{"$f":"IF(ISERROR(VLOOKUP($A4,[1]BD!$E$289:$K$309,7,FALSE)),\"\",IF(VLOOKUP($A4,[1]BD!$E$289:$K$309,7,FALSE)=\"\",\"\",VLOOKUP($A4,[1]BD!$E$289:$K$309,7,FALSE)))","v":""},2]
["Cláudio Naves",{"$f":"IF(ISERROR(VLOOKUP($A5,[1]BD!$E$2:$K$29,7,FALSE)),\"\",IF(VLOOKUP($A5,[1]BD!$E$2:$K$29,7,FALSE)=\"\",\"\",VLOOKUP($A5,[1]BD!$E$2:$K$29,7,FALSE)))","v":""},{"$f":"IF(ISERROR(VLOOKUP($A5,[1]BD!$E$30:$K$62,7,FALSE)),\"\",IF(VLOOKUP($A5,[1]BD!$E$30:$K$62,7,FALSE)=\"\",\"\",VLOOKUP($A5,[1]BD!$E$30:$K$62,7,FALSE)))","v":""},{"$f":"IF(ISERROR(VLOOKUP($A5,[1]BD!$E$63:$K$93,7,FALSE)),\"\",IF(VLOOKUP($A5,[1]BD!$E$63:$K$93,7,FALSE)=\"\",\"\",VLOOKUP($A5,[1]BD!$E$63:$K$93,7,FALSE)))","v":""},{"$f":"IF(ISERROR(VLOOKUP($A5,[1]BD!$E$94:$K$124,7,FALSE)),\"\",IF(VLOOKUP($A5,[1]BD!$E$94:$K$124,7,FALSE)=\"\",\"\",VLOOKUP($A5,[1]BD!$E$94:$K$124,7,FALSE)))","v":""},{"$f":"IF(ISERROR(VLOOKUP($A5,[1]BD!$E$125:$K$150,7,FALSE)),\"\",IF(VLOOKUP($A5,[1]BD!$E$125:$K$150,7,FALSE)=\"\",\"\",VLOOKUP($A5,[1]BD!$E$125:$K$150,7,FALSE)))","v":"TROCA"},{"$f":"IF(ISERROR(VLOOKUP($A5,[1]BD!$E$151:$K$176,7,FALSE)),\"\",IF(VLOOKUP($A5,[1]BD!$E$151:$K$176,7,FALSE)=\"\",\"\",VLOOKUP($A5,[1]BD!$E$151:$K$176,7,FALSE)))","v":""},{"$f":"IF(ISERROR(VLOOKUP($A5,[1]BD!$E$177:$K$197,7,FALSE)),\"\",IF(VLOOKUP($A5,[1]BD!$E$177:$K$197,7,FALSE)=\"\",\"\",VLOOKUP($A5,[1]BD!$E$177:$K$197,7,FALSE)))","v":""},{"$f":"IF(ISERROR(VLOOKUP($A5,[1]BD!$E$198:$K$224,7,FALSE)),\"\",IF(VLOOKUP($A5,[1]BD!$E$198:$K$224,7,FALSE)=\"\",\"\",VLOOKUP($A5,[1]BD!$E$198:$K$224,7,FALSE)))","v":""},{"$f":"IF(ISERROR(VLOOKUP($A5,[1]BD!$E$225:$K$244,7,FALSE)),\"\",IF(VLOOKUP($A5,[1]BD!$E$225:$K$244,7,FALSE)=\"\",\"\",VLOOKUP($A5,[1]BD!$E$225:$K$244,7,FALSE)))","v":""},{"$f":"IF(ISERROR(VLOOKUP($A5,[1]BD!$E$245:$K$260,7,FALSE)),\"\",IF(VLOOKUP($A5,[1]BD!$E$245:$K$260,7,FALSE)=\"\",\"\",VLOOKUP($A5,[1]BD!$E$245:$K$260,7,FALSE)))","v":""},{"$f":"IF(ISERROR(VLOOKUP($A5,[1]BD!$E$261:$K$288,7,FALSE)),\"\",IF(VLOOKUP($A5,[1]BD!$E$261:$K$288,7,FALSE)=\"\",\"\",VLOOKUP($A5,[1]BD!$E$261:$K$288,7,FALSE)))","v":""},{"$f":"IF(ISERROR(VLOOKUP($A5,[1]BD!$E$289:$K$309,7,FALSE)),\"\",IF(VLOOKUP($A5,[1]BD!$E$289:$K$309,7,FALSE)=\"\",\"\",VLOOKUP($A5,[1]BD!$E$289:$K$309,7,FALSE)))","v":"TROCA"},2]
["Daniel Nahum",{"$f":"IF(ISERROR(VLOOKUP($A6,[1]BD!$E$2:$K$29,7,FALSE)),\"\",IF(VLOOKUP($A6,[1]BD!$E$2:$K$29,7,FALSE)=\"\",\"\",VLOOKUP($A6,[1]BD!$E$2:$K$29,7,FALSE)))","v":""},{"$f":"IF(ISERROR(VLOOKUP($A6,[1]BD!$E$30:$K$62,7,FALSE)),\"\",IF(VLOOKUP($A6,[1]BD!$E$30:$K$62,7,FALSE)=\"\",\"\",VLOOKUP($A6,[1]BD!$E$30:$K$62,7,FALSE)))","v":""},{"$f":"IF(ISERROR(VLOOKUP($A6,[1]BD!$E$63:$K$93,7,FALSE)),\"\",IF(VLOOKUP($A6,[1]BD!$E$63:$K$93,7,FALSE)=\"\",\"\",VLOOKUP($A6,[1]BD!$E$63:$K$93,7,FALSE)))","v":""},{"$f":"IF(ISERROR(VLOOKUP($A6,[1]BD!$E$94:$K$124,7,FALSE)),\"\",IF(VLOOKUP($A6,[1]BD!$E$94:$K$124,7,FALSE)=\"\",\"\",VLOOKUP($A6,[1]BD!$E$94:$K$124,7,FALSE)))","v":""},{"$f":"IF(ISERROR(VLOOKUP($A6,[1]BD!$E$125:$K$150,7,FALSE)),\"\",IF(VLOOKUP($A6,[1]BD!$E$125:$K$150,7,FALSE)=\"\",\"\",VLOOKUP($A6,[1]BD!$E$125:$K$150,7,FALSE)))","v":"TROCA"},{"$f":"IF(ISERROR(VLOOKUP($A6,[1]BD!$E$151:$K$176,7,FALSE)),\"\",IF(VLOOKUP($A6,[1]BD!$E$151:$K$176,7,FALSE)=\"\",\"\",VLOOKUP($A6,[1]BD!$E$151:$K$176,7,FALSE)))","v":""},{"$f":"IF(ISERROR(VLOOKUP($A6,[1]BD!$E$177:$K$197,7,FALSE)),\"\",IF(VLOOKUP($A6,[1]BD!$E$177:$K$197,7,FALSE)=\"\",\"\",VLOOKUP($A6,[1]BD!$E$177:$K$197,7,FALSE)))","v":""},{"$f":"IF(ISERROR(VLOOKUP($A6,[1]BD!$E$198:$K$224,7,FALSE)),\"\",IF(VLOOKUP($A6,[1]BD!$E$198:$K$224,7,FALSE)=\"\",\"\",VLOOKUP($A6,[1]BD!$E$198:$K$224,7,FALSE)))","v":""},{"$f":"IF(ISERROR(VLOOKUP($A6,[1]BD!$E$225:$K$244,7,FALSE)),\"\",IF(VLOOKUP($A6,[1]BD!$E$225:$K$244,7,FALSE)=\"\",\"\",VLOOKUP($A6,[1]BD!$E$225:$K$244,7,FALSE)))","v":""},{"$f":"IF(ISERROR(VLOOKUP($A6,[1]BD!$E$245:$K$260,7,FALSE)),\"\",IF(VLOOKUP($A6,[1]BD!$E$245:$K$260,7,FALSE)=\"\",\"\",VLOOKUP($A6,[1]BD!$E$245:$K$260,7,FALSE)))","v":""},{"$f":"IF(ISERROR(VLOOKUP($A6,[1]BD!$E$261:$K$288,7,FALSE)),\"\",IF(VLOOKUP($A6,[1]BD!$E$261:$K$288,7,FALSE)=\"\",\"\",VLOOKUP($A6,[1]BD!$E$261:$K$288,7,FALSE)))","v":""},{"$f":"IF(ISERROR(VLOOKUP($A6,[1]BD!$E$289:$K$309,7,FALSE)),\"\",IF(VLOOKUP($A6,[1]BD!$E$289:$K$309,7,FALSE)=\"\",\"\",VLOOKUP($A6,[1]BD!$E$289:$K$309,7,FALSE)))","v":""},1]
["SSSSS",{"$f":"IF(ISERROR(VLOOKUP($A7,[1]BD!$E$2:$K$29,7,FALSE)),\"\",IF(VLOOKUP($A7,[1]BD!$E$2:$K$29,7,FALSE)=\"\",\"\",VLOOKUP($A7,[1]BD!$E$2:$K$29,7,FALSE)))","v":""},{"$f":"IF(ISERROR(VLOOKUP($A7,[1]BD!$E$30:$K$62,7,FALSE)),\"\",IF(VLOOKUP($A7,[1]BD!$E$30:$K$62,7,FALSE)=\"\",\"\",VLOOKUP($A7,[1]BD!$E$30:$K$62,7,FALSE)))","v":""},{"$f":"IF(ISERROR(VLOOKUP($A7,[1]BD!$E$63:$K$93,7,FALSE)),\"\",IF(VLOOKUP($A7,[1]BD!$E$63:$K$93,7,FALSE)=\"\",\"\",VLOOKUP($A7,[1]BD!$E$63:$K$93,7,FALSE)))","v":""},{"$f":"IF(ISERROR(VLOOKUP($A7,[1]BD!$E$94:$K$124,7,FALSE)),\"\",IF(VLOOKUP($A7,[1]BD!$E$94:$K$124,7,FALSE)=\"\",\"\",VLOOKUP($A7,[1]BD!$E$94:$K$124,7,FALSE)))","v":""},{"$f":"IF(ISERROR(VLOOKUP($A7,[1]BD!$E$125:$K$150,7,FALSE)),\"\",IF(VLOOKUP($A7,[1]BD!$E$125:$K$150,7,FALSE)=\"\",\"\",VLOOKUP($A7,[1]BD!$E$125:$K$150,7,FALSE)))","v":""},{"$f":"IF(ISERROR(VLOOKUP($A7,[1]BD!$E$151:$K$176,7,FALSE)),\"\",IF(VLOOKUP($A7,[1]BD!$E$151:$K$176,7,FALSE)=\"\",\"\",VLOOKUP($A7,[1]BD!$E$151:$K$176,7,FALSE)))","v":""},{"$f":"IF(ISERROR(VLOOKUP($A7,[1]BD!$E$177:$K$197,7,FALSE)),\"\",IF(VLOOKUP($A7,[1]BD!$E$177:$K$197,7,FALSE)=\"\",\"\",VLOOKUP($A7,[1]BD!$E$177:$K$197,7,FALSE)))","v":""},{"$f":"IF(ISERROR(VLOOKUP($A7,[1]BD!$E$198:$K$224,7,FALSE)),\"\",IF(VLOOKUP($A7,[1]BD!$E$198:$K$224,7,FALSE)=\"\",\"\",VLOOKUP($A7,[1]BD!$E$198:$K$224,7,FALSE)))","v":""},{"$f":"IF(ISERROR(VLOOKUP($A7,[1]BD!$E$225:$K$244,7,FALSE)),\"\",IF(VLOOKUP($A7,[1]BD!$E$225:$K$244,7,FALSE)=\"\",\"\",VLOOKUP($A7,[1]BD!$E$225:$K$244,7,FALSE)))","v":""},{"$f":"IF(ISERROR(VLOOKUP($A7,[1]BD!$E$245:$K$260,7,FALSE)),\"\",IF(VLOOKUP($A7,[1]BD!$E$245:$K$260,7,FALSE)=\"\",\"\",VLOOKUP($A7,[1]BD!$E$245:$K$260,7,FALSE)))","v":""},{"$f":"IF(ISERROR(VLOOKUP($A7,[1]BD!$E$261:$K$288,7,FALSE)),\"\",IF(VLOOKUP($A7,[1]BD!$E$261:$K$288,7,FALSE)=\"\",\"\",VLOOKUP($A7,[1]BD!$E$261:$K$288,7,FALSE)))","v":""},{"$f":"IF(ISERROR(VLOOKUP($A7,[1]BD!$E$289:$K$309,7,FALSE)),\"\",IF(VLOOKUP($A7,[1]BD!$E$289:$K$309,7,FALSE)=\"\",\"\",VLOOKUP($A7,[1]BD!$E$289:$K$309,7,FALSE)))","v":""},0]
["Eduardo Henrique",{"$f":"IF(ISERROR(VLOOKUP($A8,[1]BD!$E$2:$K$29,7,FALSE)),\"\",IF(VLOOKUP($A8,[1]BD!$E$2:$K$29,7,FALSE)=\"\",\"\",VLOOKUP($A8,[1]BD!$E$2:$K$29,7,FALSE)))","v":""},{"$f":"IF(ISERROR(VLOOKUP($A8,[1]BD!$E$30:$K$62,7,FALSE)),\"\",IF(VLOOKUP($A8,[1]BD!$E$30:$K$62,7,FALSE)=\"\",\"\",VLOOKUP($A8,[1]BD!$E$30:$K$62,7,FALSE)))","v":""},{"$f":"IF(ISERROR(VLOOKUP($A8,[1]BD!$E$63:$K$93,7,FALSE)),\"\",IF(VLOOKUP($A8,[1]BD!$E$63:$K$93,7,FALSE)=\"\",\"\",VLOOKUP($A8,[1]BD!$E$63:$K$93,7,FALSE)))","v":""},{"$f":"IF(ISERROR(VLOOKUP($A8,[1]BD!$E$94:$K$124,7,FALSE)),\"\",IF(VLOOKUP($A8,[1]BD!$E$94:$K$124,7,FALSE)=\"\",\"\",VLOOKUP($A8,[1]BD!$E$94:$K$124,7,FALSE)))","v":""},{"$f":"IF(ISERROR(VLOOKUP($A8,[1]BD!$E$125:$K$150,7,FALSE)),\"\",IF(VLOOKUP($A8,[1]BD!$E$125:$K$150,7,FALSE)=\"\",\"\",VLOOKUP($A8,[1]BD!$E$125:$K$150,7,FALSE)))","v":""},{"$f":"IF(ISERROR(VLOOKUP($A8,[1]BD!$E$151:$K$176,7,FALSE)),\"\",IF(VLOOKUP($A8,[1]BD!$E$151:$K$176,7,FALSE)=\"\",\"\",VLOOKUP($A8,[1]BD!$E$151:$K$176,7,FALSE)))","v":""},{"$f":"IF(ISERROR(VLOOKUP($A8,[1]BD!$E$177:$K$197,7,FALSE)),\"\",IF(VLOOKUP($A8,[1]BD!$E$177:$K$197,7,FALSE)=\"\",\"\",VLOOKUP($A8,[1]BD!$E$177:$K$197,7,FALSE)))","v":""},{"$f":"IF(ISERROR(VLOOKUP($A8,[1]BD!$E$198:$K$224,7,FALSE)),\"\",IF(VLOOKUP($A8,[1]BD!$E$198:$K$224,7,FALSE)=\"\",\"\",VLOOKUP($A8,[1]BD!$E$198:$K$224,7,FALSE)))","v":""},{"$f":"IF(ISERROR(VLOOKUP($A8,[1]BD!$E$225:$K$244,7,FALSE)),\"\",IF(VLOOKUP($A8,[1]BD!$E$225:$K$244,7,FALSE)=\"\",\"\",VLOOKUP($A8,[1]BD!$E$225:$K$244,7,FALSE)))","v":""},{"$f":"IF(ISERROR(VLOOKUP($A8,[1]BD!$E$245:$K$260,7,FALSE)),\"\",IF(VLOOKUP($A8,[1]BD!$E$245:$K$260,7,FALSE)=\"\",\"\",VLOOKUP($A8,[1]BD!$E$245:$K$260,7,FALSE)))","v":""},{"$f":"IF(ISERROR(VLOOKUP($A8,[1]BD!$E$261:$K$288,7,FALSE)),\"\",IF(VLOOKUP($A8,[1]BD!$E$261:$K$288,7,FALSE)=\"\",\"\",VLOOKUP($A8,[1]BD!$E$261:$K$288,7,FALSE)))","v":""},{"$f":"IF(ISERROR(VLOOKUP($A8,[1]BD!$E$289:$K$309,7,FALSE)),\"\",IF(VLOOKUP($A8,[1]BD!$E$289:$K$309,7,FALSE)=\"\",\"\",VLOOKUP($A8,[1]BD!$E$289:$K$309,7,FALSE)))","v":""},0]
["Frederico Papatella",{"$f":"IF(ISERROR(VLOOKUP($A9,[1]BD!$E$2:$K$29,7,FALSE)),\"\",IF(VLOOKUP($A9,[1]BD!$E$2:$K$29,7,FALSE)=\"\",\"\",VLOOKUP($A9,[1]BD!$E$2:$K$29,7,FALSE)))","v":"TROCA"},{"$f":"IF(ISERROR(VLOOKUP($A9,[1]BD!$E$30:$K$62,7,FALSE)),\"\",IF(VLOOKUP($A9,[1]BD!$E$30:$K$62,7,FALSE)=\"\",\"\",VLOOKUP($A9,[1]BD!$E$30:$K$62,7,FALSE)))","v":""},{"$f":"IF(ISERROR(VLOOKUP($A9,[1]BD!$E$63:$K$93,7,FALSE)),\"\",IF(VLOOKUP($A9,[1]BD!$E$63:$K$93,7,FALSE)=\"\",\"\",VLOOKUP($A9,[1]BD!$E$63:$K$93,7,FALSE)))","v":""},{"$f":"IF(ISERROR(VLOOKUP($A9,[1]BD!$E$94:$K$124,7,FALSE)),\"\",IF(VLOOKUP($A9,[1]BD!$E$94:$K$124,7,FALSE)=\"\",\"\",VLOOKUP($A9,[1]BD!$E$94:$K$124,7,FALSE)))","v":""},{"$f":"IF(ISERROR(VLOOKUP($A9,[1]BD!$E$125:$K$150,7,FALSE)),\"\",IF(VLOOKUP($A9,[1]BD!$E$125:$K$150,7,FALSE)=\"\",\"\",VLOOKUP($A9,[1]BD!$E$125:$K$150,7,FALSE)))","v":""},{"$f":"IF(ISERROR(VLOOKUP($A9,[1]BD!$E$151:$K$176,7,FALSE)),\"\",IF(VLOOKUP($A9,[1]BD!$E$151:$K$176,7,FALSE)=\"\",\"\",VLOOKUP($A9,[1]BD!$E$151:$K$176,7,FALSE)))","v":""},{"$f":"IF(ISERROR(VLOOKUP($A9,[1]BD!$E$177:$K$197,7,FALSE)),\"\",IF(VLOOKUP($A9,[1]BD!$E$177:$K$197,7,FALSE)=\"\",\"\",VLOOKUP($A9,[1]BD!$E$177:$K$197,7,FALSE)))","v":""},{"$f":"IF(ISERROR(VLOOKUP($A9,[1]BD!$E$198:$K$224,7,FALSE)),\"\",IF(VLOOKUP($A9,[1]BD!$E$198:$K$224,7,FALSE)=\"\",\"\",VLOOKUP($A9,[1]BD!$E$198:$K$224,7,FALSE)))","v":""},{"$f":"IF(ISERROR(VLOOKUP($A9,[1]BD!$E$225:$K$244,7,FALSE)),\"\",IF(VLOOKUP($A9,[1]BD!$E$225:$K$244,7,FALSE)=\"\",\"\",VLOOKUP($A9,[1]BD!$E$225:$K$244,7,FALSE)))","v":""},{"$f":"IF(ISERROR(VLOOKUP($A9,[1]BD!$E$245:$K$260,7,FALSE)),\"\",IF(VLOOKUP($A9,[1]BD!$E$245:$K$260,7,FALSE)=\"\",\"\",VLOOKUP($A9,[1]BD!$E$245:$K$260,7,FALSE)))","v":""},{"$f":"IF(ISERROR(VLOOKUP($A9,[1]BD!$E$261:$K$288,7,FALSE)),\"\",IF(VLOOKUP($A9,[1]BD!$E$261:$K$288,7,FALSE)=\"\",\"\",VLOOKUP($A9,[1]BD!$E$261:$K$288,7,FALSE)))","v":"TROCA"},{"$f":"IF(ISERROR(VLOOKUP($A9,[1]BD!$E$289:$K$309,7,FALSE)),\"\",IF(VLOOKUP($A9,[1]BD!$E$289:$K$309,7,FALSE)=\"\",\"\",VLOOKUP($A9,[1]BD!$E$289:$K$309,7,FALSE)))","v":""},2]
["Guilherme Alves",{"$f":"IF(ISERROR(VLOOKUP($A10,[1]BD!$E$2:$K$29,7,FALSE)),\"\",IF(VLOOKUP($A10,[1]BD!$E$2:$K$29,7,FALSE)=\"\",\"\",VLOOKUP($A10,[1]BD!$E$2:$K$29,7,FALSE)))","v":""},{"$f":"IF(ISERROR(VLOOKUP($A10,[1]BD!$E$30:$K$62,7,FALSE)),\"\",IF(VLOOKUP($A10,[1]BD!$E$30:$K$62,7,FALSE)=\"\",\"\",VLOOKUP($A10,[1]BD!$E$30:$K$62,7,FALSE)))","v":""},{"$f":"IF(ISERROR(VLOOKUP($A10,[1]BD!$E$63:$K$93,7,FALSE)),\"\",IF(VLOOKUP($A10,[1]BD!$E$63:$K$93,7,FALSE)=\"\",\"\",VLOOKUP($A10,[1]BD!$E$63:$K$93,7,FALSE)))","v":"TROCA"},{"$f":"IF(ISERROR(VLOOKUP($A10,[1]BD!$E$94:$K$124,7,FALSE)),\"\",IF(VLOOKUP($A10,[1]BD!$E$94:$K$124,7,FALSE)=\"\",\"\",VLOOKUP($A10,[1]BD!$E$94:$K$124,7,FALSE)))","v":"TROCA"},{"$f":"IF(ISERROR(VLOOKUP($A10,[1]BD!$E$125:$K$150,7,FALSE)),\"\",IF(VLOOKUP($A10,[1]BD!$E$125:$K$150,7,FALSE)=\"\",\"\",VLOOKUP($A10,[1]BD!$E$125:$K$150,7,FALSE)))","v":""},{"$f":"IF(ISERROR(VLOOKUP($A10,[1]BD!$E$151:$K$176,7,FALSE)),\"\",IF(VLOOKUP($A10,[1]BD!$E$151:$K$176,7,FALSE)=\"\",\"\",VLOOKUP($A10,[1]BD!$E$151:$K$176,7,FALSE)))","v":""},{"$f":"IF(ISERROR(VLOOKUP($A10,[1]BD!$E$177:$K$197,7,FALSE)),\"\",IF(VLOOKUP($A10,[1]BD!$E$177:$K$197,7,FALSE)=\"\",\"\",VLOOKUP($A10,[1]BD!$E$177:$K$197,7,FALSE)))","v":""},{"$f":"IF(ISERROR(VLOOKUP($A10,[1]BD!$E$198:$K$224,7,FALSE)),\"\",IF(VLOOKUP($A10,[1]BD!$E$198:$K$224,7,FALSE)=\"\",\"\",VLOOKUP($A10,[1]BD!$E$198:$K$224,7,FALSE)))","v":""},{"$f":"IF(ISERROR(VLOOKUP($A10,[1]BD!$E$225:$K$244,7,FALSE)),\"\",IF(VLOOKUP($A10,[1]BD!$E$225:$K$244,7,FALSE)=\"\",\"\",VLOOKUP($A10,[1]BD!$E$225:$K$244,7,FALSE)))","v":""},{"$f":"IF(ISERROR(VLOOKUP($A10,[1]BD!$E$245:$K$260,7,FALSE)),\"\",IF(VLOOKUP($A10,[1]BD!$E$245:$K$260,7,FALSE)=\"\",\"\",VLOOKUP($A10,[1]BD!$E$245:$K$260,7,FALSE)))","v":""},{"$f":"IF(ISERROR(VLOOKUP($A10,[1]BD!$E$261:$K$288,7,FALSE)),\"\",IF(VLOOKUP($A10,[1]BD!$E$261:$K$288,7,FALSE)=\"\",\"\",VLOOKUP($A10,[1]BD!$E$261:$K$288,7,FALSE)))","v":""},{"$f":"IF(ISERROR(VLOOKUP($A10,[1]BD!$E$289:$K$309,7,FALSE)),\"\",IF(VLOOKUP($A10,[1]BD!$E$289:$K$309,7,FALSE)=\"\",\"\",VLOOKUP($A10,[1]BD!$E$289:$K$309,7,FALSE)))","v":""},2]
["Felipe Bouhid",{"$f":"IF(ISERROR(VLOOKUP($A11,[1]BD!$E$2:$K$29,7,FALSE)),\"\",IF(VLOOKUP($A11,[1]BD!$E$2:$K$29,7,FALSE)=\"\",\"\",VLOOKUP($A11,[1]BD!$E$2:$K$29,7,FALSE)))","v":""},{"$f":"IF(ISERROR(VLOOKUP($A11,[1]BD!$E$30:$K$62,7,FALSE)),\"\",IF(VLOOKUP($A11,[1]BD!$E$30:$K$62,7,FALSE)=\"\",\"\",VLOOKUP($A11,[1]BD!$E$30:$K$62,7,FALSE)))","v":""},{"$f":"IF(ISERROR(VLOOKUP($A11,[1]BD!$E$63:$K$93,7,FALSE)),\"\",IF(VLOOKUP($A11,[1]BD!$E$63:$K$93,7,FALSE)=\"\",\"\",VLOOKUP($A11,[1]BD!$E$63:$K$93,7,FALSE)))","v":""},{"$f":"IF(ISERROR(VLOOKUP($A11,[1]BD!$E$94:$K$124,7,FALSE)),\"\",IF(VLOOKUP($A11,[1]BD!$E$94:$K$124,7,FALSE)=\"\",\"\",VLOOKUP($A11,[1]BD!$E$94:$K$124,7,FALSE)))","v":""},{"$f":"IF(ISERROR(VLOOKUP($A11,[1]BD!$E$125:$K$150,7,FALSE)),\"\",IF(VLOOKUP($A11,[1]BD!$E$125:$K$150,7,FALSE)=\"\",\"\",VLOOKUP($A11,[1]BD!$E$125:$K$150,7,FALSE)))","v":""},{"$f":"IF(ISERROR(VLOOKUP($A11,[1]BD!$E$151:$K$176,7,FALSE)),\"\",IF(VLOOKUP($A11,[1]BD!$E$151:$K$176,7,FALSE)=\"\",\"\",VLOOKUP($A11,[1]BD!$E$151:$K$176,7,FALSE)))","v":""},{"$f":"IF(ISERROR(VLOOKUP($A11,[1]BD!$E$177:$K$197,7,FALSE)),\"\",IF(VLOOKUP($A11,[1]BD!$E$177:$K$197,7,FALSE)=\"\",\"\",VLOOKUP($A11,[1]BD!$E$177:$K$197,7,FALSE)))","v":""},{"$f":"IF(ISERROR(VLOOKUP($A11,[1]BD!$E$198:$K$224,7,FALSE)),\"\",IF(VLOOKUP($A11,[1]BD!$E$198:$K$224,7,FALSE)=\"\",\"\",VLOOKUP($A11,[1]BD!$E$198:$K$224,7,FALSE)))","v":""},{"$f":"IF(ISERROR(VLOOKUP($A11,[1]BD!$E$225:$K$244,7,FALSE)),\"\",IF(VLOOKUP($A11,[1]BD!$E$225:$K$244,7,FALSE)=\"\",\"\",VLOOKUP($A11,[1]BD!$E$225:$K$244,7,FALSE)))","v":""},{"$f":"IF(ISERROR(VLOOKUP($A11,[1]BD!$E$245:$K$260,7,FALSE)),\"\",IF(VLOOKUP($A11,[1]BD!$E$245:$K$260,7,FALSE)=\"\",\"\",VLOOKUP($A11,[1]BD!$E$245:$K$260,7,FALSE)))","v":"TROCA"},{"$f":"IF(ISERROR(VLOOKUP($A11,[1]BD!$E$261:$K$288,7,FALSE)),\"\",IF(VLOOKUP($A11,[1]BD!$E$261:$K$288,7,FALSE)=\"\",\"\",VLOOKUP($A11,[1]BD!$E$261:$K$288,7,FALSE)))","v":""},{"$f":"IF(ISERROR(VLOOKUP($A11,[1]BD!$E$289:$K$309,7,FALSE)),\"\",IF(VLOOKUP($A11,[1]BD!$E$289:$K$309,7,FALSE)=\"\",\"\",VLOOKUP($A11,[1]BD!$E$289:$K$309,7,FALSE)))","v":""},1]
["Hélio Chagas",{"$f":"IF(ISERROR(VLOOKUP($A12,[1]BD!$E$2:$K$29,7,FALSE)),\"\",IF(VLOOKUP($A12,[1]BD!$E$2:$K$29,7,FALSE)=\"\",\"\",VLOOKUP($A12,[1]BD!$E$2:$K$29,7,FALSE)))","v":""},{"$f":"IF(ISERROR(VLOOKUP($A12,[1]BD!$E$30:$K$62,7,FALSE)),\"\",IF(VLOOKUP($A12,[1]BD!$E$30:$K$62,7,FALSE)=\"\",\"\",VLOOKUP($A12,[1]BD!$E$30:$K$62,7,FALSE)))","v":""},{"$f":"IF(ISERROR(VLOOKUP($A12,[1]BD!$E$63:$K$93,7,FALSE)),\"\",IF(VLOOKUP($A12,[1]BD!$E$63:$K$93,7,FALSE)=\"\",\"\",VLOOKUP($A12,[1]BD!$E$63:$K$93,7,FALSE)))","v":""},{"$f":"IF(ISERROR(VLOOKUP($A12,[1]BD!$E$94:$K$124,7,FALSE)),\"\",IF(VLOOKUP($A12,[1]BD!$E$94:$K$124,7,FALSE)=\"\",\"\",VLOOKUP($A12,[1]BD!$E$94:$K$124,7,FALSE)))","v":""},{"$f":"IF(ISERROR(VLOOKUP($A12,[1]BD!$E$125:$K$150,7,FALSE)),\"\",IF(VLOOKUP($A12,[1]BD!$E$125:$K$150,7,FALSE)=\"\",\"\",VLOOKUP($A12,[1]BD!$E$125:$K$150,7,FALSE)))","v":""},{"$f":"IF(ISERROR(VLOOKUP($A12,[1]BD!$E$151:$K$176,7,FALSE)),\"\",IF(VLOOKUP($A12,[1]BD!$E$151:$K$176,7,FALSE)=\"\",\"\",VLOOKUP($A12,[1]BD!$E$151:$K$176,7,FALSE)))","v":""},{"$f":"IF(ISERROR(VLOOKUP($A12,[1]BD!$E$177:$K$197,7,FALSE)),\"\",IF(VLOOKUP($A12,[1]BD!$E$177:$K$197,7,FALSE)=\"\",\"\",VLOOKUP($A12,[1]BD!$E$177:$K$197,7,FALSE)))","v":""},{"$f":"IF(ISERROR(VLOOKUP($A12,[1]BD!$E$198:$K$224,7,FALSE)),\"\",IF(VLOOKUP($A12,[1]BD!$E$198:$K$224,7,FALSE)=\"\",\"\",VLOOKUP($A12,[1]BD!$E$198:$K$224,7,FALSE)))","v":""},{"$f":"IF(ISERROR(VLOOKUP($A12,[1]BD!$E$225:$K$244,7,FALSE)),\"\",IF(VLOOKUP($A12,[1]BD!$E$225:$K$244,7,FALSE)=\"\",\"\",VLOOKUP($A12,[1]BD!$E$225:$K$244,7,FALSE)))","v":""},{"$f":"IF(ISERROR(VLOOKUP($A12,[1]BD!$E$245:$K$260,7,FALSE)),\"\",IF(VLOOKUP($A12,[1]BD!$E$245:$K$260,7,FALSE)=\"\",\"\",VLOOKUP($A12,[1]BD!$E$245:$K$260,7,FALSE)))","v":""},{"$f":"IF(ISERROR(VLOOKUP($A12,[1]BD!$E$261:$K$288,7,FALSE)),\"\",IF(VLOOKUP($A12,[1]BD!$E$261:$K$288,7,FALSE)=\"\",\"\",VLOOKUP($A12,[1]BD!$E$261:$K$288,7,FALSE)))","v":""},{"$f":"IF(ISERROR(VLOOKUP($A12,[1]BD!$E$289:$K$309,7,FALSE)),\"\",IF(VLOOKUP($A12,[1]BD!$E$289:$K$309,7,FALSE)=\"\",\"\",VLOOKUP($A12,[1]BD!$E$289:$K$309,7,FALSE)))","v":""},0]
["Hugo Denucci",{"$f":"IF(ISERROR(VLOOKUP($A13,[1]BD!$E$2:$K$29,7,FALSE)),\"\",IF(VLOOKUP($A13,[1]BD!$E$2:$K$29,7,FALSE)=\"\",\"\",VLOOKUP($A13,[1]BD!$E$2:$K$29,7,FALSE)))","v":""},{"$f":"IF(ISERROR(VLOOKUP($A13,[1]BD!$E$30:$K$62,7,FALSE)),\"\",IF(VLOOKUP($A13,[1]BD!$E$30:$K$62,7,FALSE)=\"\",\"\",VLOOKUP($A13,[1]BD!$E$30:$K$62,7,FALSE)))","v":""},{"$f":"IF(ISERROR(VLOOKUP($A13,[1]BD!$E$63:$K$93,7,FALSE)),\"\",IF(VLOOKUP($A13,[1]BD!$E$63:$K$93,7,FALSE)=\"\",\"\",VLOOKUP($A13,[1]BD!$E$63:$K$93,7,FALSE)))","v":""},{"$f":"IF(ISERROR(VLOOKUP($A13,[1]BD!$E$94:$K$124,7,FALSE)),\"\",IF(VLOOKUP($A13,[1]BD!$E$94:$K$124,7,FALSE)=\"\",\"\",VLOOKUP($A13,[1]BD!$E$94:$K$124,7,FALSE)))","v":""},{"$f":"IF(ISERROR(VLOOKUP($A13,[1]BD!$E$125:$K$150,7,FALSE)),\"\",IF(VLOOKUP($A13,[1]BD!$E$125:$K$150,7,FALSE)=\"\",\"\",VLOOKUP($A13,[1]BD!$E$125:$K$150,7,FALSE)))","v":""},{"$f":"IF(ISERROR(VLOOKUP($A13,[1]BD!$E$151:$K$176,7,FALSE)),\"\",IF(VLOOKUP($A13,[1]BD!$E$151:$K$176,7,FALSE)=\"\",\"\",VLOOKUP($A13,[1]BD!$E$151:$K$176,7,FALSE)))","v":""},{"$f":"IF(ISERROR(VLOOKUP($A13,[1]BD!$E$177:$K$197,7,FALSE)),\"\",IF(VLOOKUP($A13,[1]BD!$E$177:$K$197,7,FALSE)=\"\",\"\",VLOOKUP($A13,[1]BD!$E$177:$K$197,7,FALSE)))","v":""},{"$f":"IF(ISERROR(VLOOKUP($A13,[1]BD!$E$198:$K$224,7,FALSE)),\"\",IF(VLOOKUP($A13,[1]BD!$E$198:$K$224,7,FALSE)=\"\",\"\",VLOOKUP($A13,[1]BD!$E$198:$K$224,7,FALSE)))","v":""},{"$f":"IF(ISERROR(VLOOKUP($A13,[1]BD!$E$225:$K$244,7,FALSE)),\"\",IF(VLOOKUP($A13,[1]BD!$E$225:$K$244,7,FALSE)=\"\",\"\",VLOOKUP($A13,[1]BD!$E$225:$K$244,7,FALSE)))","v":""},{"$f":"IF(ISERROR(VLOOKUP($A13,[1]BD!$E$245:$K$260,7,FALSE)),\"\",IF(VLOOKUP($A13,[1]BD!$E$245:$K$260,7,FALSE)=\"\",\"\",VLOOKUP($A13,[1]BD!$E$245:$K$260,7,FALSE)))","v":""},{"$f":"IF(ISERROR(VLOOKUP($A13,[1]BD!$E$261:$K$288,7,FALSE)),\"\",IF(VLOOKUP($A13,[1]BD!$E$261:$K$288,7,FALSE)=\"\",\"\",VLOOKUP($A13,[1]BD!$E$261:$K$288,7,FALSE)))","v":""},{"$f":"IF(ISERROR(VLOOKUP($A13,[1]BD!$E$289:$K$309,7,FALSE)),\"\",IF(VLOOKUP($A13,[1]BD!$E$289:$K$309,7,FALSE)=\"\",\"\",VLOOKUP($A13,[1]BD!$E$289:$K$309,7,FALSE)))","v":""},0]
["Jarbas Reis",{"$f":"IF(ISERROR(VLOOKUP($A14,[1]BD!$E$2:$K$29,7,FALSE)),\"\",IF(VLOOKUP($A14,[1]BD!$E$2:$K$29,7,FALSE)=\"\",\"\",VLOOKUP($A14,[1]BD!$E$2:$K$29,7,FALSE)))","v":"TROCA"},{"$f":"IF(ISERROR(VLOOKUP($A14,[1]BD!$E$30:$K$62,7,FALSE)),\"\",IF(VLOOKUP($A14,[1]BD!$E$30:$K$62,7,FALSE)=\"\",\"\",VLOOKUP($A14,[1]BD!$E$30:$K$62,7,FALSE)))","v":""},{"$f":"IF(ISERROR(VLOOKUP($A14,[1]BD!$E$63:$K$93,7,FALSE)),\"\",IF(VLOOKUP($A14,[1]BD!$E$63:$K$93,7,FALSE)=\"\",\"\",VLOOKUP($A14,[1]BD!$E$63:$K$93,7,FALSE)))","v":""},{"$f":"IF(ISERROR(VLOOKUP($A14,[1]BD!$E$94:$K$124,7,FALSE)),\"\",IF(VLOOKUP($A14,[1]BD!$E$94:$K$124,7,FALSE)=\"\",\"\",VLOOKUP($A14,[1]BD!$E$94:$K$124,7,FALSE)))","v":""},{"$f":"IF(ISERROR(VLOOKUP($A14,[1]BD!$E$125:$K$150,7,FALSE)),\"\",IF(VLOOKUP($A14,[1]BD!$E$125:$K$150,7,FALSE)=\"\",\"\",VLOOKUP($A14,[1]BD!$E$125:$K$150,7,FALSE)))","v":"TROCA"},{"$f":"IF(ISERROR(VLOOKUP($A14,[1]BD!$E$151:$K$176,7,FALSE)),\"\",IF(VLOOKUP($A14,[1]BD!$E$151:$K$176,7,FALSE)=\"\",\"\",VLOOKUP($A14,[1]BD!$E$151:$K$176,7,FALSE)))","v":""},{"$f":"IF(ISERROR(VLOOKUP($A14,[1]BD!$E$177:$K$197,7,FALSE)),\"\",IF(VLOOKUP($A14,[1]BD!$E$177:$K$197,7,FALSE)=\"\",\"\",VLOOKUP($A14,[1]BD!$E$177:$K$197,7,FALSE)))","v":""},{"$f":"IF(ISERROR(VLOOKUP($A14,[1]BD!$E$198:$K$224,7,FALSE)),\"\",IF(VLOOKUP($A14,[1]BD!$E$198:$K$224,7,FALSE)=\"\",\"\",VLOOKUP($A14,[1]BD!$E$198:$K$224,7,FALSE)))","v":""},{"$f":"IF(ISERROR(VLOOKUP($A14,[1]BD!$E$225:$K$244,7,FALSE)),\"\",IF(VLOOKUP($A14,[1]BD!$E$225:$K$244,7,FALSE)=\"\",\"\",VLOOKUP($A14,[1]BD!$E$225:$K$244,7,FALSE)))","v":""},{"$f":"IF(ISERROR(VLOOKUP($A14,[1]BD!$E$245:$K$260,7,FALSE)),\"\",IF(VLOOKUP($A14,[1]BD!$E$245:$K$260,7,FALSE)=\"\",\"\",VLOOKUP($A14,[1]BD!$E$245:$K$260,7,FALSE)))","v":""},{"$f":"IF(ISERROR(VLOOKUP($A14,[1]BD!$E$261:$K$288,7,FALSE)),\"\",IF(VLOOKUP($A14,[1]BD!$E$261:$K$288,7,FALSE)=\"\",\"\",VLOOKUP($A14,[1]BD!$E$261:$K$288,7,FALSE)))","v":""},{"$f":"IF(ISERROR(VLOOKUP($A14,[1]BD!$E$289:$K$309,7,FALSE)),\"\",IF(VLOOKUP($A14,[1]BD!$E$289:$K$309,7,FALSE)=\"\",\"\",VLOOKUP($A14,[1]BD!$E$289:$K$309,7,FALSE)))","v":"TROCA"},3]
["Leandro Malias",{"$f":"IF(ISERROR(VLOOKUP($A15,[1]BD!$E$2:$K$29,7,FALSE)),\"\",IF(VLOOKUP($A15,[1]BD!$E$2:$K$29,7,FALSE)=\"\",\"\",VLOOKUP($A15,[1]BD!$E$2:$K$29,7,FALSE)))","v":""},{"$f":"IF(ISERROR(VLOOKUP($A15,[1]BD!$E$30:$K$62,7,FALSE)),\"\",IF(VLOOKUP($A15,[1]BD!$E$30:$K$62,7,FALSE)=\"\",\"\",VLOOKUP($A15,[1]BD!$E$30:$K$62,7,FALSE)))","v":""},{"$f":"IF(ISERROR(VLOOKUP($A15,[1]BD!$E$63:$K$93,7,FALSE)),\"\",IF(VLOOKUP($A15,[1]BD!$E$63:$K$93,7,FALSE)=\"\",\"\",VLOOKUP($A15,[1]BD!$E$63:$K$93,7,FALSE)))","v":""},{"$f":"IF(ISERROR(VLOOKUP($A15,[1]BD!$E$94:$K$124,7,FALSE)),\"\",IF(VLOOKUP($A15,[1]BD!$E$94:$K$124,7,FALSE)=\"\",\"\",VLOOKUP($A15,[1]BD!$E$94:$K$124,7,FALSE)))","v":""},{"$f":"IF(ISERROR(VLOOKUP($A15,[1]BD!$E$125:$K$150,7,FALSE)),\"\",IF(VLOOKUP($A15,[1]BD!$E$125:$K$150,7,FALSE)=\"\",\"\",VLOOKUP($A15,[1]BD!$E$125:$K$150,7,FALSE)))","v":""},{"$f":"IF(ISERROR(VLOOKUP($A15,[1]BD!$E$151:$K$176,7,FALSE)),\"\",IF(VLOOKUP($A15,[1]BD!$E$151:$K$176,7,FALSE)=\"\",\"\",VLOOKUP($A15,[1]BD!$E$151:$K$176,7,FALSE)))","v":""},{"$f":"IF(ISERROR(VLOOKUP($A15,[1]BD!$E$177:$K$197,7,FALSE)),\"\",IF(VLOOKUP($A15,[1]BD!$E$177:$K$197,7,FALSE)=\"\",\"\",VLOOKUP($A15,[1]BD!$E$177:$K$197,7,FALSE)))","v":""},{"$f":"IF(ISERROR(VLOOKUP($A15,[1]BD!$E$198:$K$224,7,FALSE)),\"\",IF(VLOOKUP($A15,[1]BD!$E$198:$K$224,7,FALSE)=\"\",\"\",VLOOKUP($A15,[1]BD!$E$198:$K$224,7,FALSE)))","v":""},{"$f":"IF(ISERROR(VLOOKUP($A15,[1]BD!$E$225:$K$244,7,FALSE)),\"\",IF(VLOOKUP($A15,[1]BD!$E$225:$K$244,7,FALSE)=\"\",\"\",VLOOKUP($A15,[1]BD!$E$225:$K$244,7,FALSE)))","v":""},{"$f":"IF(ISERROR(VLOOKUP($A15,[1]BD!$E$245:$K$260,7,FALSE)),\"\",IF(VLOOKUP($A15,[1]BD!$E$245:$K$260,7,FALSE)=\"\",\"\",VLOOKUP($A15,[1]BD!$E$245:$K$260,7,FALSE)))","v":""},{"$f":"IF(ISERROR(VLOOKUP($A15,[1]BD!$E$261:$K$288,7,FALSE)),\"\",IF(VLOOKUP($A15,[1]BD!$E$261:$K$288,7,FALSE)=\"\",\"\",VLOOKUP($A15,[1]BD!$E$261:$K$288,7,FALSE)))","v":""},{"$f":"IF(ISERROR(VLOOKUP($A15,[1]BD!$E$289:$K$309,7,FALSE)),\"\",IF(VLOOKUP($A15,[1]BD!$E$289:$K$309,7,FALSE)=\"\",\"\",VLOOKUP($A15,[1]BD!$E$289:$K$309,7,FALSE)))","v":""},0]
["Lucas Guimarães",{"$f":"IF(ISERROR(VLOOKUP($A16,[1]BD!$E$2:$K$29,7,FALSE)),\"\",IF(VLOOKUP($A16,[1]BD!$E$2:$K$29,7,FALSE)=\"\",\"\",VLOOKUP($A16,[1]BD!$E$2:$K$29,7,FALSE)))","v":""},{"$f":"IF(ISERROR(VLOOKUP($A16,[1]BD!$E$30:$K$62,7,FALSE)),\"\",IF(VLOOKUP($A16,[1]BD!$E$30:$K$62,7,FALSE)=\"\",\"\",VLOOKUP($A16,[1]BD!$E$30:$K$62,7,FALSE)))","v":""},{"$f":"IF(ISERROR(VLOOKUP($A16,[1]BD!$E$63:$K$93,7,FALSE)),\"\",IF(VLOOKUP($A16,[1]BD!$E$63:$K$93,7,FALSE)=\"\",\"\",VLOOKUP($A16,[1]BD!$E$63:$K$93,7,FALSE)))","v":""},{"$f":"IF(ISERROR(VLOOKUP($A16,[1]BD!$E$94:$K$124,7,FALSE)),\"\",IF(VLOOKUP($A16,[1]BD!$E$94:$K$124,7,FALSE)=\"\",\"\",VLOOKUP($A16,[1]BD!$E$94:$K$124,7,FALSE)))","v":""},{"$f":"IF(ISERROR(VLOOKUP($A16,[1]BD!$E$125:$K$150,7,FALSE)),\"\",IF(VLOOKUP($A16,[1]BD!$E$125:$K$150,7,FALSE)=\"\",\"\",VLOOKUP($A16,[1]BD!$E$125:$K$150,7,FALSE)))","v":""},{"$f":"IF(ISERROR(VLOOKUP($A16,[1]BD!$E$151:$K$176,7,FALSE)),\"\",IF(VLOOKUP($A16,[1]BD!$E$151:$K$176,7,FALSE)=\"\",\"\",VLOOKUP($A16,[1]BD!$E$151:$K$176,7,FALSE)))","v":""},{"$f":"IF(ISERROR(VLOOKUP($A16,[1]BD!$E$177:$K$197,7,FALSE)),\"\",IF(VLOOKUP($A16,[1]BD!$E$177:$K$197,7,FALSE)=\"\",\"\",VLOOKUP($A16,[1]BD!$E$177:$K$197,7,FALSE)))","v":""},{"$f":"IF(ISERROR(VLOOKUP($A16,[1]BD!$E$198:$K$224,7,FALSE)),\"\",IF(VLOOKUP($A16,[1]BD!$E$198:$K$224,7,FALSE)=\"\",\"\",VLOOKUP($A16,[1]BD!$E$198:$K$224,7,FALSE)))","v":""},{"$f":"IF(ISERROR(VLOOKUP($A16,[1]BD!$E$225:$K$244,7,FALSE)),\"\",IF(VLOOKUP($A16,[1]BD!$E$225:$K$244,7,FALSE)=\"\",\"\",VLOOKUP($A16,[1]BD!$E$225:$K$244,7,FALSE)))","v":""},{"$f":"IF(ISERROR(VLOOKUP($A16,[1]BD!$E$245:$K$260,7,FALSE)),\"\",IF(VLOOKUP($A16,[1]BD!$E$245:$K$260,7,FALSE)=\"\",\"\",VLOOKUP($A16,[1]BD!$E$245:$K$260,7,FALSE)))","v":""},{"$f":"IF(ISERROR(VLOOKUP($A16,[1]BD!$E$261:$K$288,7,FALSE)),\"\",IF(VLOOKUP($A16,[1]BD!$E$261:$K$288,7,FALSE)=\"\",\"\",VLOOKUP($A16,[1]BD!$E$261:$K$288,7,FALSE)))","v":""},{"$f":"IF(ISERROR(VLOOKUP($A16,[1]BD!$E$289:$K$309,7,FALSE)),\"\",IF(VLOOKUP($A16,[1]BD!$E$289:$K$309,7,FALSE)=\"\",\"\",VLOOKUP($A16,[1]BD!$E$289:$K$309,7,FALSE)))","v":""},0]
["Luciano Robervine",{"$f":"IF(ISERROR(VLOOKUP($A17,[1]BD!$E$2:$K$29,7,FALSE)),\"\",IF(VLOOKUP($A17,[1]BD!$E$2:$K$29,7,FALSE)=\"\",\"\",VLOOKUP($A17,[1]BD!$E$2:$K$29,7,FALSE)))","v":""},{"$f":"IF(ISERROR(VLOOKUP($A17,[1]BD!$E$30:$K$62,7,FALSE)),\"\",IF(VLOOKUP($A17,[1]BD!$E$30:$K$62,7,FALSE)=\"\",\"\",VLOOKUP($A17,[1]BD!$E$30:$K$62,7,FALSE)))","v":""},{"$f":"IF(ISERROR(VLOOKUP($A17,[1]BD!$E$63:$K$93,7,FALSE)),\"\",IF(VLOOKUP($A17,[1]BD!$E$63:$K$93,7,FALSE)=\"\",\"\",VLOOKUP($A17,[1]BD!$E$63:$K$93,7,FALSE)))","v":""},{"$f":"IF(ISERROR(VLOOKUP($A17,[1]BD!$E$94:$K$124,7,FALSE)),\"\",IF(VLOOKUP($A17,[1]BD!$E$94:$K$124,7,FALSE)=\"\",\"\",VLOOKUP($A17,[1]BD!$E$94:$K$124,7,FALSE)))","v":""},{"$f":"IF(ISERROR(VLOOKUP($A17,[1]BD!$E$125:$K$150,7,FALSE)),\"\",IF(VLOOKUP($A17,[1]BD!$E$125:$K$150,7,FALSE)=\"\",\"\",VLOOKUP($A17,[1]BD!$E$125:$K$150,7,FALSE)))","v":""},{"$f":"IF(ISERROR(VLOOKUP($A17,[1]BD!$E$151:$K$176,7,FALSE)),\"\",IF(VLOOKUP($A17,[1]BD!$E$151:$K$176,7,FALSE)=\"\",\"\",VLOOKUP($A17,[1]BD!$E$151:$K$176,7,FALSE)))","v":""},{"$f":"IF(ISERROR(VLOOKUP($A17,[1]BD!$E$177:$K$197,7,FALSE)),\"\",IF(VLOOKUP($A17,[1]BD!$E$177:$K$197,7,FALSE)=\"\",\"\",VLOOKUP($A17,[1]BD!$E$177:$K$197,7,FALSE)))","v":""},{"$f":"IF(ISERROR(VLOOKUP($A17,[1]BD!$E$198:$K$224,7,FALSE)),\"\",IF(VLOOKUP($A17,[1]BD!$E$198:$K$224,7,FALSE)=\"\",\"\",VLOOKUP($A17,[1]BD!$E$198:$K$224,7,FALSE)))","v":""},{"$f":"IF(ISERROR(VLOOKUP($A17,[1]BD!$E$225:$K$244,7,FALSE)),\"\",IF(VLOOKUP($A17,[1]BD!$E$225:$K$244,7,FALSE)=\"\",\"\",VLOOKUP($A17,[1]BD!$E$225:$K$244,7,FALSE)))","v":""},{"$f":"IF(ISERROR(VLOOKUP($A17,[1]BD!$E$245:$K$260,7,FALSE)),\"\",IF(VLOOKUP($A17,[1]BD!$E$245:$K$260,7,FALSE)=\"\",\"\",VLOOKUP($A17,[1]BD!$E$245:$K$260,7,FALSE)))","v":""},{"$f":"IF(ISERROR(VLOOKUP($A17,[1]BD!$E$261:$K$288,7,FALSE)),\"\",IF(VLOOKUP($A17,[1]BD!$E$261:$K$288,7,FALSE)=\"\",\"\",VLOOKUP($A17,[1]BD!$E$261:$K$288,7,FALSE)))","v":""},{"$f":"IF(ISERROR(VLOOKUP($A17,[1]BD!$E$289:$K$309,7,FALSE)),\"\",IF(VLOOKUP($A17,[1]BD!$E$289:$K$309,7,FALSE)=\"\",\"\",VLOOKUP($A17,[1]BD!$E$289:$K$309,7,FALSE)))","v":""},0]
["Marcelo Campos",{"$f":"IF(ISERROR(VLOOKUP($A18,[1]BD!$E$2:$K$29,7,FALSE)),\"\",IF(VLOOKUP($A18,[1]BD!$E$2:$K$29,7,FALSE)=\"\",\"\",VLOOKUP($A18,[1]BD!$E$2:$K$29,7,FALSE)))","v":""},{"$f":"IF(ISERROR(VLOOKUP($A18,[1]BD!$E$30:$K$62,7,FALSE)),\"\",IF(VLOOKUP($A18,[1]BD!$E$30:$K$62,7,FALSE)=\"\",\"\",VLOOKUP($A18,[1]BD!$E$30:$K$62,7,FALSE)))","v":""},{"$f":"IF(ISERROR(VLOOKUP($A18,[1]BD!$E$63:$K$93,7,FALSE)),\"\",IF(VLOOKUP($A18,[1]BD!$E$63:$K$93,7,FALSE)=\"\",\"\",VLOOKUP($A18,[1]BD!$E$63:$K$93,7,FALSE)))","v":"TROCA"},{"$f":"IF(ISERROR(VLOOKUP($A18,[1]BD!$E$94:$K$124,7,FALSE)),\"\",IF(VLOOKUP($A18,[1]BD!$E$94:$K$124,7,FALSE)=\"\",\"\",VLOOKUP($A18,[1]BD!$E$94:$K$124,7,FALSE)))","v":""},{"$f":"IF(ISERROR(VLOOKUP($A18,[1]BD!$E$125:$K$150,7,FALSE)),\"\",IF(VLOOKUP($A18,[1]BD!$E$125:$K$150,7,FALSE)=\"\",\"\",VLOOKUP($A18,[1]BD!$E$125:$K$150,7,FALSE)))","v":""},{"$f":"IF(ISERROR(VLOOKUP($A18,[1]BD!$E$151:$K$176,7,FALSE)),\"\",IF(VLOOKUP($A18,[1]BD!$E$151:$K$176,7,FALSE)=\"\",\"\",VLOOKUP($A18,[1]BD!$E$151:$K$176,7,FALSE)))","v":""},{"$f":"IF(ISERROR(VLOOKUP($A18,[1]BD!$E$177:$K$197,7,FALSE)),\"\",IF(VLOOKUP($A18,[1]BD!$E$177:$K$197,7,FALSE)=\"\",\"\",VLOOKUP($A18,[1]BD!$E$177:$K$197,7,FALSE)))","v":""},{"$f":"IF(ISERROR(VLOOKUP($A18,[1]BD!$E$198:$K$224,7,FALSE)),\"\",IF(VLOOKUP($A18,[1]BD!$E$198:$K$224,7,FALSE)=\"\",\"\",VLOOKUP($A18,[1]BD!$E$198:$K$224,7,FALSE)))","v":""},{"$f":"IF(ISERROR(VLOOKUP($A18,[1]BD!$E$225:$K$244,7,FALSE)),\"\",IF(VLOOKUP($A18,[1]BD!$E$225:$K$244,7,FALSE)=\"\",\"\",VLOOKUP($A18,[1]BD!$E$225:$K$244,7,FALSE)))","v":""},{"$f":"IF(ISERROR(VLOOKUP($A18,[1]BD!$E$245:$K$260,7,FALSE)),\"\",IF(VLOOKUP($A18,[1]BD!$E$245:$K$260,7,FALSE)=\"\",\"\",VLOOKUP($A18,[1]BD!$E$245:$K$260,7,FALSE)))","v":""},{"$f":"IF(ISERROR(VLOOKUP($A18,[1]BD!$E$261:$K$288,7,FALSE)),\"\",IF(VLOOKUP($A18,[1]BD!$E$261:$K$288,7,FALSE)=\"\",\"\",VLOOKUP($A18,[1]BD!$E$261:$K$288,7,FALSE)))","v":""},{"$f":"IF(ISERROR(VLOOKUP($A18,[1]BD!$E$289:$K$309,7,FALSE)),\"\",IF(VLOOKUP($A18,[1]BD!$E$289:$K$309,7,FALSE)=\"\",\"\",VLOOKUP($A18,[1]BD!$E$289:$K$309,7,FALSE)))","v":"TROCA"},2]
["Marcelo Chagas",{"$f":"IF(ISERROR(VLOOKUP($A19,[1]BD!$E$2:$K$29,7,FALSE)),\"\",IF(VLOOKUP($A19,[1]BD!$E$2:$K$29,7,FALSE)=\"\",\"\",VLOOKUP($A19,[1]BD!$E$2:$K$29,7,FALSE)))","v":""},{"$f":"IF(ISERROR(VLOOKUP($A19,[1]BD!$E$30:$K$62,7,FALSE)),\"\",IF(VLOOKUP($A19,[1]BD!$E$30:$K$62,7,FALSE)=\"\",\"\",VLOOKUP($A19,[1]BD!$E$30:$K$62,7,FALSE)))","v":""},{"$f":"IF(ISERROR(VLOOKUP($A19,[1]BD!$E$63:$K$93,7,FALSE)),\"\",IF(VLOOKUP($A19,[1]BD!$E$63:$K$93,7,FALSE)=\"\",\"\",VLOOKUP($A19,[1]BD!$E$63:$K$93,7,FALSE)))","v":""},{"$f":"IF(ISERROR(VLOOKUP($A19,[1]BD!$E$94:$K$124,7,FALSE)),\"\",IF(VLOOKUP($A19,[1]BD!$E$94:$K$124,7,FALSE)=\"\",\"\",VLOOKUP($A19,[1]BD!$E$94:$K$124,7,FALSE)))","v":""},{"$f":"IF(ISERROR(VLOOKUP($A19,[1]BD!$E$125:$K$150,7,FALSE)),\"\",IF(VLOOKUP($A19,[1]BD!$E$125:$K$150,7,FALSE)=\"\",\"\",VLOOKUP($A19,[1]BD!$E$125:$K$150,7,FALSE)))","v":""},{"$f":"IF(ISERROR(VLOOKUP($A19,[1]BD!$E$151:$K$176,7,FALSE)),\"\",IF(VLOOKUP($A19,[1]BD!$E$151:$K$176,7,FALSE)=\"\",\"\",VLOOKUP($A19,[1]BD!$E$151:$K$176,7,FALSE)))","v":""},{"$f":"IF(ISERROR(VLOOKUP($A19,[1]BD!$E$177:$K$197,7,FALSE)),\"\",IF(VLOOKUP($A19,[1]BD!$E$177:$K$197,7,FALSE)=\"\",\"\",VLOOKUP($A19,[1]BD!$E$177:$K$197,7,FALSE)))","v":""},{"$f":"IF(ISERROR(VLOOKUP($A19,[1]BD!$E$198:$K$224,7,FALSE)),\"\",IF(VLOOKUP($A19,[1]BD!$E$198:$K$224,7,FALSE)=\"\",\"\",VLOOKUP($A19,[1]BD!$E$198:$K$224,7,FALSE)))","v":""},{"$f":"IF(ISERROR(VLOOKUP($A19,[1]BD!$E$225:$K$244,7,FALSE)),\"\",IF(VLOOKUP($A19,[1]BD!$E$225:$K$244,7,FALSE)=\"\",\"\",VLOOKUP($A19,[1]BD!$E$225:$K$244,7,FALSE)))","v":""},{"$f":"IF(ISERROR(VLOOKUP($A19,[1]BD!$E$245:$K$260,7,FALSE)),\"\",IF(VLOOKUP($A19,[1]BD!$E$245:$K$260,7,FALSE)=\"\",\"\",VLOOKUP($A19,[1]BD!$E$245:$K$260,7,FALSE)))","v":""},{"$f":"IF(ISERROR(VLOOKUP($A19,[1]BD!$E$261:$K$288,7,FALSE)),\"\",IF(VLOOKUP($A19,[1]BD!$E$261:$K$288,7,FALSE)=\"\",\"\",VLOOKUP($A19,[1]BD!$E$261:$K$288,7,FALSE)))","v":""},{"$f":"IF(ISERROR(VLOOKUP($A19,[1]BD!$E$289:$K$309,7,FALSE)),\"\",IF(VLOOKUP($A19,[1]BD!$E$289:$K$309,7,FALSE)=\"\",\"\",VLOOKUP($A19,[1]BD!$E$289:$K$309,7,FALSE)))","v":"TROCA"},1]
["Marcelo Clemente",{"$f":"IF(ISERROR(VLOOKUP($A20,[1]BD!$E$2:$K$29,7,FALSE)),\"\",IF(VLOOKUP($A20,[1]BD!$E$2:$K$29,7,FALSE)=\"\",\"\",VLOOKUP($A20,[1]BD!$E$2:$K$29,7,FALSE)))","v":""},{"$f":"IF(ISERROR(VLOOKUP($A20,[1]BD!$E$30:$K$62,7,FALSE)),\"\",IF(VLOOKUP($A20,[1]BD!$E$30:$K$62,7,FALSE)=\"\",\"\",VLOOKUP($A20,[1]BD!$E$30:$K$62,7,FALSE)))","v":"TROCA"},{"$f":"IF(ISERROR(VLOOKUP($A20,[1]BD!$E$63:$K$93,7,FALSE)),\"\",IF(VLOOKUP($A20,[1]BD!$E$63:$K$93,7,FALSE)=\"\",\"\",VLOOKUP($A20,[1]BD!$E$63:$K$93,7,FALSE)))","v":""},{"$f":"IF(ISERROR(VLOOKUP($A20,[1]BD!$E$94:$K$124,7,FALSE)),\"\",IF(VLOOKUP($A20,[1]BD!$E$94:$K$124,7,FALSE)=\"\",\"\",VLOOKUP($A20,[1]BD!$E$94:$K$124,7,FALSE)))","v":""},{"$f":"IF(ISERROR(VLOOKUP($A20,[1]BD!$E$125:$K$150,7,FALSE)),\"\",IF(VLOOKUP($A20,[1]BD!$E$125:$K$150,7,FALSE)=\"\",\"\",VLOOKUP($A20,[1]BD!$E$125:$K$150,7,FALSE)))","v":""},{"$f":"IF(ISERROR(VLOOKUP($A20,[1]BD!$E$151:$K$176,7,FALSE)),\"\",IF(VLOOKUP($A20,[1]BD!$E$151:$K$176,7,FALSE)=\"\",\"\",VLOOKUP($A20,[1]BD!$E$151:$K$176,7,FALSE)))","v":""},{"$f":"IF(ISERROR(VLOOKUP($A20,[1]BD!$E$177:$K$197,7,FALSE)),\"\",IF(VLOOKUP($A20,[1]BD!$E$177:$K$197,7,FALSE)=\"\",\"\",VLOOKUP($A20,[1]BD!$E$177:$K$197,7,FALSE)))","v":""},{"$f":"IF(ISERROR(VLOOKUP($A20,[1]BD!$E$198:$K$224,7,FALSE)),\"\",IF(VLOOKUP($A20,[1]BD!$E$198:$K$224,7,FALSE)=\"\",\"\",VLOOKUP($A20,[1]BD!$E$198:$K$224,7,FALSE)))","v":""},{"$f":"IF(ISERROR(VLOOKUP($A20,[1]BD!$E$225:$K$244,7,FALSE)),\"\",IF(VLOOKUP($A20,[1]BD!$E$225:$K$244,7,FALSE)=\"\",\"\",VLOOKUP($A20,[1]BD!$E$225:$K$244,7,FALSE)))","v":""},{"$f":"IF(ISERROR(VLOOKUP($A20,[1]BD!$E$245:$K$260,7,FALSE)),\"\",IF(VLOOKUP($A20,[1]BD!$E$245:$K$260,7,FALSE)=\"\",\"\",VLOOKUP($A20,[1]BD!$E$245:$K$260,7,FALSE)))","v":""},{"$f":"IF(ISERROR(VLOOKUP($A20,[1]BD!$E$261:$K$288,7,FALSE)),\"\",IF(VLOOKUP($A20,[1]BD!$E$261:$K$288,7,FALSE)=\"\",\"\",VLOOKUP($A20,[1]BD!$E$261:$K$288,7,FALSE)))","v":""},{"$f":"IF(ISERROR(VLOOKUP($A20,[1]BD!$E$289:$K$309,7,FALSE)),\"\",IF(VLOOKUP($A20,[1]BD!$E$289:$K$309,7,FALSE)=\"\",\"\",VLOOKUP($A20,[1]BD!$E$289:$K$309,7,FALSE)))","v":""},1]
["Marcelo Marcondes",{"$f":"IF(ISERROR(VLOOKUP($A21,[1]BD!$E$2:$K$29,7,FALSE)),\"\",IF(VLOOKUP($A21,[1]BD!$E$2:$K$29,7,FALSE)=\"\",\"\",VLOOKUP($A21,[1]BD!$E$2:$K$29,7,FALSE)))","v":""},{"$f":"IF(ISERROR(VLOOKUP($A21,[1]BD!$E$30:$K$62,7,FALSE)),\"\",IF(VLOOKUP($A21,[1]BD!$E$30:$K$62,7,FALSE)=\"\",\"\",VLOOKUP($A21,[1]BD!$E$30:$K$62,7,FALSE)))","v":""},{"$f":"IF(ISERROR(VLOOKUP($A21,[1]BD!$E$63:$K$93,7,FALSE)),\"\",IF(VLOOKUP($A21,[1]BD!$E$63:$K$93,7,FALSE)=\"\",\"\",VLOOKUP($A21,[1]BD!$E$63:$K$93,7,FALSE)))","v":""},{"$f":"IF(ISERROR(VLOOKUP($A21,[1]BD!$E$94:$K$124,7,FALSE)),\"\",IF(VLOOKUP($A21,[1]BD!$E$94:$K$124,7,FALSE)=\"\",\"\",VLOOKUP($A21,[1]BD!$E$94:$K$124,7,FALSE)))","v":""},{"$f":"IF(ISERROR(VLOOKUP($A21,[1]BD!$E$125:$K$150,7,FALSE)),\"\",IF(VLOOKUP($A21,[1]BD!$E$125:$K$150,7,FALSE)=\"\",\"\",VLOOKUP($A21,[1]BD!$E$125:$K$150,7,FALSE)))","v":"TROCA"},{"$f":"IF(ISERROR(VLOOKUP($A21,[1]BD!$E$151:$K$176,7,FALSE)),\"\",IF(VLOOKUP($A21,[1]BD!$E$151:$K$176,7,FALSE)=\"\",\"\",VLOOKUP($A21,[1]BD!$E$151:$K$176,7,FALSE)))","v":""},{"$f":"IF(ISERROR(VLOOKUP($A21,[1]BD!$E$177:$K$197,7,FALSE)),\"\",IF(VLOOKUP($A21,[1]BD!$E$177:$K$197,7,FALSE)=\"\",\"\",VLOOKUP($A21,[1]BD!$E$177:$K$197,7,FALSE)))","v":""},{"$f":"IF(ISERROR(VLOOKUP($A21,[1]BD!$E$198:$K$224,7,FALSE)),\"\",IF(VLOOKUP($A21,[1]BD!$E$198:$K$224,7,FALSE)=\"\",\"\",VLOOKUP($A21,[1]BD!$E$198:$K$224,7,FALSE)))","v":""},{"$f":"IF(ISERROR(VLOOKUP($A21,[1]BD!$E$225:$K$244,7,FALSE)),\"\",IF(VLOOKUP($A21,[1]BD!$E$225:$K$244,7,FALSE)=\"\",\"\",VLOOKUP($A21,[1]BD!$E$225:$K$244,7,FALSE)))","v":""},{"$f":"IF(ISERROR(VLOOKUP($A21,[1]BD!$E$245:$K$260,7,FALSE)),\"\",IF(VLOOKUP($A21,[1]BD!$E$245:$K$260,7,FALSE)=\"\",\"\",VLOOKUP($A21,[1]BD!$E$245:$K$260,7,FALSE)))","v":""},{"$f":"IF(ISERROR(VLOOKUP($A21,[1]BD!$E$261:$K$288,7,FALSE)),\"\",IF(VLOOKUP($A21,[1]BD!$E$261:$K$288,7,FALSE)=\"\",\"\",VLOOKUP($A21,[1]BD!$E$261:$K$288,7,FALSE)))","v":""},{"$f":"IF(ISERROR(VLOOKUP($A21,[1]BD!$E$289:$K$309,7,FALSE)),\"\",IF(VLOOKUP($A21,[1]BD!$E$289:$K$309,7,FALSE)=\"\",\"\",VLOOKUP($A21,[1]BD!$E$289:$K$309,7,FALSE)))","v":""},1]
["Marcelo Pereira",{"$f":"IF(ISERROR(VLOOKUP($A22,[1]BD!$E$2:$K$29,7,FALSE)),\"\",IF(VLOOKUP($A22,[1]BD!$E$2:$K$29,7,FALSE)=\"\",\"\",VLOOKUP($A22,[1]BD!$E$2:$K$29,7,FALSE)))","v":""},{"$f":"IF(ISERROR(VLOOKUP($A22,[1]BD!$E$30:$K$62,7,FALSE)),\"\",IF(VLOOKUP($A22,[1]BD!$E$30:$K$62,7,FALSE)=\"\",\"\",VLOOKUP($A22,[1]BD!$E$30:$K$62,7,FALSE)))","v":""},{"$f":"IF(ISERROR(VLOOKUP($A22,[1]BD!$E$63:$K$93,7,FALSE)),\"\",IF(VLOOKUP($A22,[1]BD!$E$63:$K$93,7,FALSE)=\"\",\"\",VLOOKUP($A22,[1]BD!$E$63:$K$93,7,FALSE)))","v":""},{"$f":"IF(ISERROR(VLOOKUP($A22,[1]BD!$E$94:$K$124,7,FALSE)),\"\",IF(VLOOKUP($A22,[1]BD!$E$94:$K$124,7,FALSE)=\"\",\"\",VLOOKUP($A22,[1]BD!$E$94:$K$124,7,FALSE)))","v":""},{"$f":"IF(ISERROR(VLOOKUP($A22,[1]BD!$E$125:$K$150,7,FALSE)),\"\",IF(VLOOKUP($A22,[1]BD!$E$125:$K$150,7,FALSE)=\"\",\"\",VLOOKUP($A22,[1]BD!$E$125:$K$150,7,FALSE)))","v":""},{"$f":"IF(ISERROR(VLOOKUP($A22,[1]BD!$E$151:$K$176,7,FALSE)),\"\",IF(VLOOKUP($A22,[1]BD!$E$151:$K$176,7,FALSE)=\"\",\"\",VLOOKUP($A22,[1]BD!$E$151:$K$176,7,FALSE)))","v":""},{"$f":"IF(ISERROR(VLOOKUP($A22,[1]BD!$E$177:$K$197,7,FALSE)),\"\",IF(VLOOKUP($A22,[1]BD!$E$177:$K$197,7,FALSE)=\"\",\"\",VLOOKUP($A22,[1]BD!$E$177:$K$197,7,FALSE)))","v":""},{"$f":"IF(ISERROR(VLOOKUP($A22,[1]BD!$E$198:$K$224,7,FALSE)),\"\",IF(VLOOKUP($A22,[1]BD!$E$198:$K$224,7,FALSE)=\"\",\"\",VLOOKUP($A22,[1]BD!$E$198:$K$224,7,FALSE)))","v":""},{"$f":"IF(ISERROR(VLOOKUP($A22,[1]BD!$E$225:$K$244,7,FALSE)),\"\",IF(VLOOKUP($A22,[1]BD!$E$225:$K$244,7,FALSE)=\"\",\"\",VLOOKUP($A22,[1]BD!$E$225:$K$244,7,FALSE)))","v":""},{"$f":"IF(ISERROR(VLOOKUP($A22,[1]BD!$E$245:$K$260,7,FALSE)),\"\",IF(VLOOKUP($A22,[1]BD!$E$245:$K$260,7,FALSE)=\"\",\"\",VLOOKUP($A22,[1]BD!$E$245:$K$260,7,FALSE)))","v":"TROCA"},{"$f":"IF(ISERROR(VLOOKUP($A22,[1]BD!$E$261:$K$288,7,FALSE)),\"\",IF(VLOOKUP($A22,[1]BD!$E$261:$K$288,7,FALSE)=\"\",\"\",VLOOKUP($A22,[1]BD!$E$261:$K$288,7,FALSE)))","v":""},{"$f":"IF(ISERROR(VLOOKUP($A22,[1]BD!$E$289:$K$309,7,FALSE)),\"\",IF(VLOOKUP($A22,[1]BD!$E$289:$K$309,7,FALSE)=\"\",\"\",VLOOKUP($A22,[1]BD!$E$289:$K$309,7,FALSE)))","v":""},1]
["Marcelo Sant'anna",{"$f":"IF(ISERROR(VLOOKUP($A23,[1]BD!$E$2:$K$29,7,FALSE)),\"\",IF(VLOOKUP($A23,[1]BD!$E$2:$K$29,7,FALSE)=\"\",\"\",VLOOKUP($A23,[1]BD!$E$2:$K$29,7,FALSE)))","v":""},{"$f":"IF(ISERROR(VLOOKUP($A23,[1]BD!$E$30:$K$62,7,FALSE)),\"\",IF(VLOOKUP($A23,[1]BD!$E$30:$K$62,7,FALSE)=\"\",\"\",VLOOKUP($A23,[1]BD!$E$30:$K$62,7,FALSE)))","v":""},{"$f":"IF(ISERROR(VLOOKUP($A23,[1]BD!$E$63:$K$93,7,FALSE)),\"\",IF(VLOOKUP($A23,[1]BD!$E$63:$K$93,7,FALSE)=\"\",\"\",VLOOKUP($A23,[1]BD!$E$63:$K$93,7,FALSE)))","v":""},{"$f":"IF(ISERROR(VLOOKUP($A23,[1]BD!$E$94:$K$124,7,FALSE)),\"\",IF(VLOOKUP($A23,[1]BD!$E$94:$K$124,7,FALSE)=\"\",\"\",VLOOKUP($A23,[1]BD!$E$94:$K$124,7,FALSE)))","v":""},{"$f":"IF(ISERROR(VLOOKUP($A23,[1]BD!$E$125:$K$150,7,FALSE)),\"\",IF(VLOOKUP($A23,[1]BD!$E$125:$K$150,7,FALSE)=\"\",\"\",VLOOKUP($A23,[1]BD!$E$125:$K$150,7,FALSE)))","v":""},{"$f":"IF(ISERROR(VLOOKUP($A23,[1]BD!$E$151:$K$176,7,FALSE)),\"\",IF(VLOOKUP($A23,[1]BD!$E$151:$K$176,7,FALSE)=\"\",\"\",VLOOKUP($A23,[1]BD!$E$151:$K$176,7,FALSE)))","v":""},{"$f":"IF(ISERROR(VLOOKUP($A23,[1]BD!$E$177:$K$197,7,FALSE)),\"\",IF(VLOOKUP($A23,[1]BD!$E$177:$K$197,7,FALSE)=\"\",\"\",VLOOKUP($A23,[1]BD!$E$177:$K$197,7,FALSE)))","v":""},{"$f":"IF(ISERROR(VLOOKUP($A23,[1]BD!$E$198:$K$224,7,FALSE)),\"\",IF(VLOOKUP($A23,[1]BD!$E$198:$K$224,7,FALSE)=\"\",\"\",VLOOKUP($A23,[1]BD!$E$198:$K$224,7,FALSE)))","v":""},{"$f":"IF(ISERROR(VLOOKUP($A23,[1]BD!$E$225:$K$244,7,FALSE)),\"\",IF(VLOOKUP($A23,[1]BD!$E$225:$K$244,7,FALSE)=\"\",\"\",VLOOKUP($A23,[1]BD!$E$225:$K$244,7,FALSE)))","v":""},{"$f":"IF(ISERROR(VLOOKUP($A23,[1]BD!$E$245:$K$260,7,FALSE)),\"\",IF(VLOOKUP($A23,[1]BD!$E$245:$K$260,7,FALSE)=\"\",\"\",VLOOKUP($A23,[1]BD!$E$245:$K$260,7,FALSE)))","v":""},{"$f":"IF(ISERROR(VLOOKUP($A23,[1]BD!$E$261:$K$288,7,FALSE)),\"\",IF(VLOOKUP($A23,[1]BD!$E$261:$K$288,7,FALSE)=\"\",\"\",VLOOKUP($A23,[1]BD!$E$261:$K$288,7,FALSE)))","v":""},{"$f":"IF(ISERROR(VLOOKUP($A23,[1]BD!$E$289:$K$309,7,FALSE)),\"\",IF(VLOOKUP($A23,[1]BD!$E$289:$K$309,7,FALSE)=\"\",\"\",VLOOKUP($A23,[1]BD!$E$289:$K$309,7,FALSE)))","v":""},0]
["Bernardo Gatti",{"$f":"IF(ISERROR(VLOOKUP($A24,[1]BD!$E$2:$K$29,7,FALSE)),\"\",IF(VLOOKUP($A24,[1]BD!$E$2:$K$29,7,FALSE)=\"\",\"\",VLOOKUP($A24,[1]BD!$E$2:$K$29,7,FALSE)))","v":""},{"$f":"IF(ISERROR(VLOOKUP($A24,[1]BD!$E$30:$K$62,7,FALSE)),\"\",IF(VLOOKUP($A24,[1]BD!$E$30:$K$62,7,FALSE)=\"\",\"\",VLOOKUP($A24,[1]BD!$E$30:$K$62,7,FALSE)))","v":""},{"$f":"IF(ISERROR(VLOOKUP($A24,[1]BD!$E$63:$K$93,7,FALSE)),\"\",IF(VLOOKUP($A24,[1]BD!$E$63:$K$93,7,FALSE)=\"\",\"\",VLOOKUP($A24,[1]BD!$E$63:$K$93,7,FALSE)))","v":""},{"$f":"IF(ISERROR(VLOOKUP($A24,[1]BD!$E$94:$K$124,7,FALSE)),\"\",IF(VLOOKUP($A24,[1]BD!$E$94:$K$124,7,FALSE)=\"\",\"\",VLOOKUP($A24,[1]BD!$E$94:$K$124,7,FALSE)))","v":""},{"$f":"IF(ISERROR(VLOOKUP($A24,[1]BD!$E$125:$K$150,7,FALSE)),\"\",IF(VLOOKUP($A24,[1]BD!$E$125:$K$150,7,FALSE)=\"\",\"\",VLOOKUP($A24,[1]BD!$E$125:$K$150,7,FALSE)))","v":""},{"$f":"IF(ISERROR(VLOOKUP($A24,[1]BD!$E$151:$K$176,7,FALSE)),\"\",IF(VLOOKUP($A24,[1]BD!$E$151:$K$176,7,FALSE)=\"\",\"\",VLOOKUP($A24,[1]BD!$E$151:$K$176,7,FALSE)))","v":""},{"$f":"IF(ISERROR(VLOOKUP($A24,[1]BD!$E$177:$K$197,7,FALSE)),\"\",IF(VLOOKUP($A24,[1]BD!$E$177:$K$197,7,FALSE)=\"\",\"\",VLOOKUP($A24,[1]BD!$E$177:$K$197,7,FALSE)))","v":""},{"$f":"IF(ISERROR(VLOOKUP($A24,[1]BD!$E$198:$K$224,7,FALSE)),\"\",IF(VLOOKUP($A24,[1]BD!$E$198:$K$224,7,FALSE)=\"\",\"\",VLOOKUP($A24,[1]BD!$E$198:$K$224,7,FALSE)))","v":""},{"$f":"IF(ISERROR(VLOOKUP($A24,[1]BD!$E$225:$K$244,7,FALSE)),\"\",IF(VLOOKUP($A24,[1]BD!$E$225:$K$244,7,FALSE)=\"\",\"\",VLOOKUP($A24,[1]BD!$E$225:$K$244,7,FALSE)))","v":"TROCA"},{"$f":"IF(ISERROR(VLOOKUP($A24,[1]BD!$E$245:$K$260,7,FALSE)),\"\",IF(VLOOKUP($A24,[1]BD!$E$245:$K$260,7,FALSE)=\"\",\"\",VLOOKUP($A24,[1]BD!$E$245:$K$260,7,FALSE)))","v":""},{"$f":"IF(ISERROR(VLOOKUP($A24,[1]BD!$E$261:$K$288,7,FALSE)),\"\",IF(VLOOKUP($A24,[1]BD!$E$261:$K$288,7,FALSE)=\"\",\"\",VLOOKUP($A24,[1]BD!$E$261:$K$288,7,FALSE)))","v":""},{"$f":"IF(ISERROR(VLOOKUP($A24,[1]BD!$E$289:$K$309,7,FALSE)),\"\",IF(VLOOKUP($A24,[1]BD!$E$289:$K$309,7,FALSE)=\"\",\"\",VLOOKUP($A24,[1]BD!$E$289:$K$309,7,FALSE)))","v":""},1]
["Maurício Júnior",{"$f":"IF(ISERROR(VLOOKUP($A25,[1]BD!$E$2:$K$29,7,FALSE)),\"\",IF(VLOOKUP($A25,[1]BD!$E$2:$K$29,7,FALSE)=\"\",\"\",VLOOKUP($A25,[1]BD!$E$2:$K$29,7,FALSE)))","v":""},{"$f":"IF(ISERROR(VLOOKUP($A25,[1]BD!$E$30:$K$62,7,FALSE)),\"\",IF(VLOOKUP($A25,[1]BD!$E$30:$K$62,7,FALSE)=\"\",\"\",VLOOKUP($A25,[1]BD!$E$30:$K$62,7,FALSE)))","v":""},{"$f":"IF(ISERROR(VLOOKUP($A25,[1]BD!$E$63:$K$93,7,FALSE)),\"\",IF(VLOOKUP($A25,[1]BD!$E$63:$K$93,7,FALSE)=\"\",\"\",VLOOKUP($A25,[1]BD!$E$63:$K$93,7,FALSE)))","v":""},{"$f":"IF(ISERROR(VLOOKUP($A25,[1]BD!$E$94:$K$124,7,FALSE)),\"\",IF(VLOOKUP($A25,[1]BD!$E$94:$K$124,7,FALSE)=\"\",\"\",VLOOKUP($A25,[1]BD!$E$94:$K$124,7,FALSE)))","v":""},{"$f":"IF(ISERROR(VLOOKUP($A25,[1]BD!$E$125:$K$150,7,FALSE)),\"\",IF(VLOOKUP($A25,[1]BD!$E$125:$K$150,7,FALSE)=\"\",\"\",VLOOKUP($A25,[1]BD!$E$125:$K$150,7,FALSE)))","v":""},{"$f":"IF(ISERROR(VLOOKUP($A25,[1]BD!$E$151:$K$176,7,FALSE)),\"\",IF(VLOOKUP($A25,[1]BD!$E$151:$K$176,7,FALSE)=\"\",\"\",VLOOKUP($A25,[1]BD!$E$151:$K$176,7,FALSE)))","v":""},{"$f":"IF(ISERROR(VLOOKUP($A25,[1]BD!$E$177:$K$197,7,FALSE)),\"\",IF(VLOOKUP($A25,[1]BD!$E$177:$K$197,7,FALSE)=\"\",\"\",VLOOKUP($A25,[1]BD!$E$177:$K$197,7,FALSE)))","v":""},{"$f":"IF(ISERROR(VLOOKUP($A25,[1]BD!$E$198:$K$224,7,FALSE)),\"\",IF(VLOOKUP($A25,[1]BD!$E$198:$K$224,7,FALSE)=\"\",\"\",VLOOKUP($A25,[1]BD!$E$198:$K$224,7,FALSE)))","v":""},{"$f":"IF(ISERROR(VLOOKUP($A25,[1]BD!$E$225:$K$244,7,FALSE)),\"\",IF(VLOOKUP($A25,[1]BD!$E$225:$K$244,7,FALSE)=\"\",\"\",VLOOKUP($A25,[1]BD!$E$225:$K$244,7,FALSE)))","v":""},{"$f":"IF(ISERROR(VLOOKUP($A25,[1]BD!$E$245:$K$260,7,FALSE)),\"\",IF(VLOOKUP($A25,[1]BD!$E$245:$K$260,7,FALSE)=\"\",\"\",VLOOKUP($A25,[1]BD!$E$245:$K$260,7,FALSE)))","v":""},{"$f":"IF(ISERROR(VLOOKUP($A25,[1]BD!$E$261:$K$288,7,FALSE)),\"\",IF(VLOOKUP($A25,[1]BD!$E$261:$K$288,7,FALSE)=\"\",\"\",VLOOKUP($A25,[1]BD!$E$261:$K$288,7,FALSE)))","v":""},{"$f":"IF(ISERROR(VLOOKUP($A25,[1]BD!$E$289:$K$309,7,FALSE)),\"\",IF(VLOOKUP($A25,[1]BD!$E$289:$K$309,7,FALSE)=\"\",\"\",VLOOKUP($A25,[1]BD!$E$289:$K$309,7,FALSE)))","v":"TROCA"},1]
["Pedro Mello",{"$f":"IF(ISERROR(VLOOKUP($A26,[1]BD!$E$2:$K$29,7,FALSE)),\"\",IF(VLOOKUP($A26,[1]BD!$E$2:$K$29,7,FALSE)=\"\",\"\",VLOOKUP($A26,[1]BD!$E$2:$K$29,7,FALSE)))","v":""},{"$f":"IF(ISERROR(VLOOKUP($A26,[1]BD!$E$30:$K$62,7,FALSE)),\"\",IF(VLOOKUP($A26,[1]BD!$E$30:$K$62,7,FALSE)=\"\",\"\",VLOOKUP($A26,[1]BD!$E$30:$K$62,7,FALSE)))","v":""},{"$f":"IF(ISERROR(VLOOKUP($A26,[1]BD!$E$63:$K$93,7,FALSE)),\"\",IF(VLOOKUP($A26,[1]BD!$E$63:$K$93,7,FALSE)=\"\",\"\",VLOOKUP($A26,[1]BD!$E$63:$K$93,7,FALSE)))","v":""},{"$f":"IF(ISERROR(VLOOKUP($A26,[1]BD!$E$94:$K$124,7,FALSE)),\"\",IF(VLOOKUP($A26,[1]BD!$E$94:$K$124,7,FALSE)=\"\",\"\",VLOOKUP($A26,[1]BD!$E$94:$K$124,7,FALSE)))","v":""},{"$f":"IF(ISERROR(VLOOKUP($A26,[1]BD!$E$125:$K$150,7,FALSE)),\"\",IF(VLOOKUP($A26,[1]BD!$E$125:$K$150,7,FALSE)=\"\",\"\",VLOOKUP($A26,[1]BD!$E$125:$K$150,7,FALSE)))","v":""},{"$f":"IF(ISERROR(VLOOKUP($A26,[1]BD!$E$151:$K$176,7,FALSE)),\"\",IF(VLOOKUP($A26,[1]BD!$E$151:$K$176,7,FALSE)=\"\",\"\",VLOOKUP($A26,[1]BD!$E$151:$K$176,7,FALSE)))","v":""},{"$f":"IF(ISERROR(VLOOKUP($A26,[1]BD!$E$177:$K$197,7,FALSE)),\"\",IF(VLOOKUP($A26,[1]BD!$E$177:$K$197,7,FALSE)=\"\",\"\",VLOOKUP($A26,[1]BD!$E$177:$K$197,7,FALSE)))","v":""},{"$f":"IF(ISERROR(VLOOKUP($A26,[1]BD!$E$198:$K$224,7,FALSE)),\"\",IF(VLOOKUP($A26,[1]BD!$E$198:$K$224,7,FALSE)=\"\",\"\",VLOOKUP($A26,[1]BD!$E$198:$K$224,7,FALSE)))","v":""},{"$f":"IF(ISERROR(VLOOKUP($A26,[1]BD!$E$225:$K$244,7,FALSE)),\"\",IF(VLOOKUP($A26,[1]BD!$E$225:$K$244,7,FALSE)=\"\",\"\",VLOOKUP($A26,[1]BD!$E$225:$K$244,7,FALSE)))","v":""},{"$f":"IF(ISERROR(VLOOKUP($A26,[1]BD!$E$245:$K$260,7,FALSE)),\"\",IF(VLOOKUP($A26,[1]BD!$E$245:$K$260,7,FALSE)=\"\",\"\",VLOOKUP($A26,[1]BD!$E$245:$K$260,7,FALSE)))","v":""},{"$f":"IF(ISERROR(VLOOKUP($A26,[1]BD!$E$261:$K$288,7,FALSE)),\"\",IF(VLOOKUP($A26,[1]BD!$E$261:$K$288,7,FALSE)=\"\",\"\",VLOOKUP($A26,[1]BD!$E$261:$K$288,7,FALSE)))","v":""},{"$f":"IF(ISERROR(VLOOKUP($A26,[1]BD!$E$289:$K$309,7,FALSE)),\"\",IF(VLOOKUP($A26,[1]BD!$E$289:$K$309,7,FALSE)=\"\",\"\",VLOOKUP($A26,[1]BD!$E$289:$K$309,7,FALSE)))","v":""},0]
["Raphael Reis",{"$f":"IF(ISERROR(VLOOKUP($A27,[1]BD!$E$2:$K$29,7,FALSE)),\"\",IF(VLOOKUP($A27,[1]BD!$E$2:$K$29,7,FALSE)=\"\",\"\",VLOOKUP($A27,[1]BD!$E$2:$K$29,7,FALSE)))","v":""},{"$f":"IF(ISERROR(VLOOKUP($A27,[1]BD!$E$30:$K$62,7,FALSE)),\"\",IF(VLOOKUP($A27,[1]BD!$E$30:$K$62,7,FALSE)=\"\",\"\",VLOOKUP($A27,[1]BD!$E$30:$K$62,7,FALSE)))","v":""},{"$f":"IF(ISERROR(VLOOKUP($A27,[1]BD!$E$63:$K$93,7,FALSE)),\"\",IF(VLOOKUP($A27,[1]BD!$E$63:$K$93,7,FALSE)=\"\",\"\",VLOOKUP($A27,[1]BD!$E$63:$K$93,7,FALSE)))","v":""},{"$f":"IF(ISERROR(VLOOKUP($A27,[1]BD!$E$94:$K$124,7,FALSE)),\"\",IF(VLOOKUP($A27,[1]BD!$E$94:$K$124,7,FALSE)=\"\",\"\",VLOOKUP($A27,[1]BD!$E$94:$K$124,7,FALSE)))","v":""},{"$f":"IF(ISERROR(VLOOKUP($A27,[1]BD!$E$125:$K$150,7,FALSE)),\"\",IF(VLOOKUP($A27,[1]BD!$E$125:$K$150,7,FALSE)=\"\",\"\",VLOOKUP($A27,[1]BD!$E$125:$K$150,7,FALSE)))","v":""},{"$f":"IF(ISERROR(VLOOKUP($A27,[1]BD!$E$151:$K$176,7,FALSE)),\"\",IF(VLOOKUP($A27,[1]BD!$E$151:$K$176,7,FALSE)=\"\",\"\",VLOOKUP($A27,[1]BD!$E$151:$K$176,7,FALSE)))","v":""},{"$f":"IF(ISERROR(VLOOKUP($A27,[1]BD!$E$177:$K$197,7,FALSE)),\"\",IF(VLOOKUP($A27,[1]BD!$E$177:$K$197,7,FALSE)=\"\",\"\",VLOOKUP($A27,[1]BD!$E$177:$K$197,7,FALSE)))","v":""},{"$f":"IF(ISERROR(VLOOKUP($A27,[1]BD!$E$198:$K$224,7,FALSE)),\"\",IF(VLOOKUP($A27,[1]BD!$E$198:$K$224,7,FALSE)=\"\",\"\",VLOOKUP($A27,[1]BD!$E$198:$K$224,7,FALSE)))","v":""},{"$f":"IF(ISERROR(VLOOKUP($A27,[1]BD!$E$225:$K$244,7,FALSE)),\"\",IF(VLOOKUP($A27,[1]BD!$E$225:$K$244,7,FALSE)=\"\",\"\",VLOOKUP($A27,[1]BD!$E$225:$K$244,7,FALSE)))","v":""},{"$f":"IF(ISERROR(VLOOKUP($A27,[1]BD!$E$245:$K$260,7,FALSE)),\"\",IF(VLOOKUP($A27,[1]BD!$E$245:$K$260,7,FALSE)=\"\",\"\",VLOOKUP($A27,[1]BD!$E$245:$K$260,7,FALSE)))","v":""},{"$f":"IF(ISERROR(VLOOKUP($A27,[1]BD!$E$261:$K$288,7,FALSE)),\"\",IF(VLOOKUP($A27,[1]BD!$E$261:$K$288,7,FALSE)=\"\",\"\",VLOOKUP($A27,[1]BD!$E$261:$K$288,7,FALSE)))","v":""},{"$f":"IF(ISERROR(VLOOKUP($A27,[1]BD!$E$289:$K$309,7,FALSE)),\"\",IF(VLOOKUP($A27,[1]BD!$E$289:$K$309,7,FALSE)=\"\",\"\",VLOOKUP($A27,[1]BD!$E$289:$K$309,7,FALSE)))","v":""},0]
["Reila Ricardo",{"$f":"IF(ISERROR(VLOOKUP($A28,[1]BD!$E$2:$K$29,7,FALSE)),\"\",IF(VLOOKUP($A28,[1]BD!$E$2:$K$29,7,FALSE)=\"\",\"\",VLOOKUP($A28,[1]BD!$E$2:$K$29,7,FALSE)))","v":""},{"$f":"IF(ISERROR(VLOOKUP($A28,[1]BD!$E$30:$K$62,7,FALSE)),\"\",IF(VLOOKUP($A28,[1]BD!$E$30:$K$62,7,FALSE)=\"\",\"\",VLOOKUP($A28,[1]BD!$E$30:$K$62,7,FALSE)))","v":""},{"$f":"IF(ISERROR(VLOOKUP($A28,[1]BD!$E$63:$K$93,7,FALSE)),\"\",IF(VLOOKUP($A28,[1]BD!$E$63:$K$93,7,FALSE)=\"\",\"\",VLOOKUP($A28,[1]BD!$E$63:$K$93,7,FALSE)))","v":""},{"$f":"IF(ISERROR(VLOOKUP($A28,[1]BD!$E$94:$K$124,7,FALSE)),\"\",IF(VLOOKUP($A28,[1]BD!$E$94:$K$124,7,FALSE)=\"\",\"\",VLOOKUP($A28,[1]BD!$E$94:$K$124,7,FALSE)))","v":""},{"$f":"IF(ISERROR(VLOOKUP($A28,[1]BD!$E$125:$K$150,7,FALSE)),\"\",IF(VLOOKUP($A28,[1]BD!$E$125:$K$150,7,FALSE)=\"\",\"\",VLOOKUP($A28,[1]BD!$E$125:$K$150,7,FALSE)))","v":""},{"$f":"IF(ISERROR(VLOOKUP($A28,[1]BD!$E$151:$K$176,7,FALSE)),\"\",IF(VLOOKUP($A28,[1]BD!$E$151:$K$176,7,FALSE)=\"\",\"\",VLOOKUP($A28,[1]BD!$E$151:$K$176,7,FALSE)))","v":""},{"$f":"IF(ISERROR(VLOOKUP($A28,[1]BD!$E$177:$K$197,7,FALSE)),\"\",IF(VLOOKUP($A28,[1]BD!$E$177:$K$197,7,FALSE)=\"\",\"\",VLOOKUP($A28,[1]BD!$E$177:$K$197,7,FALSE)))","v":""},{"$f":"IF(ISERROR(VLOOKUP($A28,[1]BD!$E$198:$K$224,7,FALSE)),\"\",IF(VLOOKUP($A28,[1]BD!$E$198:$K$224,7,FALSE)=\"\",\"\",VLOOKUP($A28,[1]BD!$E$198:$K$224,7,FALSE)))","v":""},{"$f":"IF(ISERROR(VLOOKUP($A28,[1]BD!$E$225:$K$244,7,FALSE)),\"\",IF(VLOOKUP($A28,[1]BD!$E$225:$K$244,7,FALSE)=\"\",\"\",VLOOKUP($A28,[1]BD!$E$225:$K$244,7,FALSE)))","v":"TROCA"},{"$f":"IF(ISERROR(VLOOKUP($A28,[1]BD!$E$245:$K$260,7,FALSE)),\"\",IF(VLOOKUP($A28,[1]BD!$E$245:$K$260,7,FALSE)=\"\",\"\",VLOOKUP($A28,[1]BD!$E$245:$K$260,7,FALSE)))","v":""},{"$f":"IF(ISERROR(VLOOKUP($A28,[1]BD!$E$261:$K$288,7,FALSE)),\"\",IF(VLOOKUP($A28,[1]BD!$E$261:$K$288,7,FALSE)=\"\",\"\",VLOOKUP($A28,[1]BD!$E$261:$K$288,7,FALSE)))","v":""},{"$f":"IF(ISERROR(VLOOKUP($A28,[1]BD!$E$289:$K$309,7,FALSE)),\"\",IF(VLOOKUP($A28,[1]BD!$E$289:$K$309,7,FALSE)=\"\",\"\",VLOOKUP($A28,[1]BD!$E$289:$K$309,7,FALSE)))","v":""},1]
["Renato Amaral",{"$f":"IF(ISERROR(VLOOKUP($A29,[1]BD!$E$2:$K$29,7,FALSE)),\"\",IF(VLOOKUP($A29,[1]BD!$E$2:$K$29,7,FALSE)=\"\",\"\",VLOOKUP($A29,[1]BD!$E$2:$K$29,7,FALSE)))","v":""},{"$f":"IF(ISERROR(VLOOKUP($A29,[1]BD!$E$30:$K$62,7,FALSE)),\"\",IF(VLOOKUP($A29,[1]BD!$E$30:$K$62,7,FALSE)=\"\",\"\",VLOOKUP($A29,[1]BD!$E$30:$K$62,7,FALSE)))","v":""},{"$f":"IF(ISERROR(VLOOKUP($A29,[1]BD!$E$63:$K$93,7,FALSE)),\"\",IF(VLOOKUP($A29,[1]BD!$E$63:$K$93,7,FALSE)=\"\",\"\",VLOOKUP($A29,[1]BD!$E$63:$K$93,7,FALSE)))","v":""},{"$f":"IF(ISERROR(VLOOKUP($A29,[1]BD!$E$94:$K$124,7,FALSE)),\"\",IF(VLOOKUP($A29,[1]BD!$E$94:$K$124,7,FALSE)=\"\",\"\",VLOOKUP($A29,[1]BD!$E$94:$K$124,7,FALSE)))","v":""},{"$f":"IF(ISERROR(VLOOKUP($A29,[1]BD!$E$125:$K$150,7,FALSE)),\"\",IF(VLOOKUP($A29,[1]BD!$E$125:$K$150,7,FALSE)=\"\",\"\",VLOOKUP($A29,[1]BD!$E$125:$K$150,7,FALSE)))","v":""},{"$f":"IF(ISERROR(VLOOKUP($A29,[1]BD!$E$151:$K$176,7,FALSE)),\"\",IF(VLOOKUP($A29,[1]BD!$E$151:$K$176,7,FALSE)=\"\",\"\",VLOOKUP($A29,[1]BD!$E$151:$K$176,7,FALSE)))","v":""},{"$f":"IF(ISERROR(VLOOKUP($A29,[1]BD!$E$177:$K$197,7,FALSE)),\"\",IF(VLOOKUP($A29,[1]BD!$E$177:$K$197,7,FALSE)=\"\",\"\",VLOOKUP($A29,[1]BD!$E$177:$K$197,7,FALSE)))","v":""},{"$f":"IF(ISERROR(VLOOKUP($A29,[1]BD!$E$198:$K$224,7,FALSE)),\"\",IF(VLOOKUP($A29,[1]BD!$E$198:$K$224,7,FALSE)=\"\",\"\",VLOOKUP($A29,[1]BD!$E$198:$K$224,7,FALSE)))","v":""},{"$f":"IF(ISERROR(VLOOKUP($A29,[1]BD!$E$225:$K$244,7,FALSE)),\"\",IF(VLOOKUP($A29,[1]BD!$E$225:$K$244,7,FALSE)=\"\",\"\",VLOOKUP($A29,[1]BD!$E$225:$K$244,7,FALSE)))","v":""},{"$f":"IF(ISERROR(VLOOKUP($A29,[1]BD!$E$245:$K$260,7,FALSE)),\"\",IF(VLOOKUP($A29,[1]BD!$E$245:$K$260,7,FALSE)=\"\",\"\",VLOOKUP($A29,[1]BD!$E$245:$K$260,7,FALSE)))","v":""},{"$f":"IF(ISERROR(VLOOKUP($A29,[1]BD!$E$261:$K$288,7,FALSE)),\"\",IF(VLOOKUP($A29,[1]BD!$E$261:$K$288,7,FALSE)=\"\",\"\",VLOOKUP($A29,[1]BD!$E$261:$K$288,7,FALSE)))","v":""},{"$f":"IF(ISERROR(VLOOKUP($A29,[1]BD!$E$289:$K$309,7,FALSE)),\"\",IF(VLOOKUP($A29,[1]BD!$E$289:$K$309,7,FALSE)=\"\",\"\",VLOOKUP($A29,[1]BD!$E$289:$K$309,7,FALSE)))","v":""},0]
["Rodrigo Mercadante",{"$f":"IF(ISERROR(VLOOKUP($A30,[1]BD!$E$2:$K$29,7,FALSE)),\"\",IF(VLOOKUP($A30,[1]BD!$E$2:$K$29,7,FALSE)=\"\",\"\",VLOOKUP($A30,[1]BD!$E$2:$K$29,7,FALSE)))","v":""},{"$f":"IF(ISERROR(VLOOKUP($A30,[1]BD!$E$30:$K$62,7,FALSE)),\"\",IF(VLOOKUP($A30,[1]BD!$E$30:$K$62,7,FALSE)=\"\",\"\",VLOOKUP($A30,[1]BD!$E$30:$K$62,7,FALSE)))","v":""},{"$f":"IF(ISERROR(VLOOKUP($A30,[1]BD!$E$63:$K$93,7,FALSE)),\"\",IF(VLOOKUP($A30,[1]BD!$E$63:$K$93,7,FALSE)=\"\",\"\",VLOOKUP($A30,[1]BD!$E$63:$K$93,7,FALSE)))","v":""},{"$f":"IF(ISERROR(VLOOKUP($A30,[1]BD!$E$94:$K$124,7,FALSE)),\"\",IF(VLOOKUP($A30,[1]BD!$E$94:$K$124,7,FALSE)=\"\",\"\",VLOOKUP($A30,[1]BD!$E$94:$K$124,7,FALSE)))","v":""},{"$f":"IF(ISERROR(VLOOKUP($A30,[1]BD!$E$125:$K$150,7,FALSE)),\"\",IF(VLOOKUP($A30,[1]BD!$E$125:$K$150,7,FALSE)=\"\",\"\",VLOOKUP($A30,[1]BD!$E$125:$K$150,7,FALSE)))","v":""},{"$f":"IF(ISERROR(VLOOKUP($A30,[1]BD!$E$151:$K$176,7,FALSE)),\"\",IF(VLOOKUP($A30,[1]BD!$E$151:$K$176,7,FALSE)=\"\",\"\",VLOOKUP($A30,[1]BD!$E$151:$K$176,7,FALSE)))","v":""},{"$f":"IF(ISERROR(VLOOKUP($A30,[1]BD!$E$177:$K$197,7,FALSE)),\"\",IF(VLOOKUP($A30,[1]BD!$E$177:$K$197,7,FALSE)=\"\",\"\",VLOOKUP($A30,[1]BD!$E$177:$K$197,7,FALSE)))","v":""},{"$f":"IF(ISERROR(VLOOKUP($A30,[1]BD!$E$198:$K$224,7,FALSE)),\"\",IF(VLOOKUP($A30,[1]BD!$E$198:$K$224,7,FALSE)=\"\",\"\",VLOOKUP($A30,[1]BD!$E$198:$K$224,7,FALSE)))","v":""},{"$f":"IF(ISERROR(VLOOKUP($A30,[1]BD!$E$225:$K$244,7,FALSE)),\"\",IF(VLOOKUP($A30,[1]BD!$E$225:$K$244,7,FALSE)=\"\",\"\",VLOOKUP($A30,[1]BD!$E$225:$K$244,7,FALSE)))","v":""},{"$f":"IF(ISERROR(VLOOKUP($A30,[1]BD!$E$245:$K$260,7,FALSE)),\"\",IF(VLOOKUP($A30,[1]BD!$E$245:$K$260,7,FALSE)=\"\",\"\",VLOOKUP($A30,[1]BD!$E$245:$K$260,7,FALSE)))","v":""},{"$f":"IF(ISERROR(VLOOKUP($A30,[1]BD!$E$261:$K$288,7,FALSE)),\"\",IF(VLOOKUP($A30,[1]BD!$E$261:$K$288,7,FALSE)=\"\",\"\",VLOOKUP($A30,[1]BD!$E$261:$K$288,7,FALSE)))","v":""},{"$f":"IF(ISERROR(VLOOKUP($A30,[1]BD!$E$289:$K$309,7,FALSE)),\"\",IF(VLOOKUP($A30,[1]BD!$E$289:$K$309,7,FALSE)=\"\",\"\",VLOOKUP($A30,[1]BD!$E$289:$K$309,7,FALSE)))","v":""},0]
["Rodrigo Ricardo",{"$f":"IF(ISERROR(VLOOKUP($A31,[1]BD!$E$2:$K$29,7,FALSE)),\"\",IF(VLOOKUP($A31,[1]BD!$E$2:$K$29,7,FALSE)=\"\",\"\",VLOOKUP($A31,[1]BD!$E$2:$K$29,7,FALSE)))","v":""},{"$f":"IF(ISERROR(VLOOKUP($A31,[1]BD!$E$30:$K$62,7,FALSE)),\"\",IF(VLOOKUP($A31,[1]BD!$E$30:$K$62,7,FALSE)=\"\",\"\",VLOOKUP($A31,[1]BD!$E$30:$K$62,7,FALSE)))","v":""},{"$f":"IF(ISERROR(VLOOKUP($A31,[1]BD!$E$63:$K$93,7,FALSE)),\"\",IF(VLOOKUP($A31,[1]BD!$E$63:$K$93,7,FALSE)=\"\",\"\",VLOOKUP($A31,[1]BD!$E$63:$K$93,7,FALSE)))","v":"TROCA"},{"$f":"IF(ISERROR(VLOOKUP($A31,[1]BD!$E$94:$K$124,7,FALSE)),\"\",IF(VLOOKUP($A31,[1]BD!$E$94:$K$124,7,FALSE)=\"\",\"\",VLOOKUP($A31,[1]BD!$E$94:$K$124,7,FALSE)))","v":""},{"$f":"IF(ISERROR(VLOOKUP($A31,[1]BD!$E$125:$K$150,7,FALSE)),\"\",IF(VLOOKUP($A31,[1]BD!$E$125:$K$150,7,FALSE)=\"\",\"\",VLOOKUP($A31,[1]BD!$E$125:$K$150,7,FALSE)))","v":""},{"$f":"IF(ISERROR(VLOOKUP($A31,[1]BD!$E$151:$K$176,7,FALSE)),\"\",IF(VLOOKUP($A31,[1]BD!$E$151:$K$176,7,FALSE)=\"\",\"\",VLOOKUP($A31,[1]BD!$E$151:$K$176,7,FALSE)))","v":""},{"$f":"IF(ISERROR(VLOOKUP($A31,[1]BD!$E$177:$K$197,7,FALSE)),\"\",IF(VLOOKUP($A31,[1]BD!$E$177:$K$197,7,FALSE)=\"\",\"\",VLOOKUP($A31,[1]BD!$E$177:$K$197,7,FALSE)))","v":""},{"$f":"IF(ISERROR(VLOOKUP($A31,[1]BD!$E$198:$K$224,7,FALSE)),\"\",IF(VLOOKUP($A31,[1]BD!$E$198:$K$224,7,FALSE)=\"\",\"\",VLOOKUP($A31,[1]BD!$E$198:$K$224,7,FALSE)))","v":""},{"$f":"IF(ISERROR(VLOOKUP($A31,[1]BD!$E$225:$K$244,7,FALSE)),\"\",IF(VLOOKUP($A31,[1]BD!$E$225:$K$244,7,FALSE)=\"\",\"\",VLOOKUP($A31,[1]BD!$E$225:$K$244,7,FALSE)))","v":""},{"$f":"IF(ISERROR(VLOOKUP($A31,[1]BD!$E$245:$K$260,7,FALSE)),\"\",IF(VLOOKUP($A31,[1]BD!$E$245:$K$260,7,FALSE)=\"\",\"\",VLOOKUP($A31,[1]BD!$E$245:$K$260,7,FALSE)))","v":""},{"$f":"IF(ISERROR(VLOOKUP($A31,[1]BD!$E$261:$K$288,7,FALSE)),\"\",IF(VLOOKUP($A31,[1]BD!$E$261:$K$288,7,FALSE)=\"\",\"\",VLOOKUP($A31,[1]BD!$E$261:$K$288,7,FALSE)))","v":""},{"$f":"IF(ISERROR(VLOOKUP($A31,[1]BD!$E$289:$K$309,7,FALSE)),\"\",IF(VLOOKUP($A31,[1]BD!$E$289:$K$309,7,FALSE)=\"\",\"\",VLOOKUP($A31,[1]BD!$E$289:$K$309,7,FALSE)))","v":""},1]
["Tati Marcondes",{"$f":"IF(ISERROR(VLOOKUP($A32,[1]BD!$E$2:$K$29,7,FALSE)),\"\",IF(VLOOKUP($A32,[1]BD!$E$2:$K$29,7,FALSE)=\"\",\"\",VLOOKUP($A32,[1]BD!$E$2:$K$29,7,FALSE)))","v":""},{"$f":"IF(ISERROR(VLOOKUP($A32,[1]BD!$E$30:$K$62,7,FALSE)),\"\",IF(VLOOKUP($A32,[1]BD!$E$30:$K$62,7,FALSE)=\"\",\"\",VLOOKUP($A32,[1]BD!$E$30:$K$62,7,FALSE)))","v":""},{"$f":"IF(ISERROR(VLOOKUP($A32,[1]BD!$E$63:$K$93,7,FALSE)),\"\",IF(VLOOKUP($A32,[1]BD!$E$63:$K$93,7,FALSE)=\"\",\"\",VLOOKUP($A32,[1]BD!$E$63:$K$93,7,FALSE)))","v":""},{"$f":"IF(ISERROR(VLOOKUP($A32,[1]BD!$E$94:$K$124,7,FALSE)),\"\",IF(VLOOKUP($A32,[1]BD!$E$94:$K$124,7,FALSE)=\"\",\"\",VLOOKUP($A32,[1]BD!$E$94:$K$124,7,FALSE)))","v":""},{"$f":"IF(ISERROR(VLOOKUP($A32,[1]BD!$E$125:$K$150,7,FALSE)),\"\",IF(VLOOKUP($A32,[1]BD!$E$125:$K$150,7,FALSE)=\"\",\"\",VLOOKUP($A32,[1]BD!$E$125:$K$150,7,FALSE)))","v":""},{"$f":"IF(ISERROR(VLOOKUP($A32,[1]BD!$E$151:$K$176,7,FALSE)),\"\",IF(VLOOKUP($A32,[1]BD!$E$151:$K$176,7,FALSE)=\"\",\"\",VLOOKUP($A32,[1]BD!$E$151:$K$176,7,FALSE)))","v":""},{"$f":"IF(ISERROR(VLOOKUP($A32,[1]BD!$E$177:$K$197,7,FALSE)),\"\",IF(VLOOKUP($A32,[1]BD!$E$177:$K$197,7,FALSE)=\"\",\"\",VLOOKUP($A32,[1]BD!$E$177:$K$197,7,FALSE)))","v":""},{"$f":"IF(ISERROR(VLOOKUP($A32,[1]BD!$E$198:$K$224,7,FALSE)),\"\",IF(VLOOKUP($A32,[1]BD!$E$198:$K$224,7,FALSE)=\"\",\"\",VLOOKUP($A32,[1]BD!$E$198:$K$224,7,FALSE)))","v":""},{"$f":"IF(ISERROR(VLOOKUP($A32,[1]BD!$E$225:$K$244,7,FALSE)),\"\",IF(VLOOKUP($A32,[1]BD!$E$225:$K$244,7,FALSE)=\"\",\"\",VLOOKUP($A32,[1]BD!$E$225:$K$244,7,FALSE)))","v":""},{"$f":"IF(ISERROR(VLOOKUP($A32,[1]BD!$E$245:$K$260,7,FALSE)),\"\",IF(VLOOKUP($A32,[1]BD!$E$245:$K$260,7,FALSE)=\"\",\"\",VLOOKUP($A32,[1]BD!$E$245:$K$260,7,FALSE)))","v":""},{"$f":"IF(ISERROR(VLOOKUP($A32,[1]BD!$E$261:$K$288,7,FALSE)),\"\",IF(VLOOKUP($A32,[1]BD!$E$261:$K$288,7,FALSE)=\"\",\"\",VLOOKUP($A32,[1]BD!$E$261:$K$288,7,FALSE)))","v":""},{"$f":"IF(ISERROR(VLOOKUP($A32,[1]BD!$E$289:$K$309,7,FALSE)),\"\",IF(VLOOKUP($A32,[1]BD!$E$289:$K$309,7,FALSE)=\"\",\"\",VLOOKUP($A32,[1]BD!$E$289:$K$309,7,FALSE)))","v":""},0]
["Wesley Bambirra",{"$f":"IF(ISERROR(VLOOKUP($A33,[1]BD!$E$2:$K$29,7,FALSE)),\"\",IF(VLOOKUP($A33,[1]BD!$E$2:$K$29,7,FALSE)=\"\",\"\",VLOOKUP($A33,[1]BD!$E$2:$K$29,7,FALSE)))","v":""},{"$f":"IF(ISERROR(VLOOKUP($A33,[1]BD!$E$30:$K$62,7,FALSE)),\"\",IF(VLOOKUP($A33,[1]BD!$E$30:$K$62,7,FALSE)=\"\",\"\",VLOOKUP($A33,[1]BD!$E$30:$K$62,7,FALSE)))","v":"TROCA"},{"$f":"IF(ISERROR(VLOOKUP($A33,[1]BD!$E$63:$K$93,7,FALSE)),\"\",IF(VLOOKUP($A33,[1]BD!$E$63:$K$93,7,FALSE)=\"\",\"\",VLOOKUP($A33,[1]BD!$E$63:$K$93,7,FALSE)))","v":""},{"$f":"IF(ISERROR(VLOOKUP($A33,[1]BD!$E$94:$K$124,7,FALSE)),\"\",IF(VLOOKUP($A33,[1]BD!$E$94:$K$124,7,FALSE)=\"\",\"\",VLOOKUP($A33,[1]BD!$E$94:$K$124,7,FALSE)))","v":""},{"$f":"IF(ISERROR(VLOOKUP($A33,[1]BD!$E$125:$K$150,7,FALSE)),\"\",IF(VLOOKUP($A33,[1]BD!$E$125:$K$150,7,FALSE)=\"\",\"\",VLOOKUP($A33,[1]BD!$E$125:$K$150,7,FALSE)))","v":""},{"$f":"IF(ISERROR(VLOOKUP($A33,[1]BD!$E$151:$K$176,7,FALSE)),\"\",IF(VLOOKUP($A33,[1]BD!$E$151:$K$176,7,FALSE)=\"\",\"\",VLOOKUP($A33,[1]BD!$E$151:$K$176,7,FALSE)))","v":""},{"$f":"IF(ISERROR(VLOOKUP($A33,[1]BD!$E$177:$K$197,7,FALSE)),\"\",IF(VLOOKUP($A33,[1]BD!$E$177:$K$197,7,FALSE)=\"\",\"\",VLOOKUP($A33,[1]BD!$E$177:$K$197,7,FALSE)))","v":""},{"$f":"IF(ISERROR(VLOOKUP($A33,[1]BD!$E$198:$K$224,7,FALSE)),\"\",IF(VLOOKUP($A33,[1]BD!$E$198:$K$224,7,FALSE)=\"\",\"\",VLOOKUP($A33,[1]BD!$E$198:$K$224,7,FALSE)))","v":""},{"$f":"IF(ISERROR(VLOOKUP($A33,[1]BD!$E$225:$K$244,7,FALSE)),\"\",IF(VLOOKUP($A33,[1]BD!$E$225:$K$244,7,FALSE)=\"\",\"\",VLOOKUP($A33,[1]BD!$E$225:$K$244,7,FALSE)))","v":""},{"$f":"IF(ISERROR(VLOOKUP($A33,[1]BD!$E$245:$K$260,7,FALSE)),\"\",IF(VLOOKUP($A33,[1]BD!$E$245:$K$260,7,FALSE)=\"\",\"\",VLOOKUP($A33,[1]BD!$E$245:$K$260,7,FALSE)))","v":""},{"$f":"IF(ISERROR(VLOOKUP($A33,[1]BD!$E$261:$K$288,7,FALSE)),\"\",IF(VLOOKUP($A33,[1]BD!$E$261:$K$288,7,FALSE)=\"\",\"\",VLOOKUP($A33,[1]BD!$E$261:$K$288,7,FALSE)))","v":"TROCA"},{"$f":"IF(ISERROR(VLOOKUP($A33,[1]BD!$E$289:$K$309,7,FALSE)),\"\",IF(VLOOKUP($A33,[1]BD!$E$289:$K$309,7,FALSE)=\"\",\"\",VLOOKUP($A33,[1]BD!$E$289:$K$309,7,FALSE)))","v":""},2]
["Wesley Camargos",{"$f":"IF(ISERROR(VLOOKUP($A34,[1]BD!$E$2:$K$29,7,FALSE)),\"\",IF(VLOOKUP($A34,[1]BD!$E$2:$K$29,7,FALSE)=\"\",\"\",VLOOKUP($A34,[1]BD!$E$2:$K$29,7,FALSE)))","v":""},{"$f":"IF(ISERROR(VLOOKUP($A34,[1]BD!$E$30:$K$62,7,FALSE)),\"\",IF(VLOOKUP($A34,[1]BD!$E$30:$K$62,7,FALSE)=\"\",\"\",VLOOKUP($A34,[1]BD!$E$30:$K$62,7,FALSE)))","v":""},{"$f":"IF(ISERROR(VLOOKUP($A34,[1]BD!$E$63:$K$93,7,FALSE)),\"\",IF(VLOOKUP($A34,[1]BD!$E$63:$K$93,7,FALSE)=\"\",\"\",VLOOKUP($A34,[1]BD!$E$63:$K$93,7,FALSE)))","v":""},{"$f":"IF(ISERROR(VLOOKUP($A34,[1]BD!$E$94:$K$124,7,FALSE)),\"\",IF(VLOOKUP($A34,[1]BD!$E$94:$K$124,7,FALSE)=\"\",\"\",VLOOKUP($A34,[1]BD!$E$94:$K$124,7,FALSE)))","v":""},{"$f":"IF(ISERROR(VLOOKUP($A34,[1]BD!$E$125:$K$150,7,FALSE)),\"\",IF(VLOOKUP($A34,[1]BD!$E$125:$K$150,7,FALSE)=\"\",\"\",VLOOKUP($A34,[1]BD!$E$125:$K$150,7,FALSE)))","v":""},{"$f":"IF(ISERROR(VLOOKUP($A34,[1]BD!$E$151:$K$176,7,FALSE)),\"\",IF(VLOOKUP($A34,[1]BD!$E$151:$K$176,7,FALSE)=\"\",\"\",VLOOKUP($A34,[1]BD!$E$151:$K$176,7,FALSE)))","v":""},{"$f":"IF(ISERROR(VLOOKUP($A34,[1]BD!$E$177:$K$197,7,FALSE)),\"\",IF(VLOOKUP($A34,[1]BD!$E$177:$K$197,7,FALSE)=\"\",\"\",VLOOKUP($A34,[1]BD!$E$177:$K$197,7,FALSE)))","v":""},{"$f":"IF(ISERROR(VLOOKUP($A34,[1]BD!$E$198:$K$224,7,FALSE)),\"\",IF(VLOOKUP($A34,[1]BD!$E$198:$K$224,7,FALSE)=\"\",\"\",VLOOKUP($A34,[1]BD!$E$198:$K$224,7,FALSE)))","v":""},{"$f":"IF(ISERROR(VLOOKUP($A34,[1]BD!$E$225:$K$244,7,FALSE)),\"\",IF(VLOOKUP($A34,[1]BD!$E$225:$K$244,7,FALSE)=\"\",\"\",VLOOKUP($A34,[1]BD!$E$225:$K$244,7,FALSE)))","v":""},{"$f":"IF(ISERROR(VLOOKUP($A34,[1]BD!$E$245:$K$260,7,FALSE)),\"\",IF(VLOOKUP($A34,[1]BD!$E$245:$K$260,7,FALSE)=\"\",\"\",VLOOKUP($A34,[1]BD!$E$245:$K$260,7,FALSE)))","v":""},{"$f":"IF(ISERROR(VLOOKUP($A34,[1]BD!$E$261:$K$288,7,FALSE)),\"\",IF(VLOOKUP($A34,[1]BD!$E$261:$K$288,7,FALSE)=\"\",\"\",VLOOKUP($A34,[1]BD!$E$261:$K$288,7,FALSE)))","v":""},{"$f":"IF(ISERROR(VLOOKUP($A34,[1]BD!$E$289:$K$309,7,FALSE)),\"\",IF(VLOOKUP($A34,[1]BD!$E$289:$K$309,7,FALSE)=\"\",\"\",VLOOKUP($A34,[1]BD!$E$289:$K$309,7,FALSE)))","v":""},0]
["Wesley Canuto",{"$f":"IF(ISERROR(VLOOKUP($A35,[1]BD!$E$2:$K$29,7,FALSE)),\"\",IF(VLOOKUP($A35,[1]BD!$E$2:$K$29,7,FALSE)=\"\",\"\",VLOOKUP($A35,[1]BD!$E$2:$K$29,7,FALSE)))","v":""},{"$f":"IF(ISERROR(VLOOKUP($A35,[1]BD!$E$30:$K$62,7,FALSE)),\"\",IF(VLOOKUP($A35,[1]BD!$E$30:$K$62,7,FALSE)=\"\",\"\",VLOOKUP($A35,[1]BD!$E$30:$K$62,7,FALSE)))","v":""},{"$f":"IF(ISERROR(VLOOKUP($A35,[1]BD!$E$63:$K$93,7,FALSE)),\"\",IF(VLOOKUP($A35,[1]BD!$E$63:$K$93,7,FALSE)=\"\",\"\",VLOOKUP($A35,[1]BD!$E$63:$K$93,7,FALSE)))","v":""},{"$f":"IF(ISERROR(VLOOKUP($A35,[1]BD!$E$94:$K$124,7,FALSE)),\"\",IF(VLOOKUP($A35,[1]BD!$E$94:$K$124,7,FALSE)=\"\",\"\",VLOOKUP($A35,[1]BD!$E$94:$K$124,7,FALSE)))","v":""},{"$f":"IF(ISERROR(VLOOKUP($A35,[1]BD!$E$125:$K$150,7,FALSE)),\"\",IF(VLOOKUP($A35,[1]BD!$E$125:$K$150,7,FALSE)=\"\",\"\",VLOOKUP($A35,[1]BD!$E$125:$K$150,7,FALSE)))","v":""},{"$f":"IF(ISERROR(VLOOKUP($A35,[1]BD!$E$151:$K$176,7,FALSE)),\"\",IF(VLOOKUP($A35,[1]BD!$E$151:$K$176,7,FALSE)=\"\",\"\",VLOOKUP($A35,[1]BD!$E$151:$K$176,7,FALSE)))","v":""},{"$f":"IF(ISERROR(VLOOKUP($A35,[1]BD!$E$177:$K$197,7,FALSE)),\"\",IF(VLOOKUP($A35,[1]BD!$E$177:$K$197,7,FALSE)=\"\",\"\",VLOOKUP($A35,[1]BD!$E$177:$K$197,7,FALSE)))","v":""},{"$f":"IF(ISERROR(VLOOKUP($A35,[1]BD!$E$198:$K$224,7,FALSE)),\"\",IF(VLOOKUP($A35,[1]BD!$E$198:$K$224,7,FALSE)=\"\",\"\",VLOOKUP($A35,[1]BD!$E$198:$K$224,7,FALSE)))","v":""},{"$f":"IF(ISERROR(VLOOKUP($A35,[1]BD!$E$225:$K$244,7,FALSE)),\"\",IF(VLOOKUP($A35,[1]BD!$E$225:$K$244,7,FALSE)=\"\",\"\",VLOOKUP($A35,[1]BD!$E$225:$K$244,7,FALSE)))","v":""},{"$f":"IF(ISERROR(VLOOKUP($A35,[1]BD!$E$245:$K$260,7,FALSE)),\"\",IF(VLOOKUP($A35,[1]BD!$E$245:$K$260,7,FALSE)=\"\",\"\",VLOOKUP($A35,[1]BD!$E$245:$K$260,7,FALSE)))","v":""},{"$f":"IF(ISERROR(VLOOKUP($A35,[1]BD!$E$261:$K$288,7,FALSE)),\"\",IF(VLOOKUP($A35,[1]BD!$E$261:$K$288,7,FALSE)=\"\",\"\",VLOOKUP($A35,[1]BD!$E$261:$K$288,7,FALSE)))","v":"TROCA"},{"$f":"IF(ISERROR(VLOOKUP($A35,[1]BD!$E$289:$K$309,7,FALSE)),\"\",IF(VLOOKUP($A35,[1]BD!$E$289:$K$309,7,FALSE)=\"\",\"\",VLOOKUP($A35,[1]BD!$E$289:$K$309,7,FALSE)))","v":""},1]
["Roberta Epifânio",{"$f":"IF(ISERROR(VLOOKUP($A36,[1]BD!$E$2:$K$29,7,FALSE)),\"\",IF(VLOOKUP($A36,[1]BD!$E$2:$K$29,7,FALSE)=\"\",\"\",VLOOKUP($A36,[1]BD!$E$2:$K$29,7,FALSE)))","v":""},{"$f":"IF(ISERROR(VLOOKUP($A36,[1]BD!$E$30:$K$62,7,FALSE)),\"\",IF(VLOOKUP($A36,[1]BD!$E$30:$K$62,7,FALSE)=\"\",\"\",VLOOKUP($A36,[1]BD!$E$30:$K$62,7,FALSE)))","v":""},{"$f":"IF(ISERROR(VLOOKUP($A36,[1]BD!$E$63:$K$93,7,FALSE)),\"\",IF(VLOOKUP($A36,[1]BD!$E$63:$K$93,7,FALSE)=\"\",\"\",VLOOKUP($A36,[1]BD!$E$63:$K$93,7,FALSE)))","v":""},{"$f":"IF(ISERROR(VLOOKUP($A36,[1]BD!$E$94:$K$124,7,FALSE)),\"\",IF(VLOOKUP($A36,[1]BD!$E$94:$K$124,7,FALSE)=\"\",\"\",VLOOKUP($A36,[1]BD!$E$94:$K$124,7,FALSE)))","v":""},{"$f":"IF(ISERROR(VLOOKUP($A36,[1]BD!$E$125:$K$150,7,FALSE)),\"\",IF(VLOOKUP($A36,[1]BD!$E$125:$K$150,7,FALSE)=\"\",\"\",VLOOKUP($A36,[1]BD!$E$125:$K$150,7,FALSE)))","v":""},{"$f":"IF(ISERROR(VLOOKUP($A36,[1]BD!$E$151:$K$176,7,FALSE)),\"\",IF(VLOOKUP($A36,[1]BD!$E$151:$K$176,7,FALSE)=\"\",\"\",VLOOKUP($A36,[1]BD!$E$151:$K$176,7,FALSE)))","v":""},{"$f":"IF(ISERROR(VLOOKUP($A36,[1]BD!$E$177:$K$197,7,FALSE)),\"\",IF(VLOOKUP($A36,[1]BD!$E$177:$K$197,7,FALSE)=\"\",\"\",VLOOKUP($A36,[1]BD!$E$177:$K$197,7,FALSE)))","v":""},{"$f":"IF(ISERROR(VLOOKUP($A36,[1]BD!$E$198:$K$224,7,FALSE)),\"\",IF(VLOOKUP($A36,[1]BD!$E$198:$K$224,7,FALSE)=\"\",\"\",VLOOKUP($A36,[1]BD!$E$198:$K$224,7,FALSE)))","v":""},{"$f":"IF(ISERROR(VLOOKUP($A36,[1]BD!$E$225:$K$244,7,FALSE)),\"\",IF(VLOOKUP($A36,[1]BD!$E$225:$K$244,7,FALSE)=\"\",\"\",VLOOKUP($A36,[1]BD!$E$225:$K$244,7,FALSE)))","v":""},{"$f":"IF(ISERROR(VLOOKUP($A36,[1]BD!$E$245:$K$260,7,FALSE)),\"\",IF(VLOOKUP($A36,[1]BD!$E$245:$K$260,7,FALSE)=\"\",\"\",VLOOKUP($A36,[1]BD!$E$245:$K$260,7,FALSE)))","v":""},{"$f":"IF(ISERROR(VLOOKUP($A36,[1]BD!$E$261:$K$288,7,FALSE)),\"\",IF(VLOOKUP($A36,[1]BD!$E$261:$K$288,7,FALSE)=\"\",\"\",VLOOKUP($A36,[1]BD!$E$261:$K$288,7,FALSE)))","v":""},{"$f":"IF(ISERROR(VLOOKUP($A36,[1]BD!$E$289:$K$309,7,FALSE)),\"\",IF(VLOOKUP($A36,[1]BD!$E$289:$K$309,7,FALSE)=\"\",\"\",VLOOKUP($A36,[1]BD!$E$289:$K$309,7,FALSE)))","v":""},0]
["Jucimar Vieira",{"$f":"IF(ISERROR(VLOOKUP($A37,[1]BD!$E$2:$K$29,7,FALSE)),\"\",IF(VLOOKUP($A37,[1]BD!$E$2:$K$29,7,FALSE)=\"\",\"\",VLOOKUP($A37,[1]BD!$E$2:$K$29,7,FALSE)))","v":""},{"$f":"IF(ISERROR(VLOOKUP($A37,[1]BD!$E$30:$K$62,7,FALSE)),\"\",IF(VLOOKUP($A37,[1]BD!$E$30:$K$62,7,FALSE)=\"\",\"\",VLOOKUP($A37,[1]BD!$E$30:$K$62,7,FALSE)))","v":""},{"$f":"IF(ISERROR(VLOOKUP($A37,[1]BD!$E$63:$K$93,7,FALSE)),\"\",IF(VLOOKUP($A37,[1]BD!$E$63:$K$93,7,FALSE)=\"\",\"\",VLOOKUP($A37,[1]BD!$E$63:$K$93,7,FALSE)))","v":"TROCA"},{"$f":"IF(ISERROR(VLOOKUP($A37,[1]BD!$E$94:$K$124,7,FALSE)),\"\",IF(VLOOKUP($A37,[1]BD!$E$94:$K$124,7,FALSE)=\"\",\"\",VLOOKUP($A37,[1]BD!$E$94:$K$124,7,FALSE)))","v":"TROCA"},{"$f":"IF(ISERROR(VLOOKUP($A37,[1]BD!$E$125:$K$150,7,FALSE)),\"\",IF(VLOOKUP($A37,[1]BD!$E$125:$K$150,7,FALSE)=\"\",\"\",VLOOKUP($A37,[1]BD!$E$125:$K$150,7,FALSE)))","v":""},{"$f":"IF(ISERROR(VLOOKUP($A37,[1]BD!$E$151:$K$176,7,FALSE)),\"\",IF(VLOOKUP($A37,[1]BD!$E$151:$K$176,7,FALSE)=\"\",\"\",VLOOKUP($A37,[1]BD!$E$151:$K$176,7,FALSE)))","v":""},{"$f":"IF(ISERROR(VLOOKUP($A37,[1]BD!$E$177:$K$197,7,FALSE)),\"\",IF(VLOOKUP($A37,[1]BD!$E$177:$K$197,7,FALSE)=\"\",\"\",VLOOKUP($A37,[1]BD!$E$177:$K$197,7,FALSE)))","v":""},{"$f":"IF(ISERROR(VLOOKUP($A37,[1]BD!$E$198:$K$224,7,FALSE)),\"\",IF(VLOOKUP($A37,[1]BD!$E$198:$K$224,7,FALSE)=\"\",\"\",VLOOKUP($A37,[1]BD!$E$198:$K$224,7,FALSE)))","v":""},{"$f":"IF(ISERROR(VLOOKUP($A37,[1]BD!$E$225:$K$244,7,FALSE)),\"\",IF(VLOOKUP($A37,[1]BD!$E$225:$K$244,7,FALSE)=\"\",\"\",VLOOKUP($A37,[1]BD!$E$225:$K$244,7,FALSE)))","v":""},{"$f":"IF(ISERROR(VLOOKUP($A37,[1]BD!$E$245:$K$260,7,FALSE)),\"\",IF(VLOOKUP($A37,[1]BD!$E$245:$K$260,7,FALSE)=\"\",\"\",VLOOKUP($A37,[1]BD!$E$245:$K$260,7,FALSE)))","v":""},{"$f":"IF(ISERROR(VLOOKUP($A37,[1]BD!$E$261:$K$288,7,FALSE)),\"\",IF(VLOOKUP($A37,[1]BD!$E$261:$K$288,7,FALSE)=\"\",\"\",VLOOKUP($A37,[1]BD!$E$261:$K$288,7,FALSE)))","v":""},{"$f":"IF(ISERROR(VLOOKUP($A37,[1]BD!$E$289:$K$309,7,FALSE)),\"\",IF(VLOOKUP($A37,[1]BD!$E$289:$K$309,7,FALSE)=\"\",\"\",VLOOKUP($A37,[1]BD!$E$289:$K$309,7,FALSE)))","v":""},2]
["Andre Resende",{"$f":"IF(ISERROR(VLOOKUP($A38,[1]BD!$E$2:$K$29,7,FALSE)),\"\",IF(VLOOKUP($A38,[1]BD!$E$2:$K$29,7,FALSE)=\"\",\"\",VLOOKUP($A38,[1]BD!$E$2:$K$29,7,FALSE)))","v":""},{"$f":"IF(ISERROR(VLOOKUP($A38,[1]BD!$E$30:$K$62,7,FALSE)),\"\",IF(VLOOKUP($A38,[1]BD!$E$30:$K$62,7,FALSE)=\"\",\"\",VLOOKUP($A38,[1]BD!$E$30:$K$62,7,FALSE)))","v":""},{"$f":"IF(ISERROR(VLOOKUP($A38,[1]BD!$E$63:$K$93,7,FALSE)),\"\",IF(VLOOKUP($A38,[1]BD!$E$63:$K$93,7,FALSE)=\"\",\"\",VLOOKUP($A38,[1]BD!$E$63:$K$93,7,FALSE)))","v":""},{"$f":"IF(ISERROR(VLOOKUP($A38,[1]BD!$E$94:$K$124,7,FALSE)),\"\",IF(VLOOKUP($A38,[1]BD!$E$94:$K$124,7,FALSE)=\"\",\"\",VLOOKUP($A38,[1]BD!$E$94:$K$124,7,FALSE)))","v":""},{"$f":"IF(ISERROR(VLOOKUP($A38,[1]BD!$E$125:$K$150,7,FALSE)),\"\",IF(VLOOKUP($A38,[1]BD!$E$125:$K$150,7,FALSE)=\"\",\"\",VLOOKUP($A38,[1]BD!$E$125:$K$150,7,FALSE)))","v":""},{"$f":"IF(ISERROR(VLOOKUP($A38,[1]BD!$E$151:$K$176,7,FALSE)),\"\",IF(VLOOKUP($A38,[1]BD!$E$151:$K$176,7,FALSE)=\"\",\"\",VLOOKUP($A38,[1]BD!$E$151:$K$176,7,FALSE)))","v":""},{"$f":"IF(ISERROR(VLOOKUP($A38,[1]BD!$E$177:$K$197,7,FALSE)),\"\",IF(VLOOKUP($A38,[1]BD!$E$177:$K$197,7,FALSE)=\"\",\"\",VLOOKUP($A38,[1]BD!$E$177:$K$197,7,FALSE)))","v":""},{"$f":"IF(ISERROR(VLOOKUP($A38,[1]BD!$E$198:$K$224,7,FALSE)),\"\",IF(VLOOKUP($A38,[1]BD!$E$198:$K$224,7,FALSE)=\"\",\"\",VLOOKUP($A38,[1]BD!$E$198:$K$224,7,FALSE)))","v":""},{"$f":"IF(ISERROR(VLOOKUP($A38,[1]BD!$E$225:$K$244,7,FALSE)),\"\",IF(VLOOKUP($A38,[1]BD!$E$225:$K$244,7,FALSE)=\"\",\"\",VLOOKUP($A38,[1]BD!$E$225:$K$244,7,FALSE)))","v":""},{"$f":"IF(ISERROR(VLOOKUP($A38,[1]BD!$E$245:$K$260,7,FALSE)),\"\",IF(VLOOKUP($A38,[1]BD!$E$245:$K$260,7,FALSE)=\"\",\"\",VLOOKUP($A38,[1]BD!$E$245:$K$260,7,FALSE)))","v":""},{"$f":"IF(ISERROR(VLOOKUP($A38,[1]BD!$E$261:$K$288,7,FALSE)),\"\",IF(VLOOKUP($A38,[1]BD!$E$261:$K$288,7,FALSE)=\"\",\"\",VLOOKUP($A38,[1]BD!$E$261:$K$288,7,FALSE)))","v":""},{"$f":"IF(ISERROR(VLOOKUP($A38,[1]BD!$E$289:$K$309,7,FALSE)),\"\",IF(VLOOKUP($A38,[1]BD!$E$289:$K$309,7,FALSE)=\"\",\"\",VLOOKUP($A38,[1]BD!$E$289:$K$309,7,FALSE)))","v":""},0]
["Izabella Rodrigues",{"$f":"IF(ISERROR(VLOOKUP($A39,[1]BD!$E$2:$K$29,7,FALSE)),\"\",IF(VLOOKUP($A39,[1]BD!$E$2:$K$29,7,FALSE)=\"\",\"\",VLOOKUP($A39,[1]BD!$E$2:$K$29,7,FALSE)))","v":""},{"$f":"IF(ISERROR(VLOOKUP($A39,[1]BD!$E$30:$K$62,7,FALSE)),\"\",IF(VLOOKUP($A39,[1]BD!$E$30:$K$62,7,FALSE)=\"\",\"\",VLOOKUP($A39,[1]BD!$E$30:$K$62,7,FALSE)))","v":""},{"$f":"IF(ISERROR(VLOOKUP($A39,[1]BD!$E$63:$K$93,7,FALSE)),\"\",IF(VLOOKUP($A39,[1]BD!$E$63:$K$93,7,FALSE)=\"\",\"\",VLOOKUP($A39,[1]BD!$E$63:$K$93,7,FALSE)))","v":""},{"$f":"IF(ISERROR(VLOOKUP($A39,[1]BD!$E$94:$K$124,7,FALSE)),\"\",IF(VLOOKUP($A39,[1]BD!$E$94:$K$124,7,FALSE)=\"\",\"\",VLOOKUP($A39,[1]BD!$E$94:$K$124,7,FALSE)))","v":""},{"$f":"IF(ISERROR(VLOOKUP($A39,[1]BD!$E$125:$K$150,7,FALSE)),\"\",IF(VLOOKUP($A39,[1]BD!$E$125:$K$150,7,FALSE)=\"\",\"\",VLOOKUP($A39,[1]BD!$E$125:$K$150,7,FALSE)))","v":""},{"$f":"IF(ISERROR(VLOOKUP($A39,[1]BD!$E$151:$K$176,7,FALSE)),\"\",IF(VLOOKUP($A39,[1]BD!$E$151:$K$176,7,FALSE)=\"\",\"\",VLOOKUP($A39,[1]BD!$E$151:$K$176,7,FALSE)))","v":""},{"$f":"IF(ISERROR(VLOOKUP($A39,[1]BD!$E$177:$K$197,7,FALSE)),\"\",IF(VLOOKUP($A39,[1]BD!$E$177:$K$197,7,FALSE)=\"\",\"\",VLOOKUP($A39,[1]BD!$E$177:$K$197,7,FALSE)))","v":""},{"$f":"IF(ISERROR(VLOOKUP($A39,[1]BD!$E$198:$K$224,7,FALSE)),\"\",IF(VLOOKUP($A39,[1]BD!$E$198:$K$224,7,FALSE)=\"\",\"\",VLOOKUP($A39,[1]BD!$E$198:$K$224,7,FALSE)))","v":""},{"$f":"IF(ISERROR(VLOOKUP($A39,[1]BD!$E$225:$K$244,7,FALSE)),\"\",IF(VLOOKUP($A39,[1]BD!$E$225:$K$244,7,FALSE)=\"\",\"\",VLOOKUP($A39,[1]BD!$E$225:$K$244,7,FALSE)))","v":""},{"$f":"IF(ISERROR(VLOOKUP($A39,[1]BD!$E$245:$K$260,7,FALSE)),\"\",IF(VLOOKUP($A39,[1]BD!$E$245:$K$260,7,FALSE)=\"\",\"\",VLOOKUP($A39,[1]BD!$E$245:$K$260,7,FALSE)))","v":""},{"$f":"IF(ISERROR(VLOOKUP($A39,[1]BD!$E$261:$K$288,7,FALSE)),\"\",IF(VLOOKUP($A39,[1]BD!$E$261:$K$288,7,FALSE)=\"\",\"\",VLOOKUP($A39,[1]BD!$E$261:$K$288,7,FALSE)))","v":""},{"$f":"IF(ISERROR(VLOOKUP($A39,[1]BD!$E$289:$K$309,7,FALSE)),\"\",IF(VLOOKUP($A39,[1]BD!$E$289:$K$309,7,FALSE)=\"\",\"\",VLOOKUP($A39,[1]BD!$E$289:$K$309,7,FALSE)))","v":""},0]
["Lucca Veloso",{"$f":"IF(ISERROR(VLOOKUP($A40,[1]BD!$E$2:$K$29,7,FALSE)),\"\",IF(VLOOKUP($A40,[1]BD!$E$2:$K$29,7,FALSE)=\"\",\"\",VLOOKUP($A40,[1]BD!$E$2:$K$29,7,FALSE)))","v":""},{"$f":"IF(ISERROR(VLOOKUP($A40,[1]BD!$E$30:$K$62,7,FALSE)),\"\",IF(VLOOKUP($A40,[1]BD!$E$30:$K$62,7,FALSE)=\"\",\"\",VLOOKUP($A40,[1]BD!$E$30:$K$62,7,FALSE)))","v":""},{"$f":"IF(ISERROR(VLOOKUP($A40,[1]BD!$E$63:$K$93,7,FALSE)),\"\",IF(VLOOKUP($A40,[1]BD!$E$63:$K$93,7,FALSE)=\"\",\"\",VLOOKUP($A40,[1]BD!$E$63:$K$93,7,FALSE)))","v":""},{"$f":"IF(ISERROR(VLOOKUP($A40,[1]BD!$E$94:$K$124,7,FALSE)),\"\",IF(VLOOKUP($A40,[1]BD!$E$94:$K$124,7,FALSE)=\"\",\"\",VLOOKUP($A40,[1]BD!$E$94:$K$124,7,FALSE)))","v":""},{"$f":"IF(ISERROR(VLOOKUP($A40,[1]BD!$E$125:$K$150,7,FALSE)),\"\",IF(VLOOKUP($A40,[1]BD!$E$125:$K$150,7,FALSE)=\"\",\"\",VLOOKUP($A40,[1]BD!$E$125:$K$150,7,FALSE)))","v":""},{"$f":"IF(ISERROR(VLOOKUP($A40,[1]BD!$E$151:$K$176,7,FALSE)),\"\",IF(VLOOKUP($A40,[1]BD!$E$151:$K$176,7,FALSE)=\"\",\"\",VLOOKUP($A40,[1]BD!$E$151:$K$176,7,FALSE)))","v":""},{"$f":"IF(ISERROR(VLOOKUP($A40,[1]BD!$E$177:$K$197,7,FALSE)),\"\",IF(VLOOKUP($A40,[1]BD!$E$177:$K$197,7,FALSE)=\"\",\"\",VLOOKUP($A40,[1]BD!$E$177:$K$197,7,FALSE)))","v":""},{"$f":"IF(ISERROR(VLOOKUP($A40,[1]BD!$E$198:$K$224,7,FALSE)),\"\",IF(VLOOKUP($A40,[1]BD!$E$198:$K$224,7,FALSE)=\"\",\"\",VLOOKUP($A40,[1]BD!$E$198:$K$224,7,FALSE)))","v":""},{"$f":"IF(ISERROR(VLOOKUP($A40,[1]BD!$E$225:$K$244,7,FALSE)),\"\",IF(VLOOKUP($A40,[1]BD!$E$225:$K$244,7,FALSE)=\"\",\"\",VLOOKUP($A40,[1]BD!$E$225:$K$244,7,FALSE)))","v":""},{"$f":"IF(ISERROR(VLOOKUP($A40,[1]BD!$E$245:$K$260,7,FALSE)),\"\",IF(VLOOKUP($A40,[1]BD!$E$245:$K$260,7,FALSE)=\"\",\"\",VLOOKUP($A40,[1]BD!$E$245:$K$260,7,FALSE)))","v":""},{"$f":"IF(ISERROR(VLOOKUP($A40,[1]BD!$E$261:$K$288,7,FALSE)),\"\",IF(VLOOKUP($A40,[1]BD!$E$261:$K$288,7,FALSE)=\"\",\"\",VLOOKUP($A40,[1]BD!$E$261:$K$288,7,FALSE)))","v":""},{"$f":"IF(ISERROR(VLOOKUP($A40,[1]BD!$E$289:$K$309,7,FALSE)),\"\",IF(VLOOKUP($A40,[1]BD!$E$289:$K$309,7,FALSE)=\"\",\"\",VLOOKUP($A40,[1]BD!$E$289:$K$309,7,FALSE)))","v":""},0]
["Vitor Gatti",{"$f":"IF(ISERROR(VLOOKUP($A41,[1]BD!$E$2:$K$29,7,FALSE)),\"\",IF(VLOOKUP($A41,[1]BD!$E$2:$K$29,7,FALSE)=\"\",\"\",VLOOKUP($A41,[1]BD!$E$2:$K$29,7,FALSE)))","v":""},{"$f":"IF(ISERROR(VLOOKUP($A41,[1]BD!$E$30:$K$62,7,FALSE)),\"\",IF(VLOOKUP($A41,[1]BD!$E$30:$K$62,7,FALSE)=\"\",\"\",VLOOKUP($A41,[1]BD!$E$30:$K$62,7,FALSE)))","v":""},{"$f":"IF(ISERROR(VLOOKUP($A41,[1]BD!$E$63:$K$93,7,FALSE)),\"\",IF(VLOOKUP($A41,[1]BD!$E$63:$K$93,7,FALSE)=\"\",\"\",VLOOKUP($A41,[1]BD!$E$63:$K$93,7,FALSE)))","v":""},{"$f":"IF(ISERROR(VLOOKUP($A41,[1]BD!$E$94:$K$124,7,FALSE)),\"\",IF(VLOOKUP($A41,[1]BD!$E$94:$K$124,7,FALSE)=\"\",\"\",VLOOKUP($A41,[1]BD!$E$94:$K$124,7,FALSE)))","v":""},{"$f":"IF(ISERROR(VLOOKUP($A41,[1]BD!$E$125:$K$150,7,FALSE)),\"\",IF(VLOOKUP($A41,[1]BD!$E$125:$K$150,7,FALSE)=\"\",\"\",VLOOKUP($A41,[1]BD!$E$125:$K$150,7,FALSE)))","v":""},{"$f":"IF(ISERROR(VLOOKUP($A41,[1]BD!$E$151:$K$176,7,FALSE)),\"\",IF(VLOOKUP($A41,[1]BD!$E$151:$K$176,7,FALSE)=\"\",\"\",VLOOKUP($A41,[1]BD!$E$151:$K$176,7,FALSE)))","v":""},{"$f":"IF(ISERROR(VLOOKUP($A41,[1]BD!$E$177:$K$197,7,FALSE)),\"\",IF(VLOOKUP($A41,[1]BD!$E$177:$K$197,7,FALSE)=\"\",\"\",VLOOKUP($A41,[1]BD!$E$177:$K$197,7,FALSE)))","v":""},{"$f":"IF(ISERROR(VLOOKUP($A41,[1]BD!$E$198:$K$224,7,FALSE)),\"\",IF(VLOOKUP($A41,[1]BD!$E$198:$K$224,7,FALSE)=\"\",\"\",VLOOKUP($A41,[1]BD!$E$198:$K$224,7,FALSE)))","v":""},{"$f":"IF(ISERROR(VLOOKUP($A41,[1]BD!$E$225:$K$244,7,FALSE)),\"\",IF(VLOOKUP($A41,[1]BD!$E$225:$K$244,7,FALSE)=\"\",\"\",VLOOKUP($A41,[1]BD!$E$225:$K$244,7,FALSE)))","v":"TROCA"},{"$f":"IF(ISERROR(VLOOKUP($A41,[1]BD!$E$245:$K$260,7,FALSE)),\"\",IF(VLOOKUP($A41,[1]BD!$E$245:$K$260,7,FALSE)=\"\",\"\",VLOOKUP($A41,[1]BD!$E$245:$K$260,7,FALSE)))","v":""},{"$f":"IF(ISERROR(VLOOKUP($A41,[1]BD!$E$261:$K$288,7,FALSE)),\"\",IF(VLOOKUP($A41,[1]BD!$E$261:$K$288,7,FALSE)=\"\",\"\",VLOOKUP($A41,[1]BD!$E$261:$K$288,7,FALSE)))","v":""},{"$f":"IF(ISERROR(VLOOKUP($A41,[1]BD!$E$289:$K$309,7,FALSE)),\"\",IF(VLOOKUP($A41,[1]BD!$E$289:$K$309,7,FALSE)=\"\",\"\",VLOOKUP($A41,[1]BD!$E$289:$K$309,7,FALSE)))","v":""},1]
["Gabriel Garabini",{"$f":"IF(ISERROR(VLOOKUP($A42,[1]BD!$E$2:$K$29,7,FALSE)),\"\",IF(VLOOKUP($A42,[1]BD!$E$2:$K$29,7,FALSE)=\"\",\"\",VLOOKUP($A42,[1]BD!$E$2:$K$29,7,FALSE)))","v":""},{"$f":"IF(ISERROR(VLOOKUP($A42,[1]BD!$E$30:$K$62,7,FALSE)),\"\",IF(VLOOKUP($A42,[1]BD!$E$30:$K$62,7,FALSE)=\"\",\"\",VLOOKUP($A42,[1]BD!$E$30:$K$62,7,FALSE)))","v":""},{"$f":"IF(ISERROR(VLOOKUP($A42,[1]BD!$E$63:$K$93,7,FALSE)),\"\",IF(VLOOKUP($A42,[1]BD!$E$63:$K$93,7,FALSE)=\"\",\"\",VLOOKUP($A42,[1]BD!$E$63:$K$93,7,FALSE)))","v":""},{"$f":"IF(ISERROR(VLOOKUP($A42,[1]BD!$E$94:$K$124,7,FALSE)),\"\",IF(VLOOKUP($A42,[1]BD!$E$94:$K$124,7,FALSE)=\"\",\"\",VLOOKUP($A42,[1]BD!$E$94:$K$124,7,FALSE)))","v":""},{"$f":"IF(ISERROR(VLOOKUP($A42,[1]BD!$E$125:$K$150,7,FALSE)),\"\",IF(VLOOKUP($A42,[1]BD!$E$125:$K$150,7,FALSE)=\"\",\"\",VLOOKUP($A42,[1]BD!$E$125:$K$150,7,FALSE)))","v":""},{"$f":"IF(ISERROR(VLOOKUP($A42,[1]BD!$E$151:$K$176,7,FALSE)),\"\",IF(VLOOKUP($A42,[1]BD!$E$151:$K$176,7,FALSE)=\"\",\"\",VLOOKUP($A42,[1]BD!$E$151:$K$176,7,FALSE)))","v":""},{"$f":"IF(ISERROR(VLOOKUP($A42,[1]BD!$E$177:$K$197,7,FALSE)),\"\",IF(VLOOKUP($A42,[1]BD!$E$177:$K$197,7,FALSE)=\"\",\"\",VLOOKUP($A42,[1]BD!$E$177:$K$197,7,FALSE)))","v":""},{"$f":"IF(ISERROR(VLOOKUP($A42,[1]BD!$E$198:$K$224,7,FALSE)),\"\",IF(VLOOKUP($A42,[1]BD!$E$198:$K$224,7,FALSE)=\"\",\"\",VLOOKUP($A42,[1]BD!$E$198:$K$224,7,FALSE)))","v":""},{"$f":"IF(ISERROR(VLOOKUP($A42,[1]BD!$E$225:$K$244,7,FALSE)),\"\",IF(VLOOKUP($A42,[1]BD!$E$225:$K$244,7,FALSE)=\"\",\"\",VLOOKUP($A42,[1]BD!$E$225:$K$244,7,FALSE)))","v":""},{"$f":"IF(ISERROR(VLOOKUP($A42,[1]BD!$E$245:$K$260,7,FALSE)),\"\",IF(VLOOKUP($A42,[1]BD!$E$245:$K$260,7,FALSE)=\"\",\"\",VLOOKUP($A42,[1]BD!$E$245:$K$260,7,FALSE)))","v":""},{"$f":"IF(ISERROR(VLOOKUP($A42,[1]BD!$E$261:$K$288,7,FALSE)),\"\",IF(VLOOKUP($A42,[1]BD!$E$261:$K$288,7,FALSE)=\"\",\"\",VLOOKUP($A42,[1]BD!$E$261:$K$288,7,FALSE)))","v":""},{"$f":"IF(ISERROR(VLOOKUP($A42,[1]BD!$E$289:$K$309,7,FALSE)),\"\",IF(VLOOKUP($A42,[1]BD!$E$289:$K$309,7,FALSE)=\"\",\"\",VLOOKUP($A42,[1]BD!$E$289:$K$309,7,FALSE)))","v":""},0]
[null,{"$f":"IF(ISERROR(VLOOKUP($A43,[1]BD!$E$2:$K$29,7,FALSE)),\"\",IF(VLOOKUP($A43,[1]BD!$E$2:$K$29,7,FALSE)=\"\",\"\",VLOOKUP($A43,[1]BD!$E$2:$K$29,7,FALSE)))","v":""},{"$f":"IF(ISERROR(VLOOKUP($A43,[1]BD!$E$30:$K$62,7,FALSE)),\"\",IF(VLOOKUP($A43,[1]BD!$E$30:$K$62,7,FALSE)=\"\",\"\",VLOOKUP($A43,[1]BD!$E$30:$K$62,7,FALSE)))","v":""},{"$f":"IF(ISERROR(VLOOKUP($A43,[1]BD!$E$63:$K$93,7,FALSE)),\"\",IF(VLOOKUP($A43,[1]BD!$E$63:$K$93,7,FALSE)=\"\",\"\",VLOOKUP($A43,[1]BD!$E$63:$K$93,7,FALSE)))","v":""},{"$f":"IF(ISERROR(VLOOKUP($A43,[1]BD!$E$94:$K$124,7,FALSE)),\"\",IF(VLOOKUP($A43,[1]BD!$E$94:$K$124,7,FALSE)=\"\",\"\",VLOOKUP($A43,[1]BD!$E$94:$K$124,7,FALSE)))","v":""},{"$f":"IF(ISERROR(VLOOKUP($A43,[1]BD!$E$125:$K$150,7,FALSE)),\"\",IF(VLOOKUP($A43,[1]BD!$E$125:$K$150,7,FALSE)=\"\",\"\",VLOOKUP($A43,[1]BD!$E$125:$K$150,7,FALSE)))","v":""},{"$f":"IF(ISERROR(VLOOKUP($A43,[1]BD!$E$151:$K$176,7,FALSE)),\"\",IF(VLOOKUP($A43,[1]BD!$E$151:$K$176,7,FALSE)=\"\",\"\",VLOOKUP($A43,[1]BD!$E$151:$K$176,7,FALSE)))","v":""},{"$f":"IF(ISERROR(VLOOKUP($A43,[1]BD!$E$177:$K$197,7,FALSE)),\"\",IF(VLOOKUP($A43,[1]BD!$E$177:$K$197,7,FALSE)=\"\",\"\",VLOOKUP($A43,[1]BD!$E$177:$K$197,7,FALSE)))","v":""},{"$f":"IF(ISERROR(VLOOKUP($A43,[1]BD!$E$198:$K$224,7,FALSE)),\"\",IF(VLOOKUP($A43,[1]BD!$E$198:$K$224,7,FALSE)=\"\",\"\",VLOOKUP($A43,[1]BD!$E$198:$K$224,7,FALSE)))","v":""},{"$f":"IF(ISERROR(VLOOKUP($A43,[1]BD!$E$225:$K$244,7,FALSE)),\"\",IF(VLOOKUP($A43,[1]BD!$E$225:$K$244,7,FALSE)=\"\",\"\",VLOOKUP($A43,[1]BD!$E$225:$K$244,7,FALSE)))","v":""},{"$f":"IF(ISERROR(VLOOKUP($A43,[1]BD!$E$245:$K$260,7,FALSE)),\"\",IF(VLOOKUP($A43,[1]BD!$E$245:$K$260,7,FALSE)=\"\",\"\",VLOOKUP($A43,[1]BD!$E$245:$K$260,7,FALSE)))","v":""},{"$f":"IF(ISERROR(VLOOKUP($A43,[1]BD!$E$261:$K$288,7,FALSE)),\"\",IF(VLOOKUP($A43,[1]BD!$E$261:$K$288,7,FALSE)=\"\",\"\",VLOOKUP($A43,[1]BD!$E$261:$K$288,7,FALSE)))","v":""},{"$f":"IF(ISERROR(VLOOKUP($A43,[1]BD!$E$289:$K$309,7,FALSE)),\"\",IF(VLOOKUP($A43,[1]BD!$E$289:$K$309,7,FALSE)=\"\",\"\",VLOOKUP($A43,[1]BD!$E$289:$K$309,7,FALSE)))","v":""},0]
[null,{"$f":"IF(ISERROR(VLOOKUP($A44,[1]BD!$E$2:$K$29,7,FALSE)),\"\",IF(VLOOKUP($A44,[1]BD!$E$2:$K$29,7,FALSE)=\"\",\"\",VLOOKUP($A44,[1]BD!$E$2:$K$29,7,FALSE)))","v":""},{"$f":"IF(ISERROR(VLOOKUP($A44,[1]BD!$E$30:$K$62,7,FALSE)),\"\",IF(VLOOKUP($A44,[1]BD!$E$30:$K$62,7,FALSE)=\"\",\"\",VLOOKUP($A44,[1]BD!$E$30:$K$62,7,FALSE)))","v":""},{"$f":"IF(ISERROR(VLOOKUP($A44,[1]BD!$E$63:$K$93,7,FALSE)),\"\",IF(VLOOKUP($A44,[1]BD!$E$63:$K$93,7,FALSE)=\"\",\"\",VLOOKUP($A44,[1]BD!$E$63:$K$93,7,FALSE)))","v":""},{"$f":"IF(ISERROR(VLOOKUP($A44,[1]BD!$E$94:$K$124,7,FALSE)),\"\",IF(VLOOKUP($A44,[1]BD!$E$94:$K$124,7,FALSE)=\"\",\"\",VLOOKUP($A44,[1]BD!$E$94:$K$124,7,FALSE)))","v":""},{"$f":"IF(ISERROR(VLOOKUP($A44,[1]BD!$E$125:$K$150,7,FALSE)),\"\",IF(VLOOKUP($A44,[1]BD!$E$125:$K$150,7,FALSE)=\"\",\"\",VLOOKUP($A44,[1]BD!$E$125:$K$150,7,FALSE)))","v":""},{"$f":"IF(ISERROR(VLOOKUP($A44,[1]BD!$E$151:$K$176,7,FALSE)),\"\",IF(VLOOKUP($A44,[1]BD!$E$151:$K$176,7,FALSE)=\"\",\"\",VLOOKUP($A44,[1]BD!$E$151:$K$176,7,FALSE)))","v":""},{"$f":"IF(ISERROR(VLOOKUP($A44,[1]BD!$E$177:$K$197,7,FALSE)),\"\",IF(VLOOKUP($A44,[1]BD!$E$177:$K$197,7,FALSE)=\"\",\"\",VLOOKUP($A44,[1]BD!$E$177:$K$197,7,FALSE)))","v":""},{"$f":"IF(ISERROR(VLOOKUP($A44,[1]BD!$E$198:$K$224,7,FALSE)),\"\",IF(VLOOKUP($A44,[1]BD!$E$198:$K$224,7,FALSE)=\"\",\"\",VLOOKUP($A44,[1]BD!$E$198:$K$224,7,FALSE)))","v":""},{"$f":"IF(ISERROR(VLOOKUP($A44,[1]BD!$E$225:$K$244,7,FALSE)),\"\",IF(VLOOKUP($A44,[1]BD!$E$225:$K$244,7,FALSE)=\"\",\"\",VLOOKUP($A44,[1]BD!$E$225:$K$244,7,FALSE)))","v":""},{"$f":"IF(ISERROR(VLOOKUP($A44,[1]BD!$E$245:$K$260,7,FALSE)),\"\",IF(VLOOKUP($A44,[1]BD!$E$245:$K$260,7,FALSE)=\"\",\"\",VLOOKUP($A44,[1]BD!$E$245:$K$260,7,FALSE)))","v":""},{"$f":"IF(ISERROR(VLOOKUP($A44,[1]BD!$E$261:$K$288,7,FALSE)),\"\",IF(VLOOKUP($A44,[1]BD!$E$261:$K$288,7,FALSE)=\"\",\"\",VLOOKUP($A44,[1]BD!$E$261:$K$288,7,FALSE)))","v":""},{"$f":"IF(ISERROR(VLOOKUP($A44,[1]BD!$E$289:$K$309,7,FALSE)),\"\",IF(VLOOKUP($A44,[1]BD!$E$289:$K$309,7,FALSE)=\"\",\"\",VLOOKUP($A44,[1]BD!$E$289:$K$309,7,FALSE)))","v":""},0]
[null,{"$f":"IF(ISERROR(VLOOKUP($A45,[1]BD!$E$2:$K$29,7,FALSE)),\"\",IF(VLOOKUP($A45,[1]BD!$E$2:$K$29,7,FALSE)=\"\",\"\",VLOOKUP($A45,[1]BD!$E$2:$K$29,7,FALSE)))","v":""},{"$f":"IF(ISERROR(VLOOKUP($A45,[1]BD!$E$30:$K$62,7,FALSE)),\"\",IF(VLOOKUP($A45,[1]BD!$E$30:$K$62,7,FALSE)=\"\",\"\",VLOOKUP($A45,[1]BD!$E$30:$K$62,7,FALSE)))","v":""},{"$f":"IF(ISERROR(VLOOKUP($A45,[1]BD!$E$63:$K$93,7,FALSE)),\"\",IF(VLOOKUP($A45,[1]BD!$E$63:$K$93,7,FALSE)=\"\",\"\",VLOOKUP($A45,[1]BD!$E$63:$K$93,7,FALSE)))","v":""},{"$f":"IF(ISERROR(VLOOKUP($A45,[1]BD!$E$94:$K$124,7,FALSE)),\"\",IF(VLOOKUP($A45,[1]BD!$E$94:$K$124,7,FALSE)=\"\",\"\",VLOOKUP($A45,[1]BD!$E$94:$K$124,7,FALSE)))","v":""},{"$f":"IF(ISERROR(VLOOKUP($A45,[1]BD!$E$125:$K$150,7,FALSE)),\"\",IF(VLOOKUP($A45,[1]BD!$E$125:$K$150,7,FALSE)=\"\",\"\",VLOOKUP($A45,[1]BD!$E$125:$K$150,7,FALSE)))","v":""},{"$f":"IF(ISERROR(VLOOKUP($A45,[1]BD!$E$151:$K$176,7,FALSE)),\"\",IF(VLOOKUP($A45,[1]BD!$E$151:$K$176,7,FALSE)=\"\",\"\",VLOOKUP($A45,[1]BD!$E$151:$K$176,7,FALSE)))","v":""},{"$f":"IF(ISERROR(VLOOKUP($A45,[1]BD!$E$177:$K$197,7,FALSE)),\"\",IF(VLOOKUP($A45,[1]BD!$E$177:$K$197,7,FALSE)=\"\",\"\",VLOOKUP($A45,[1]BD!$E$177:$K$197,7,FALSE)))","v":""},{"$f":"IF(ISERROR(VLOOKUP($A45,[1]BD!$E$198:$K$224,7,FALSE)),\"\",IF(VLOOKUP($A45,[1]BD!$E$198:$K$224,7,FALSE)=\"\",\"\",VLOOKUP($A45,[1]BD!$E$198:$K$224,7,FALSE)))","v":""},{"$f":"IF(ISERROR(VLOOKUP($A45,[1]BD!$E$225:$K$244,7,FALSE)),\"\",IF(VLOOKUP($A45,[1]BD!$E$225:$K$244,7,FALSE)=\"\",\"\",VLOOKUP($A45,[1]BD!$E$225:$K$244,7,FALSE)))","v":""},null,null,{"$f":"IF(ISERROR(VLOOKUP($A45,[1]BD!$E$289:$K$309,7,FALSE)),\"\",IF(VLOOKUP($A45,[1]BD!$E$289:$K$309,7,FALSE)=\"\",\"\",VLOOKUP($A45,[1]BD!$E$289:$K$309,7,FALSE)))","v":""},0]
[null,"",{"$f":"IF(ISERROR(VLOOKUP($A46,[1]BD!$E$30:$K$62,7,FALSE)),\"\",IF(VLOOKUP($A46,[1]BD!$E$30:$K$62,7,FALSE)=\"\",\"\",VLOOKUP($A46,[1]BD!$E$30:$K$62,7,FALSE)))","v":""},"",{"$f":"IF(ISERROR(VLOOKUP($A46,[1]BD!$E$94:$K$124,7,FALSE)),\"\",IF(VLOOKUP($A46,[1]BD!$E$94:$K$124,7,FALSE)=\"\",\"\",VLOOKUP($A46,[1]BD!$E$94:$K$124,7,FALSE)))","v":""},"","","","","",null,null,{"$f":"IF(ISERROR(VLOOKUP($A46,[1]BD!$E$289:$K$309,7,FALSE)),\"\",IF(VLOOKUP($A46,[1]BD!$E$289:$K$309,7,FALSE)=\"\",\"\",VLOOKUP($A46,[1]BD!$E$289:$K$309,7,FALSE)))","v":""},0]

{"sheet":"TABELA","index":4,"n_rows":55,"n_cols":92,"rows_kept":55,"cut":false,"hidden":false,"merged":[[1,43,1,46],[1,47,1,50],[2,3,2,6],[2,7,2,10],[2,11,2,14],[2,15,2,18],[2,19,2,22],[2,23,2,26],[2,27,2,30],[2,31,2,34],[2,35,2,38],[2,39,2,42],[2,43,2,46],[2,47,2,50],[1,23,1,26],[1,27,1,30],[1,31,1,34],[1,35,1,38],[1,39,1,42],[1,3,1,6],[1,7,1,10],[1,11,1,14],[1,15,1,18],[1,19,1,22]]}
[2022,null,null,null,"OK",null,null,null,"OK",null,null,null,"OK",null,null,null,"OK",null,null,null,"OK",null,null,null,"OK",null,null,null,"OK",null,null,null,"OK",null,null,null,"OK",null,null,null,"OK",null,null,null,"OK",null,null,null,"OK"]
[null,null,null,"1ª etapa",null,null,null,"2ª etapa",null,null,null,"3ª etapa",null,null,null,"4ª etapa",null,null,null,"5ª etapa",null,null,null,"6ª etapa",null,null,null,"7ª etapa",null,null,null,"8ª etapa",null,null,null,"9ª etapa",null,null,null,"10ª etapa",null,null,null,"11ª etapa",null,null,null,"12ª etapa"]
[null,null,null,null,null,null,null,null,null,null,null,"13/03/2022 - 10:00 - Domingo"]
[null,"Nome do (a) Piloto (a)","Pontuação Geral","Posição","Pontos","Bônus","Penalidade","Posição","Pontos","Bônus","Penalidade","Posição","Pontos","Bônus","Penalidade","Posição","Pontos","Bônus","Penalidade","Posição","Pontos","Bônus","Penalidade","Posição","Pontos","Bônus","Penalidade","Posição","Pontos","Bônus","Penalidade","Posição","Pontos","Bônus","Penalidade","Posição","Pontos","Bônus","Penalidade","Posição","Pontos","Bônus","Penalidade","Posição","Pontos","Bônus","Penalidade","Posição","Pontos","Bônus","Penalidade","1º LUGAR","2º LUGAR","3º LUGAR","4º LUGAR","5º LUGAR","6º LUGAR","7º LUGAR","8º LUGAR","9º LUGAR","10º LUGAR","11º LUGAR","12º LUGAR","13º LUGAR","14º LUGAR","15º LUGAR","16º LUGAR","17º LUGAR","18º LUGAR","19º LUGAR","20º LUGAR","21º LUGAR","22º LUGAR","23º LUGAR","24º LUGAR","25º LUGAR","26º LUGAR","27º LUGAR","28º LUGAR","29º LUGAR","30º LUGAR","31º LUGAR","32º LUGAR","33º LUGAR","34º LUGAR","35º LUGAR","36º LUGAR","37º LUGAR","38º LUGAR","39º LUGAR","40º LUGAR","41º LUGAR"]
[1,"Alexandre Melillo",300,11,22,null,"",12,20,null,"",17,14,null,"",2,41,null,"",6,32,null,"",2,41,null,"",4,36,null,"",11,22,null,"",17,14,null,"SIM",5,34,null,"",10,24,null,"",null,0,null,"",0,2,0,1,1,1,0,0,0,1,2,1,0,0,0,0,2,0,0,0,0,0,0,0,0,0,0,0,0,0,0,0,0,0,0,0,0,0,0,0,0]
[2,"Bernardo Freitas",66,26,5,null,"",null,0,null,"",6,32,null,"",17,14,null,"",15,16,null,"",27,4,null,"SIM",null,0,null,"",null,0,null,"",null,0,null,"",null,0,null,"",null,0,null,"",null,0,null,-5,0,0,0,0,0,1,0,0,0,0,0,0,0,0,1,0,1,0,0,0,0,0,0,0,0,1,1,0,0,0,0,0,0,0,0,0,0,0,0,0,0]
[3,"Cláudio Dumont",102,8,28,null,"",2,41,null,"",15,16,null,"",4,36,null,"",25,6,null,"",null,0,null,"",null,0,null,-5,null,0,null,-5,null,0,null,-5,null,0,null,-5,null,0,null,-5,null,0,null,"",0,1,0,1,0,0,0,1,0,0,0,0,0,0,1,0,0,0,0,0,0,0,0,0,1,0,0,0,0,0,0,0,0,0,0,0,0,0,0,0,0]
[4,"Cláudio Naves",95,24,7,null,"",27,4,null,"",24,7,null,"",33,1,null,"SIM",44,1,null,"SIM",14,17,null,"",14,17,null,"",null,0,null,"",null,0,null,"",null,0,null,"",18,13,null,"",8,28,null,"",0,0,0,0,0,0,0,1,0,0,0,0,0,2,0,0,0,1,0,0,0,0,0,2,0,0,1,0,0,0,0,0,1,0,0,0,0,0,0,0,0]
[5,"Daniel Nahum",394,1,45,null,"",4,36,null,"",5,34,null,null,3,38,1,"",23,8,null,"",3,38,null,"",3,38,null,"",7,30,null,"",4,36,null,"",4,36,null,"",23,8,null,"",1,45,1,"",2,0,3,3,1,0,1,0,0,0,0,0,0,0,0,0,0,0,0,0,0,0,2,0,0,0,0,0,0,0,0,0,0,0,0,0,0,0,0,0,0]
[6,"SSSSS",0,null,0,null,"",null,0,null,"",null,0,null,null,null,0,null,"",null,0,null,"",null,0,null,"",null,0,null,null,null,0,null,"",null,0,null,"",null,0,null,"",null,0,null,"",null,0,null,"",0,0,0,0,0,0,0,0,0,0,0,0,0,0,0,1,0,1,1,0,1,0,0,0,0,0,0,0,0,0,0,0,0,0,0,0,0,0,0,0,0]
[7,"Eduardo Henrique",228,null,0,null,"",42,1,null,"SIM",14,17,null,"",12,20,null,"",3,38,null,"",4,36,null,"",9,26,null,"",12,20,null,"",2,41,null,"",null,0,null,"",5,34,null,"",null,0,null,-5,0,1,1,1,1,0,0,0,1,0,0,2,0,1,0,0,0,0,0,0,0,0,0,0,0,0,0,0,0,0,0,0,0,0,0,0,0,0,0,0,0]
[8,"Frederico Papatella",88,5,34,null,"",14,17,null,"",28,3,null,"SIM",null,0,null,"",null,0,null,"",null,0,null,"",null,0,null,-5,null,0,null,"",null,0,null,-5,9,26,null,"",13,18,null,"",null,0,null,"",0,0,0,0,1,0,0,0,1,0,0,0,1,1,0,0,0,0,0,0,0,0,0,0,0,0,0,1,0,0,0,0,0,0,0,0,0,0,0,0,0]
[9,"Guilherme Alves",249,9,26,null,"",11,22,null,"",10,24,null,"",16,15,null,"",11,22,null,"",16,15,null,"SIM",5,34,null,"",4,36,null,"",11,22,null,"",null,0,null,"",6,32,null,"",37,1,null,"SIM",0,0,0,1,1,1,0,0,1,1,3,0,0,0,0,2,0,0,0,0,0,0,0,0,0,0,0,0,0,0,0,0,0,0,0,0,1,0,0,0,0]
[10,"Felipe Bouhid",96,null,0,null,"",null,0,null,"",null,0,null,"",null,0,null,"",null,0,null,"",null,0,null,"",null,0,null,"",18,13,null,"",12,20,null,"",12,20,null,"",14,17,null,"",9,26,null,"",0,0,0,0,0,0,0,0,1,0,0,2,0,1,0,1,0,1,1,0,0,0,0,0,0,0,0,0,1,0,0,0,0,0,0,0,0,0,0,0,0]
[11,"Hélio Chagas",112,22,9,null,"",23,8,null,"",23,8,null,"",null,0,null,-5,21,10,null,"",15,16,null,"",26,5,null,"SIM",17,14,null,"",null,0,null,"",13,18,null,"",19,12,null,"",14,17,null,"",0,0,0,0,0,0,0,0,0,0,0,0,1,1,1,0,1,0,1,0,1,1,2,0,0,1,0,0,0,0,0,0,0,0,0,0,0,0,0,0,0]
[12,"Hugo Denucci",0,null,0,null,-5,null,0,null,-5,null,0,null,"",null,0,null,-5,null,0,null,"",null,0,null,"",null,0,null,"",null,0,null,-5,null,0,null,-5,null,0,null,-5,null,0,null,-5,null,0,null,-5,0,0,0,0,0,0,0,0,0,0,0,0,0,0,0,0,0,0,0,0,0,0,0,0,0,0,0,0,0,0,0,0,0,0,0,0,0,0,0,0,0]
[13,"Jarbas Reis",324,6,32,null,"",6,32,null,"",21,10,null,"",11,22,null,"",4,36,null,"",8,28,null,"",11,22,null,"",13,18,null,"",8,28,null,"",7,30,null,"",7,30,null,"",4,36,null,"",0,0,0,2,0,2,2,2,0,0,2,0,1,0,0,0,0,0,0,0,1,0,0,0,0,0,0,0,0,0,0,0,0,0,0,0,0,0,0,0,0]
[14,"Leandro Malias",70,16,15,null,"",25,6,null,"",null,0,null,"",null,0,null,-5,null,0,null,"",21,10,null,"",19,12,null,"",null,0,null,"",null,0,null,"",null,0,null,"",15,16,null,"",15,16,null,"",0,0,0,0,0,0,0,0,0,0,0,0,0,0,2,1,0,0,1,0,1,0,0,0,1,0,0,0,0,0,0,0,0,0,0,0,0,0,0,0,0]
[15,"Lucas Guimarães",54,null,0,null,"",32,1,null,"SIM",null,0,null,-5,33,1,null,"SIM",7,30,null,"",null,0,null,-5,10,24,null,"",8,28,null,"",null,0,null,-5,null,0,null,-5,null,0,null,-5,null,0,null,-5,0,0,0,0,0,0,1,1,0,1,0,0,0,0,0,0,0,0,0,0,0,0,0,0,0,0,0,0,0,0,0,1,1,0,0,0,0,0,0,0,0]
[16,"Luciano Robervine",38,4,36,null,"",33,1,null,"SIM",16,15,null,null,9,26,null,"",null,0,null,-5,null,0,null,-5,null,0,null,-5,null,0,null,-5,null,0,null,-5,null,0,null,-5,null,0,null,-5,null,0,null,-5,0,0,0,1,0,0,0,0,1,0,0,0,0,0,0,1,0,0,0,0,0,0,0,0,0,0,0,0,0,0,0,0,1,0,0,0,0,0,0,0,0]
[17,"Marcelo Campos",413,2,41,1,"",8,28,null,"",4,36,null,"",1,45,null,"",5,34,null,"",20,11,1,"",2,41,1,"",5,34,null,"",3,38,null,"",6,32,null,"",1,45,1,"",10,24,null,"",2,2,1,1,2,1,0,1,0,1,0,0,0,0,0,0,0,0,0,1,0,0,0,0,0,0,0,0,0,0,0,0,0,0,0,0,0,0,0,0,0]
[18,"Marcelo Chagas",186,19,12,null,"",0,0,null,"SIM",8,28,null,"",null,0,null,-5,8,28,null,"",10,24,null,null,13,18,null,"",23,8,null,"",null,0,null,"",14,17,null,"",2,41,null,"",16,15,null,"",0,1,0,0,0,0,0,2,0,1,0,0,1,1,0,1,0,0,1,0,0,0,1,0,0,0,0,0,0,0,0,0,0,0,0,0,0,0,0,0,0]
[19,"Marcelo Clemente",295,27,4,null,"",17,14,1,"",11,22,null,"",15,16,null,"SIM",1,45,1,"",9,26,null,"",1,45,null,"",1,45,null,"",7,30,1,-5,null,0,null,"",22,9,null,"",2,41,null,"",3,1,0,0,0,0,1,0,1,0,1,0,0,0,1,0,1,0,0,0,0,1,0,0,0,0,1,0,0,0,0,0,0,0,0,0,0,0,0,0,0]
[20,"Marcelo Marcondes",243,21,10,null,"SIM",7,30,null,"",1,45,null,"",8,28,null,"",24,7,null,"",17,14,null,"SIM",null,0,null,-5,10,24,null,"",19,12,null,"",1,45,1,"",26,5,null,"",6,32,null,-5,2,0,0,0,0,1,1,1,0,1,0,0,0,0,0,0,1,0,1,0,1,0,0,1,0,1,0,0,0,0,0,0,0,0,0,0,0,0,0,0,0]
[21,"Marcelo Pereira",249,3,38,null,"",3,38,null,"",2,41,1,"",13,18,null,"SIM",13,18,null,"",null,0,null,"",24,7,null,"SIM",9,26,null,"",1,45,null,"",26,5,null,"SIM",24,7,null,"SIM",26,5,null,"SIM",1,1,2,0,0,0,0,0,1,0,0,0,2,0,0,0,0,0,0,0,0,0,0,2,0,2,0,0,0,0,0,0,0,0,0,0,0,0,0,0,0]
[22,"Marcelo Sant'anna",57,17,14,null,"",21,10,null,"SIM",47,1,null,"SIM",null,0,null,"",null,0,null,"",6,32,null,"",null,0,null,"",null,0,null,"",null,0,null,"",null,0,null,"",null,0,null,"",null,0,null,"",0,0,0,0,0,1,0,0,0,0,0,0,0,0,0,0,1,0,0,0,1,0,0,0,0,0,0,0,0,0,0,0,0,0,0,0,0,0,0,0,0]
[23,"Bernardo Gatti",27,null,0,null,null,null,0,null,"",null,0,null,"",null,0,null,"",null,0,null,"",null,0,null,null,null,0,null,"",null,0,null,"",6,32,null,"",null,0,null,"",null,0,null,"",null,0,null,-5,0,0,0,0,0,2,1,0,1,0,0,0,1,0,0,0,0,0,0,0,0,0,0,0,2,0,0,0,0,0,0,0,0,0,0,0,0,0,0,0,0]
[24,"Maurício Júnior",244,13,18,null,"",9,26,null,"",9,26,null,null,10,24,null,"",12,20,null,"",22,9,null,"SIM",6,32,null,"",null,0,null,"",18,13,null,"",3,38,null,"",3,38,null,"",0,0,null,"",0,0,2,0,0,1,0,0,2,1,0,1,1,0,0,0,0,1,0,0,0,1,0,0,0,0,0,0,0,0,0,0,0,0,0,0,0,0,0,0,0]
[25,"Pedro Mello",15,null,0,null,"",29,2,null,"",null,0,null,"",null,0,null,"",null,0,null,"",18,13,null,"",null,0,null,"",null,0,null,"",null,0,null,"",null,0,null,"",null,0,null,"",null,0,null,"",0,0,0,0,0,0,0,0,0,0,0,0,0,0,0,0,0,1,0,0,0,0,0,0,0,0,0,0,1,0,0,0,0,0,0,0,0,0,0,0,0]
[26,"Raphael Reis",97,12,20,null,"",22,9,null,"",18,13,null,"",18,13,null,"",null,0,null,"",null,0,null,"",null,0,null,"",null,0,null,"",null,0,null,"",null,0,null,"",12,20,null,"",11,22,null,"",0,0,0,0,0,0,0,0,0,0,1,2,0,0,0,0,0,2,0,0,0,1,0,0,0,0,0,0,0,0,0,0,0,0,0,0,0,0,0,0,0]
[27,"Reila Ricardo",71,20,11,null,"",18,13,null,"",29,2,null,"",24,7,null,"",null,0,null,"",11,22,null,"",null,0,null,"",16,15,null,"",15,16,null,"",null,0,null,-5,null,0,null,-5,null,0,null,-5,0,0,0,0,0,0,0,0,0,0,1,0,0,0,1,1,0,1,0,1,0,0,0,1,0,0,0,0,1,0,0,0,0,0,0,0,0,0,0,0,0]
[28,"Renato Amaral",116,15,16,null,"",24,7,null,"",22,9,null,"SIM",19,12,null,"",17,14,null,"",null,0,null,"",null,0,null,-5,null,0,null,-5,5,34,null,"",10,24,null,"",21,10,null,"",null,0,null,"",0,0,0,0,1,0,0,0,0,1,0,0,0,0,1,0,1,0,1,0,1,1,0,1,0,0,0,0,0,0,0,0,0,0,0,0,0,0,0,0,0]
[29,"Rodrigo Mercadante",135,7,30,null,"",5,34,null,"",null,0,null,"",null,0,null,"",20,11,null,"SIM",7,30,null,"",7,30,null,"",null,0,null,"",null,0,null,"",null,0,null,"",null,0,null,"",null,0,null,"",0,0,0,0,1,0,3,0,0,0,0,0,0,0,0,0,0,0,0,1,0,0,0,0,0,0,0,0,0,0,0,0,0,0,0,0,0,0,0,0,0]
[30,"Rodrigo Ricardo",201,14,17,null,"",15,16,null,"",13,18,null,"",20,11,null,"",14,17,null,"",13,18,null,"",null,0,null,"",15,16,null,"",10,24,null,"",11,22,null,"",11,22,null,"",12,20,null,"",0,0,0,0,0,0,0,0,0,1,2,1,2,2,2,0,0,0,0,1,0,0,0,0,0,0,0,0,0,0,0,0,0,0,0,0,0,0,0,0,0]
[31,"Tati Marcondes",90,23,8,null,"SIM",26,5,null,"",20,11,null,"",22,9,null,"",19,12,null,"",44,1,null,"SIM",null,0,null,"",21,10,null,"",13,18,null,"",null,0,null,"",17,14,null,"",29,2,null,"SIM",0,0,0,0,0,0,0,0,0,0,0,0,1,0,0,0,1,0,1,1,1,1,1,0,0,1,0,0,1,0,0,0,0,0,0,0,0,0,0,0,0]
[32,"Wesley Bambirra",367,10,24,null,"",1,45,null,"",3,38,null,"",5,34,null,"",2,41,null,"",1,45,null,"",12,20,null,"",2,41,null,"",14,17,null,"",null,0,null,"",8,28,null,"",5,34,null,"",2,2,1,0,2,0,0,1,0,1,0,1,0,1,0,0,0,0,0,0,0,0,0,0,0,0,0,0,0,0,0,0,0,0,0,0,0,0,0,0,0]
[33,"Wesley Camargos",0,null,0,null,"",null,0,null,"",null,0,null,-5,25,6,null,"",null,0,null,-5,null,0,null,-5,17,14,null,"",null,0,null,-5,null,0,null,-5,null,0,null,-5,20,11,null,"",null,0,null,-5,0,0,0,0,0,0,0,0,0,0,0,0,0,0,0,0,1,0,0,1,0,0,0,0,1,0,0,0,0,0,0,0,0,0,0,0,0,0,0,0,0]
[34,"Wesley Canuto",331,28,3,null,"",10,24,null,"",12,20,null,"",7,30,null,"",10,24,null,"",5,34,null,"",8,28,null,"",3,38,null,"",16,15,null,"",2,41,null,"",4,36,null,"",3,38,null,"",0,1,2,1,1,0,1,1,0,2,0,1,0,0,0,1,0,0,0,0,0,0,0,0,0,0,0,1,0,0,0,0,0,0,0,0,0,0,0,0,0]
[35,"Roberta Epifânio",34,null,0,null,"",28,3,null,"",30,1,null,"",30,1,null,"",null,0,null,"",33,1,null,"SIM",18,13,null,"",22,9,null,"",null,0,null,"",null,0,null,"",25,6,null,"",null,0,null,"",0,0,0,0,0,0,0,0,0,0,0,0,0,0,0,0,0,1,0,0,0,1,0,0,1,0,0,1,0,2,0,0,1,0,0,0,0,0,0,0,0]
[36,"Jucimar Vieira",115,null,0,null,"",20,11,null,"",27,4,null,"",23,8,null,"",18,13,null,"",19,12,null,"",16,15,null,"",19,12,null,"",null,0,null,"",24,7,null,"SIM",16,15,null,"",13,18,null,"",0,0,0,0,0,0,0,0,0,0,0,0,1,0,0,2,0,1,2,1,0,0,1,1,0,0,1,0,0,0,0,0,0,0,0,0,0,0,0,0,0]
[37,"Andre Resende",0,null,0,null,"",null,0,null,null,null,0,null,"",null,0,null,"",null,0,null,"",null,0,null,"",null,0,null,"",20,11,null,"",null,0,null,-5,null,0,null,-5,null,0,null,-5,null,0,null,-5,0,0,0,0,0,0,0,0,0,0,0,1,0,0,0,0,0,0,0,1,0,1,0,0,0,2,0,0,0,0,0,0,0,0,0,0,0,0,0,0,0]
[38,"Izabella Rodrigues",5,null,0,null,"",null,0,null,null,25,6,null,"",14,17,null,"",null,0,null,-5,null,0,null,-5,15,16,null,-5,32,1,null,"SIM",null,0,null,-5,null,0,null,-5,null,0,null,-5,null,0,null,-5,0,0,0,0,0,0,0,0,0,0,0,0,0,1,1,0,0,0,0,0,0,0,0,0,1,0,0,0,0,0,0,1,0,0,0,0,0,0,0,0,0]
[39,"Lucca Veloso",34,null,0,null,"",null,0,null,null,null,0,null,"",null,0,null,"",null,0,null,"",null,0,null,"",null,0,null,"",6,32,1,"",50,0,null,"SIM",null,0,null,"",null,0,null,"",31,1,null,"SIM",0,0,0,0,0,1,0,0,0,0,0,0,0,0,0,0,0,0,0,0,0,0,0,0,0,0,0,0,0,0,1,0,0,0,0,0,0,0,0,0,0]
[40,"Vitor Gatti",127,null,0,null,"",null,0,null,null,null,0,null,"",null,0,null,"",null,0,null,"",null,0,null,"",null,0,null,"",14,17,null,"",9,26,null,"",8,28,null,"",9,26,null,"",7,30,null,"",0,0,0,0,0,0,1,1,2,0,0,0,0,1,0,0,0,0,0,0,0,0,0,0,0,0,0,0,0,0,0,0,0,0,0,0,0,0,0,0,0]
[41,"Gabriel Garabini",0,null,0,null,"",null,0,null,null,null,0,null,"",null,0,null,"",null,0,null,"",null,0,null,"",null,0,null,null,null,0,null,"",null,0,null,-5,null,0,null,-5,null,0,null,-5,null,0,null,-5,0,0,0,0,0,0,0,0,0,0,0,0,0,0,0,0,0,0,0,0,0,0,0,0,0,0,0,0,0,0,0,0,0,0,0,0,0,0,0,0,0]
[42,null,0,null,0,null,"",null,0,null,null,null,0,null,"",null,0,null,"",null,0,null,"",null,0,null,"",null,0,null,null,null,0,null,"",null,0,null,"",null,0,null,"",null,0,null,"",null,0,null,"",0,0,0,0,0,0,0,0,0,0,0,0,0,0,0,0,0,0,0,0,0,0,0,0,0,0,0,0,0,0,0,0,0,0,0,0,0,0,0,0,0]
[43,null,0,null,0,null,"",null,0,null,null,null,0,null,"",null,0,null,"",null,0,null,"",null,0,null,"",null,0,null,null,null,0,null,"",null,0,null,"",null,0,null,"",null,0,null,"",null,0,null,null,0,0,0,0,0,0,0,0,0,0,0,0,0,0,0,0,0,0,0,0,0,0,0,0,0,0,0,0,0,0,0,0,0,0,0,0,0,0,0,0,0]
[44,null,0,null,0,null,"",null,0,null,null,null,0,null,"",null,0,null,"",null,0,null,null,null,0,null,null,null,0,null,null,null,0,null,"",null,0,null,"",null,0,null,"",null,0,null,"",null,0,null,null,0,0,0,0,0,0,0,0,0,0,0,0,0,0,0,0,0,0,0,0,0,0,0,0,0,0,0,0,0,0,0,0,0,0,0,0,0,0,0,0,0]
[45,null,0,null,0,null,"",null,0,null,null,null,0,null,"",null,0,null,null,null,0,null,null,null,0,null,null,null,0,null,null,null,0,null,"",null,0,null,"",null,0,null,null,null,0,null,"",null,0,null,null,0,0,0,0,0,0,0,0,0,0,0,0,0,0,0,0,0,0,0,0,0,0,0,0,0,0,0,0,0,0,0,0,0,0,0,0,0,0,0,0,0]
[null,null,null,null,null,null,null,null,null,null,null,null,null,null,null,null,null,null,null,null,null,null,null,null,null,null,null,null,null,null,null,null,null,null,null,null,null,null,null,null,null,null,null,null,null,null,""]
[null,null,null,null,null,null,null,null,null,null,null,null,null,null,null,null,null,null,null,null,null,null,null,null,null,null,null,null,null,null,null,null,null,null,null,null,null,null,null,null,null,null,null,null,null,null,""]
[null,null,null,null,null,null,null,null,null,null,null,null,null,null,null,null,null,null,null,null,null,null,null,null,null,null,null,null,null,null,null,null,null,null,null,null,null,null,null,null,null,null,null,null,null,null,""]
[null,null,null,null,null,null,null,null,null,null,null,null,1,null,null,null,null,null,null,null,null,null,null,null,null,null,null,null,null,null,null,null,null,null,null,null,null,null,null,null,null,null,null,null,null,null,""]
[]
[null,null,null,null,null,null,null,null,null,null,null,29]

{"sheet":"Classificação Geral","index":5,"n_rows":55,"n_cols":92,"rows_kept":55,"cut":false,"hidden":false,"merged":[[1,43,1,46],[1,47,1,50],[2,3,2,6],[2,7,2,10],[2,11,2,14],[2,15,2,18],[2,19,2,22],[2,23,2,26],[2,27,2,30],[2,31,2,34],[2,35,2,38],[2,39,2,42],[2,43,2,46],[2,47,2,50],[1,23,1,26],[1,27,1,30],[1,31,1,34],[1,35,1,38],[1,39,1,42],[1,3,1,6],[1,7,1,10],[1,11,1,14],[1,15,1,18],[1,19,1,22]]}
[2022,null,null,null,"OK",null,null,null,"OK",null,null,null,"OK",null,null,null,"OK",null,null,null,"OK",null,null,null,"OK",null,null,null,"OK",null,null,null,"OK",null,null,null,"OK",null,null,null,"OK",null,null,null,"OK",null,null,null,"OK"]
[null,null,null,"1ª etapa",null,null,null,"2ª etapa",null,null,null,"3ª etapa",null,null,null,"4ª etapa",null,null,null,"5ª etapa",null,null,null,"6ª etapa",null,null,null,"7ª etapa",null,null,null,"8ª etapa",null,null,null,"9ª etapa",null,null,null,"10ª etapa",null,null,null,"11ª etapa",null,null,null,"12ª etapa"]
[null,null,null,null,null,null,null,null,null,null,null,"13/03/2022 - 10:00 - Domingo"]
[null,"Nome do (a) Piloto (a)","Pontuação Geral","Posição","Pontos","Bônus","Penalidade","Posição","Pontos","Bônus","Penalidade","Posição","Pontos","Bônus","Penalidade","Posição","Pontos","Bônus","Penalidade","Posição","Pontos","Bônus","Penalidade","Posição","Pontos","Bônus","Penalidade","Posição","Pontos","Bônus","Penalidade","Posição","Pontos","Bônus","Penalidade","Posição","Pontos","Bônus","Penalidade","Posição","Pontos","Bônus","Penalidade","Posição","Pontos","Bônus","Penalidade","Posição","Pontos","Bônus","Penalidade","1º LUGAR","2º LUGAR","3º LUGAR","4º LUGAR","5º LUGAR","6º LUGAR","7º LUGAR","8º LUGAR","9º LUGAR","10º LUGAR","11º LUGAR","12º LUGAR","13º LUGAR","14º LUGAR","15º LUGAR","16º LUGAR","17º LUGAR","18º LUGAR","19º LUGAR","20º LUGAR","21º LUGAR","22º LUGAR","23º LUGAR","24º LUGAR","25º LUGAR","26º LUGAR","27º LUGAR","28º LUGAR","29º LUGAR","30º LUGAR","31º LUGAR","32º LUGAR","33º LUGAR","34º LUGAR","35º LUGAR","36º LUGAR","37º LUGAR","38º LUGAR","39º LUGAR","40º LUGAR","41º LUGAR"]
[1,"Marcelo Campos",413,2,41,1,"",8,28,null,"",4,36,null,"",1,45,null,"",5,34,null,"",20,11,1,"",2,41,1,"",5,34,null,"",3,38,null,"",6,32,null,"",1,45,1,"",10,24,null,"",2,2,1,1,2,1,0,1,0,1,0,0,0,0,0,0,0,0,0,1,0,0,0,0,0,0,0,0,0,0,0,0,0,0,0,0,0,0,0,0,0]
[2,"Daniel Nahum",394,1,45,null,"",4,36,null,"",5,34,null,null,3,38,1,"",23,8,null,"",3,38,null,"",3,38,null,"",7,30,null,"",4,36,null,"",4,36,null,"",23,8,null,"",1,45,1,"",2,0,3,3,1,0,1,0,0,0,0,0,0,0,0,0,0,0,0,0,0,0,2,0,0,0,0,0,0,0,0,0,0,0,0,0,0,0,0,0,0]
[3,"Wesley Bambirra",367,10,24,null,"",1,45,null,"",3,38,null,"",5,34,null,"",2,41,null,"",1,45,null,"",12,20,null,"",2,41,null,"",14,17,null,"",null,0,null,"",8,28,null,"",5,34,null,"",2,2,1,0,2,0,0,1,0,1,0,1,0,1,0,0,0,0,0,0,0,0,0,0,0,0,0,0,0,0,0,0,0,0,0,0,0,0,0,0,0]
[4,"Wesley Canuto",331,28,3,null,"",10,24,null,"",12,20,null,"",7,30,null,"",10,24,null,"",5,34,null,"",8,28,null,"",3,38,null,"",16,15,null,"",2,41,null,"",4,36,null,"",3,38,null,"",0,1,2,1,1,0,1,1,0,2,0,1,0,0,0,1,0,0,0,0,0,0,0,0,0,0,0,1,0,0,0,0,0,0,0,0,0,0,0,0,0]
[5,"Jarbas Reis",324,6,32,null,"",6,32,null,"",21,10,null,"",11,22,null,"",4,36,null,"",8,28,null,"",11,22,null,"",13,18,null,"",8,28,null,"",7,30,null,"",7,30,null,"",4,36,null,"",0,0,0,2,0,2,2,2,0,0,2,0,1,0,0,0,0,0,0,0,1,0,0,0,0,0,0,0,0,0,0,0,0,0,0,0,0,0,0,0,0]
[6,"Alexandre Melillo",300,11,22,null,"",12,20,null,"",17,14,null,"",2,41,null,"",6,32,null,"",2,41,null,"",4,36,null,"",11,22,null,"",17,14,null,"SIM",5,34,null,"",10,24,null,"",null,0,null,"",0,2,0,1,1,1,0,0,0,1,2,1,0,0,0,0,2,0,0,0,0,0,0,0,0,0,0,0,0,0,0,0,0,0,0,0,0,0,0,0,0]
[7,"Marcelo Clemente",295,27,4,null,"",17,14,1,"",11,22,null,"",15,16,null,"SIM",1,45,1,"",9,26,null,"",1,45,null,"",1,45,null,"",7,30,1,-5,null,0,null,"",22,9,null,"",2,41,null,"",3,1,0,0,0,0,1,0,1,0,1,0,0,0,1,0,1,0,0,0,0,1,0,0,0,0,1,0,0,0,0,0,0,0,0,0,0,0,0,0,0]
[8,"Marcelo Pereira",249,3,38,null,"",3,38,null,"",2,41,1,"",13,18,null,"SIM",13,18,null,"",null,0,null,"",24,7,null,"SIM",9,26,null,"",1,45,null,"",26,5,null,"SIM",24,7,null,"SIM",26,5,null,"SIM",1,1,2,0,0,0,0,0,1,0,0,0,2,0,0,0,0,0,0,0,0,0,0,2,0,2,0,0,0,0,0,0,0,0,0,0,0,0,0,0,0]
[9,"Guilherme Alves",249,9,26,null,"",11,22,null,"",10,24,null,"",16,15,null,"",11,22,null,"",16,15,null,"SIM",5,34,null,"",4,36,null,"",11,22,null,"",null,0,null,"",6,32,null,"",37,1,null,"SIM",0,0,0,1,1,1,0,0,1,1,3,0,0,0,0,2,0,0,0,0,0,0,0,0,0,0,0,0,0,0,0,0,0,0,0,0,1,0,0,0,0]
[10,"Maurício Júnior",244,13,18,null,"",9,26,null,"",9,26,null,null,10,24,null,"",12,20,null,"",22,9,null,"SIM",6,32,null,"",null,0,null,"",18,13,null,"",3,38,null,"",3,38,null,"",0,0,null,"",0,0,2,0,0,1,0,0,2,1,0,1,1,0,0,0,0,1,0,0,0,1,0,0,0,0,0,0,0,0,0,0,0,0,0,0,0,0,0,0,0]
[11,"Marcelo Marcondes",243,21,10,null,"SIM",7,30,null,"",1,45,null,"",8,28,null,"",24,7,null,"",17,14,null,"SIM",null,0,null,-5,10,24,null,"",19,12,null,"",1,45,1,"",26,5,null,"",6,32,null,-5,2,0,0,0,0,1,1,1,0,1,0,0,0,0,0,0,1,0,1,0,1,0,0,1,0,1,0,0,0,0,0,0,0,0,0,0,0,0,0,0,0]
[12,"Eduardo Henrique",228,null,0,null,"",42,1,null,"SIM",14,17,null,"",12,20,null,"",3,38,null,"",4,36,null,"",9,26,null,"",12,20,null,"",2,41,null,"",null,0,null,"",5,34,null,"",null,0,null,-5,0,1,1,1,1,0,0,0,1,0,0,2,0,1,0,0,0,0,0,0,0,0,0,0,0,0,0,0,0,0,0,0,0,0,0,0,0,0,0,0,0]
[13,"Rodrigo Ricardo",201,14,17,null,"",15,16,null,"",13,18,null,"",20,11,null,"",14,17,null,"",13,18,null,"",null,0,null,"",15,16,null,"",10,24,null,"",11,22,null,"",11,22,null,"",12,20,null,"",0,0,0,0,0,0,0,0,0,1,2,1,2,2,2,0,0,0,0,1,0,0,0,0,0,0,0,0,0,0,0,0,0,0,0,0,0,0,0,0,0]
[14,"Marcelo Chagas",186,19,12,null,"",0,0,null,"SIM",8,28,null,"",null,0,null,-5,8,28,null,"",10,24,null,null,13,18,null,"",23,8,null,"",null,0,null,"",14,17,null,"",2,41,null,"",16,15,null,"",0,1,0,0,0,0,0,2,0,1,0,0,1,1,0,1,0,0,1,0,0,0,1,0,0,0,0,0,0,0,0,0,0,0,0,0,0,0,0,0,0]
[15,"Rodrigo Mercadante",135,7,30,null,"",5,34,null,"",null,0,null,"",null,0,null,"",20,11,null,"SIM",7,30,null,"",7,30,null,"",null,0,null,"",null,0,null,"",null,0,null,"",null,0,null,"",null,0,null,"",0,0,0,0,1,0,3,0,0,0,0,0,0,0,0,0,0,0,0,1,0,0,0,0,0,0,0,0,0,0,0,0,0,0,0,0,0,0,0,0,0]
[16,"Vitor Gatti",127,null,0,null,"",null,0,null,null,null,0,null,"",null,0,null,"",null,0,null,"",null,0,null,"",null,0,null,"",14,17,null,"",9,26,null,"",8,28,null,"",9,26,null,"",7,30,null,"",0,0,0,0,0,0,1,1,2,0,0,0,0,1,0,0,0,0,0,0,0,0,0,0,0,0,0,0,0,0,0,0,0,0,0,0,0,0,0,0,0]
[17,"Renato Amaral",116,15,16,null,"",24,7,null,"",22,9,null,"SIM",19,12,null,"",17,14,null,"",null,0,null,"",null,0,null,-5,null,0,null,-5,5,34,null,"",10,24,null,"",21,10,null,"",null,0,null,"",0,0,0,0,1,0,0,0,0,1,0,0,0,0,1,0,1,0,1,0,1,1,0,1,0,0,0,0,0,0,0,0,0,0,0,0,0,0,0,0,0]
[18,"Jucimar Vieira",115,null,0,null,"",20,11,null,"",27,4,null,"",23,8,null,"",18,13,null,"",19,12,null,"",16,15,null,"",19,12,null,"",null,0,null,"",24,7,null,"SIM",16,15,null,"",13,18,null,"",0,0,0,0,0,0,0,0,0,0,0,0,1,0,0,2,0,1,2,1,0,0,1,1,0,0,1,0,0,0,0,0,0,0,0,0,0,0,0,0,0]
[19,"Hélio Chagas",112,22,9,null,"",23,8,null,"",23,8,null,"",null,0,null,-5,21,10,null,"",15,16,null,"",26,5,null,"SIM",17,14,null,"",null,0,null,"",13,18,null,"",19,12,null,"",14,17,null,"",0,0,0,0,0,0,0,0,0,0,0,0,1,1,1,0,1,0,1,0,1,1,2,0,0,1,0,0,0,0,0,0,0,0,0,0,0,0,0,0,0]
[20,"Cláudio Dumont",102,8,28,null,"",2,41,null,"",15,16,null,"",4,36,null,"",25,6,null,"",null,0,null,"",null,0,null,-5,null,0,null,-5,null,0,null,-5,null,0,null,-5,null,0,null,-5,null,0,null,"",0,1,0,1,0,0,0,1,0,0,0,0,0,0,1,0,0,0,0,0,0,0,0,0,1,0,0,0,0,0,0,0,0,0,0,0,0,0,0,0,0]
[21,"Raphael Reis",97,12,20,null,"",22,9,null,"",18,13,null,"",18,13,null,"",null,0,null,"",null,0,null,"",null,0,null,"",null,0,null,"",null,0,null,"",null,0,null,"",12,20,null,"",11,22,null,"",0,0,0,0,0,0,0,0,0,0,1,2,0,0,0,0,0,2,0,0,0,1,0,0,0,0,0,0,0,0,0,0,0,0,0,0,0,0,0,0,0]
[22,"Felipe Bouhid",96,null,0,null,"",null,0,null,"",null,0,null,"",null,0,null,"",null,0,null,"",null,0,null,"",null,0,null,"",18,13,null,"",12,20,null,"",12,20,null,"",14,17,null,"",9,26,null,"",0,0,0,0,0,0,0,0,1,0,0,2,0,1,0,1,0,1,1,0,0,0,0,0,0,0,0,0,1,0,0,0,0,0,0,0,0,0,0,0,0]
[23,"Cláudio Naves",95,24,7,null,"",27,4,null,"",24,7,null,"",33,1,null,"SIM",44,1,null,"SIM",14,17,null,"",14,17,null,"",null,0,null,"",null,0,null,"",null,0,null,"",18,13,null,"",8,28,null,"",0,0,0,0,0,0,0,1,0,0,0,0,0,2,0,0,0,1,0,0,0,0,0,2,0,0,1,0,0,0,0,0,1,0,0,0,0,0,0,0,0]
[24,"Tati Marcondes",90,23,8,null,"SIM",26,5,null,"",20,11,null,"",22,9,null,"",19,12,null,"",44,1,null,"SIM",null,0,null,"",21,10,null,"",13,18,null,"",null,0,null,"",17,14,null,"",29,2,null,"SIM",0,0,0,0,0,0,0,0,0,0,0,0,1,0,0,0,1,0,1,1,1,1,1,0,0,1,0,0,1,0,0,0,0,0,0,0,0,0,0,0,0]
[25,"Frederico Papatella",88,5,34,null,"",14,17,null,"",28,3,null,"SIM",null,0,null,"",null,0,null,"",null,0,null,"",null,0,null,-5,null,0,null,"",null,0,null,-5,9,26,null,"",13,18,null,"",null,0,null,"",0,0,0,0,1,0,0,0,1,0,0,0,1,1,0,0,0,0,0,0,0,0,0,0,0,0,0,1,0,0,0,0,0,0,0,0,0,0,0,0,0]
[26,"Reila Ricardo",71,20,11,null,"",18,13,null,"",29,2,null,"",24,7,null,"",null,0,null,"",11,22,null,"",null,0,null,"",16,15,null,"",15,16,null,"",null,0,null,-5,null,0,null,-5,null,0,null,-5,0,0,0,0,0,0,0,0,0,0,1,0,0,0,1,1,0,1,0,1,0,0,0,1,0,0,0,0,1,0,0,0,0,0,0,0,0,0,0,0,0]
[27,"Leandro Malias",70,16,15,null,"",25,6,null,"",null,0,null,"",null,0,null,-5,null,0,null,"",21,10,null,"",19,12,null,"",null,0,null,"",null,0,null,"",null,0,null,"",15,16,null,"",15,16,null,"",0,0,0,0,0,0,0,0,0,0,0,0,0,0,2,1,0,0,1,0,1,0,0,0,1,0,0,0,0,0,0,0,0,0,0,0,0,0,0,0,0]
[28,"Bernardo Freitas",66,26,5,null,"",null,0,null,"",6,32,null,"",17,14,null,"",15,16,null,"",27,4,null,"SIM",null,0,null,"",null,0,null,"",null,0,null,"",null,0,null,"",null,0,null,"",null,0,null,-5,0,0,0,0,0,1,0,0,0,0,0,0,0,0,1,0,1,0,0,0,0,0,0,0,0,1,1,0,0,0,0,0,0,0,0,0,0,0,0,0,0]
[29,"Marcelo Sant'anna",57,17,14,null,"",21,10,null,"SIM",47,1,null,"SIM",null,0,null,"",null,0,null,"",6,32,null,"",null,0,null,"",null,0,null,"",null,0,null,"",null,0,null,"",null,0,null,"",null,0,null,"",0,0,0,0,0,1,0,0,0,0,0,0,0,0,0,0,1,0,0,0,1,0,0,0,0,0,0,0,0,0,0,0,0,0,0,0,0,0,0,0,0]
[30,"Lucas Guimarães",54,null,0,null,"",32,1,null,"SIM",null,0,null,-5,33,1,null,"SIM",7,30,null,"",null,0,null,-5,10,24,null,"",8,28,null,"",null,0,null,-5,null,0,null,-5,null,0,null,-5,null,0,null,-5,0,0,0,0,0,0,1,1,0,1,0,0,0,0,0,0,0,0,0,0,0,0,0,0,0,0,0,0,0,0,0,1,1,0,0,0,0,0,0,0,0]
[31,"Luciano Robervine",38,4,36,null,"",33,1,null,"SIM",16,15,null,null,9,26,null,"",null,0,null,-5,null,0,null,-5,null,0,null,-5,null,0,null,-5,null,0,null,-5,null,0,null,-5,null,0,null,-5,null,0,null,-5,0,0,0,1,0,0,0,0,1,0,0,0,0,0,0,1,0,0,0,0,0,0,0,0,0,0,0,0,0,0,0,0,1,0,0,0,0,0,0,0,0]
[32,"Lucca Veloso",34,null,0,null,"",null,0,null,null,null,0,null,"",null,0,null,"",null,0,null,"",null,0,null,"",null,0,null,"",6,32,1,"",50,0,null,"SIM",null,0,null,"",null,0,null,"",31,1,null,"SIM",0,0,0,0,0,1,0,0,0,0,0,0,0,0,0,0,0,0,0,0,0,0,0,0,0,0,0,0,0,0,1,0,0,0,0,0,0,0,0,0,0]
[33,"Roberta Epifânio",34,null,0,null,"",28,3,null,"",30,1,null,"",30,1,null,"",null,0,null,"",33,1,null,"SIM",18,13,null,"",22,9,null,"",null,0,null,"",null,0,null,"",25,6,null,"",null,0,null,"",0,0,0,0,0,0,0,0,0,0,0,0,0,0,0,0,0,1,0,0,0,1,0,0,1,0,0,1,0,2,0,0,1,0,0,0,0,0,0,0,0]
[34,"Bernardo Gatti",27,null,0,null,null,null,0,null,"",null,0,null,"",null,0,null,"",null,0,null,"",null,0,null,null,null,0,null,"",null,0,null,"",6,32,null,"",null,0,null,"",null,0,null,"",null,0,null,-5,0,0,0,0,0,2,1,0,1,0,0,0,1,0,0,0,0,0,0,0,0,0,0,0,2,0,0,0,0,0,0,0,0,0,0,0,0,0,0,0,0]
[35,"Pedro Mello",15,null,0,null,"",29,2,null,"",null,0,null,"",null,0,null,"",null,0,null,"",18,13,null,"",null,0,null,"",null,0,null,"",null,0,null,"",null,0,null,"",null,0,null,"",null,0,null,"",0,0,0,0,0,0,0,0,0,0,0,0,0,0,0,0,0,1,0,0,0,0,0,0,0,0,0,0,1,0,0,0,0,0,0,0,0,0,0,0,0]
[36,"Izabella Rodrigues",5,null,0,null,"",null,0,null,null,25,6,null,"",14,17,null,"",null,0,null,-5,null,0,null,-5,15,16,null,-5,32,1,null,"SIM",null,0,null,-5,null,0,null,-5,null,0,null,-5,null,0,null,-5,0,0,0,0,0,0,0,0,0,0,0,0,0,1,1,0,0,0,0,0,0,0,0,0,1,0,0,0,0,0,0,1,0,0,0,0,0,0,0,0,0]
[37,"Andre Resende",0,null,0,null,"",null,0,null,null,null,0,null,"",null,0,null,"",null,0,null,"",null,0,null,"",null,0,null,"",20,11,null,"",null,0,null,-5,null,0,null,-5,null,0,null,-5,null,0,null,-5,0,0,0,0,0,0,0,0,0,0,0,1,0,0,0,0,0,0,0,1,0,1,0,0,0,2,0,0,0,0,0,0,0,0,0,0,0,0,0,0,0]
[38,"SSSSS",0,null,0,null,"",null,0,null,"",null,0,null,null,null,0,null,"",null,0,null,"",null,0,null,"",null,0,null,null,null,0,null,"",null,0,null,"",null,0,null,"",null,0,null,"",null,0,null,"",0,0,0,0,0,0,0,0,0,0,0,0,0,0,0,1,0,1,1,0,1,0,0,0,0,0,0,0,0,0,0,0,0,0,0,0,0,0,0,0,0]
[39,"Wesley Camargos",0,null,0,null,"",null,0,null,"",null,0,null,-5,25,6,null,"",null,0,null,-5,null,0,null,-5,17,14,null,"",null,0,null,-5,null,0,null,-5,null,0,null,-5,20,11,null,"",null,0,null,-5,0,0,0,0,0,0,0,0,0,0,0,0,0,0,0,0,1,0,0,1,0,0,0,0,1,0,0,0,0,0,0,0,0,0,0,0,0,0,0,0,0]
[40,"Hugo Denucci",0,null,0,null,-5,null,0,null,-5,null,0,null,"",null,0,null,-5,null,0,null,"",null,0,null,"",null,0,null,"",null,0,null,-5,null,0,null,-5,null,0,null,-5,null,0,null,-5,null,0,null,-5,0,0,0,0,0,0,0,0,0,0,0,0,0,0,0,0,0,0,0,0,0,0,0,0,0,0,0,0,0,0,0,0,0,0,0,0,0,0,0,0,0]
[41,"Gabriel Garabini",0,null,0,null,"",null,0,null,null,null,0,null,"",null,0,null,"",null,0,null,"",null,0,null,"",null,0,null,null,null,0,null,"",null,0,null,-5,null,0,null,-5,null,0,null,-5,null,0,null,-5,0,0,0,0,0,0,0,0,0,0,0,0,0,0,0,0,0,0,0,0,0,0,0,0,0,0,0,0,0,0,0,0,0,0,0,0,0,0,0,0,0]
[42,null,0,null,0,null,"",null,0,null,null,null,0,null,"",null,0,null,"",null,0,null,"",null,0,null,"",null,0,null,null,null,0,null,"",null,0,null,"",null,0,null,"",null,0,null,"",null,0,null,"",0,0,0,0,0,0,0,0,0,0,0,0,0,0,0,0,0,0,0,0,0,0,0,0,0,0,0,0,0,0,0,0,0,0,0,0,0,0,0,0,0]
[43,null,0,null,0,null,"",null,0,null,null,null,0,null,"",null,0,null,"",null,0,null,"",null,0,null,"",null,0,null,null,null,0,null,"",null,0,null,"",null,0,null,"",null,0,null,"",null,0,null,null,0,0,0,0,0,0,0,0,0,0,0,0,0,0,0,0,0,0,0,0,0,0,0,0,0,0,0,0,0,0,0,0,0,0,0,0,0,0,0,0,0]
[44,null,0,null,0,null,"",null,0,null,null,null,0,null,"",null,0,null,"",null,0,null,null,null,0,null,null,null,0,null,null,null,0,null,"",null,0,null,"",null,0,null,"",null,0,null,"",null,0,null,null,0,0,0,0,0,0,0,0,0,0,0,0,0,0,0,0,0,0,0,0,0,0,0,0,0,0,0,0,0,0,0,0,0,0,0,0,0,0,0,0,0]
[45,null,0,null,0,null,"",null,0,null,null,null,0,null,"",null,0,null,null,null,0,null,null,null,0,null,null,null,0,null,null,null,0,null,"",null,0,null,"",null,0,null,null,null,0,null,"",null,0,null,null,0,0,0,0,0,0,0,0,0,0,0,0,0,0,0,0,0,0,0,0,0,0,0,0,0,0,0,0,0,0,0,0,0,0,0,0,0,0,0,0,0]
[null,null,null,null,null,null,null,null,null,null,null,null,null,null,null,null,null,null,null,null,null,null,null,null,null,null,null,null,null,null,null,null,null,null,null,null,null,null,null,null,null,null,null,null,null,null,""]
[null,null,null,null,null,null,null,null,null,null,null,null,null,null,null,null,null,null,null,null,null,null,null,null,null,null,null,null,null,null,null,null,null,null,null,null,null,null,null,null,null,null,null,null,null,null,""]
[null,null,null,null,null,null,null,null,null,null,null,null,null,null,null,null,null,null,null,null,null,null,null,null,null,null,null,null,null,null,null,null,null,null,null,null,null,null,null,null,null,null,null,null,null,null,""]
[null,null,null,null,null,null,null,null,null,null,null,null,1,null,null,null,null,null,null,null,null,null,null,null,null,null,null,null,null,null,null,null,null,null,null,null,null,null,null,null,null,null,null,null,null,null,""]
[]
[null,null,null,null,null,null,null,null,null,null,null,29]

{"sheet":"Class. elimin. 2 piores res","index":6,"n_rows":55,"n_cols":92,"rows_kept":55,"cut":false,"hidden":false,"merged":[[1,43,1,46],[1,47,1,50],[2,3,2,6],[2,7,2,10],[2,11,2,14],[2,15,2,18],[2,19,2,22],[2,23,2,26],[2,27,2,30],[2,31,2,34],[2,35,2,38],[2,39,2,42],[2,43,2,46],[2,47,2,50],[1,23,1,26],[1,27,1,30],[1,31,1,34],[1,35,1,38],[1,39,1,42],[1,3,1,6],[1,7,1,10],[1,11,1,14],[1,15,1,18],[1,19,1,22]]}
[2022,null,null,null,"OK",null,null,null,"OK",null,null,null,"OK",null,null,null,"OK",null,null,null,"OK",null,null,null,"OK",null,null,null,"OK",null,null,null,"OK",null,null,null,"OK",null,null,null,"OK",null,null,null,"OK",null,null,null,"OK"]
[null,null,null,"1ª etapa",null,null,null,"2ª etapa",null,null,null,"3ª etapa",null,null,null,"4ª etapa",null,null,null,"5ª etapa",null,null,null,"6ª etapa",null,null,null,"7ª etapa",null,null,null,"8ª etapa",null,null,null,"9ª etapa",null,null,null,"10ª etapa",null,null,null,"11ª etapa",null,null,null,"12ª etapa"]
[null,null,null,null,null,null,null,null,null,null,null,"13/03/2022 - 10:00 - Domingo"]
[null,"Nome do (a) Piloto (a)","Pontuação Geral","Posição","Pontos","Bônus","Penalidade","Posição","Pontos","Bônus","Penalidade","Posição","Pontos","Bônus","Penalidade","Posição","Pontos","Bônus","Penalidade","Posição","Pontos","Bônus","Penalidade","Posição","Pontos","Bônus","Penalidade","Posição","Pontos","Bônus","Penalidade","Posição","Pontos","Bônus","Penalidade","Posição","Pontos","Bônus","Penalidade","Posição","Pontos","Bônus","Penalidade","Posição","Pontos","Bônus","Penalidade","Posição","Pontos","Bônus","Penalidade","1º LUGAR","2º LUGAR","3º LUGAR","4º LUGAR","5º LUGAR","6º LUGAR","7º LUGAR","8º LUGAR","9º LUGAR","10º LUGAR","11º LUGAR","12º LUGAR","13º LUGAR","14º LUGAR","15º LUGAR","16º LUGAR","17º LUGAR","18º LUGAR","19º LUGAR","20º LUGAR","21º LUGAR","22º LUGAR","23º LUGAR","24º LUGAR","25º LUGAR","26º LUGAR","27º LUGAR","28º LUGAR","29º LUGAR","30º LUGAR","31º LUGAR","32º LUGAR","33º LUGAR","34º LUGAR","35º LUGAR","36º LUGAR","37º LUGAR","38º LUGAR","39º LUGAR","40º LUGAR","41º LUGAR"]
[1,"Marcelo Campos",378,2,41,1,"",8,28,null,"",4,36,null,"",1,45,null,"",5,34,null,"",20,"11*",1,"",2,41,1,"",5,34,null,"",3,38,null,"",6,32,null,"",1,45,1,"",10,"24*",null,"",2,2,1,1,2,1,0,1,0,1,0,0,0,0,0,0,0,0,0,1,0,0,0,0,0,0,0,0,0,0,0,0,0,0,0,0,0,0,0,0,0]
[2,"Daniel Nahum",378,1,45,null,"",4,36,null,"",5,34,null,null,3,38,1,"",23,"8*",null,"",3,38,null,"",3,38,null,"",7,30,null,"",4,36,null,"",4,36,null,"",23,"8*",null,"",1,45,1,"",2,0,3,3,1,0,1,0,0,0,0,0,0,0,0,0,0,0,0,0,0,0,2,0,0,0,0,0,0,0,0,0,0,0,0,0,0,0,0,0,0]
[3,"Wesley Bambirra",350,10,24,null,"",1,45,null,"",3,38,null,"",5,34,null,"",2,41,null,"",1,45,null,"",12,20,null,"",2,41,null,"",14,"17*",null,"",null,"0*",null,"",8,28,null,"",5,34,null,"",2,2,1,0,2,0,0,1,0,1,0,1,0,1,0,0,0,0,0,0,0,0,0,0,0,0,0,0,0,0,0,0,0,0,0,0,0,0,0,0,0]
[4,"Wesley Canuto",313,28,"3*",null,"",10,24,null,"",12,20,null,"",7,30,null,"",10,24,null,"",5,34,null,"",8,28,null,"",3,38,null,"",16,"15*",null,"",2,41,null,"",4,36,null,"",3,38,null,"",0,1,2,1,1,0,1,1,0,2,0,1,0,0,0,1,0,0,0,0,0,0,0,0,0,0,0,1,0,0,0,0,0,0,0,0,0,0,0,0,0]
[5,"Jarbas Reis",296,6,32,null,"",6,32,null,"",21,"10*",null,"",11,22,null,"",4,36,null,"",8,28,null,"",11,22,null,"",13,"18*",null,"",8,28,null,"",7,30,null,"",7,30,null,"",4,36,null,"",0,0,0,2,0,2,2,2,0,0,2,0,1,0,0,0,0,0,0,0,1,0,0,0,0,0,0,0,0,0,0,0,0,0,0,0,0,0,0,0,0]
[6,"Marcelo Clemente",291,27,"4*",null,"",17,14,1,"",11,22,null,"",15,16,null,"SIM",1,45,1,"",9,26,null,"",1,45,null,"",1,45,null,"",7,30,1,-5,null,"0*",null,"",22,9,null,"",2,41,null,"",3,1,0,0,0,0,1,0,1,0,1,0,0,0,1,0,1,0,0,0,0,1,0,0,0,0,1,0,0,0,0,0,0,0,0,0,0,0,0,0,0]
[7,"Alexandre Melillo",286,11,22,null,"",12,20,null,"",17,"14*",null,"",2,41,null,"",6,32,null,"",2,41,null,"",4,36,null,"",11,22,null,"",17,14,null,"SIM",5,34,null,"",10,24,null,"",null,"0*",null,"",0,2,0,1,1,1,0,0,0,1,2,1,0,0,0,0,2,0,0,0,0,0,0,0,0,0,0,0,0,0,0,0,0,0,0,0,0,0,0,0,0]
[8,"Marcelo Marcondes",238,21,10,null,"SIM",7,30,null,"",1,45,null,"",8,28,null,"",24,7,null,"",17,14,null,"SIM",null,"0*",null,-5,10,24,null,"",19,12,null,"",1,45,1,"",26,"5*",null,"",6,32,null,-5,2,0,0,0,0,1,1,1,0,1,0,0,0,0,0,0,1,0,1,0,1,0,0,1,0,1,0,0,0,0,0,0,0,0,0,0,0,0,0,0,0]
[9,"Guilherme Alves",234,9,26,null,"",11,22,null,"",10,24,null,"",16,"15*",null,"",11,22,null,"",16,15,null,"SIM",5,34,null,"",4,36,null,"",11,22,null,"",null,"0*",null,"",6,32,null,"",37,1,null,"SIM",0,0,0,1,1,1,0,0,1,1,3,0,0,0,0,2,0,0,0,0,0,0,0,0,0,0,0,0,0,0,0,0,0,0,0,0,1,0,0,0,0]
[10,"Marcelo Pereira",231,3,38,null,"",3,38,null,"",2,41,1,"",13,18,null,"SIM",13,"18*",null,"",null,"0*",null,"",24,7,null,"SIM",9,26,null,"",1,45,null,"",26,5,null,"SIM",24,7,null,"SIM",26,5,null,"SIM",1,1,2,0,0,0,0,0,1,0,0,0,2,0,0,0,0,0,0,0,0,0,0,2,0,2,0,0,0,0,0,0,0,0,0,0,0,0,0,0,0]
[11,"Maurício Júnior",231,13,18,null,"",9,26,null,"",9,26,null,null,10,24,null,"",12,20,null,"",22,9,null,"SIM",6,32,null,"",null,"0*",null,"",18,"13*",null,"",3,38,null,"",3,38,null,"",0,0,null,"",0,0,2,0,0,1,0,0,2,1,0,1,1,0,0,0,0,1,0,0,0,1,0,0,0,0,0,0,0,0,0,0,0,0,0,0,0,0,0,0,0]
[12,"Eduardo Henrique",228,null,"0*",null,"",42,1,null,"SIM",14,17,null,"",12,20,null,"",3,38,null,"",4,36,null,"",9,26,null,"",12,20,null,"",2,41,null,"",null,"0*",null,"",5,34,null,"",null,0,null,-5,0,1,1,1,1,0,0,0,1,0,0,2,0,1,0,0,0,0,0,0,0,0,0,0,0,0,0,0,0,0,0,0,0,0,0,0,0,0,0,0,0]
[13,"Rodrigo Ricardo",190,14,17,null,"",15,16,null,"",13,18,null,"",20,"11*",null,"",14,17,null,"",13,18,null,"",null,"0*",null,"",15,16,null,"",10,24,null,"",11,22,null,"",11,22,null,"",12,20,null,"",0,0,0,0,0,0,0,0,0,1,2,1,2,2,2,0,0,0,0,1,0,0,0,0,0,0,0,0,0,0,0,0,0,0,0,0,0,0,0,0,0]
[14,"Marcelo Chagas",186,19,12,null,"",0,0,null,"SIM",8,28,null,"",null,"0*",null,-5,8,28,null,"",10,24,null,null,13,18,null,"",23,8,null,"",null,"0*",null,"",14,17,null,"",2,41,null,"",16,15,null,"",0,1,0,0,0,0,0,2,0,1,0,0,1,1,0,1,0,0,1,0,0,0,1,0,0,0,0,0,0,0,0,0,0,0,0,0,0,0,0,0,0]
[15,"Rodrigo Mercadante",135,7,30,null,"",5,34,null,"",null,"0*",null,"",null,"0*",null,"",20,11,null,"SIM",7,30,null,"",7,30,null,"",null,0,null,"",null,0,null,"",null,0,null,"",null,0,null,"",null,0,null,"",0,0,0,0,1,0,3,0,0,0,0,0,0,0,0,0,0,0,0,1,0,0,0,0,0,0,0,0,0,0,0,0,0,0,0,0,0,0,0,0,0]
[16,"Vitor Gatti",127,null,"0*",null,"",null,"0*",null,null,null,0,null,"",null,0,null,"",null,0,null,"",null,0,null,"",null,0,null,"",14,17,null,"",9,26,null,"",8,28,null,"",9,26,null,"",7,30,null,"",0,0,0,0,0,0,1,1,2,0,0,0,0,1,0,0,0,0,0,0,0,0,0,0,0,0,0,0,0,0,0,0,0,0,0,0,0,0,0,0,0]
[17,"Renato Amaral",116,15,16,null,"",24,7,null,"",22,9,null,"SIM",19,12,null,"",17,14,null,"",null,"0*",null,"",null,"0*",null,-5,null,0,null,-5,5,34,null,"",10,24,null,"",21,10,null,"",null,0,null,"",0,0,0,0,1,0,0,0,0,1,0,0,0,0,1,0,1,0,1,0,1,1,0,1,0,0,0,0,0,0,0,0,0,0,0,0,0,0,0,0,0]
[18,"Jucimar Vieira",115,null,"0*",null,"",20,11,null,"",27,4,null,"",23,8,null,"",18,13,null,"",19,12,null,"",16,15,null,"",19,12,null,"",null,"0*",null,"",24,7,null,"SIM",16,15,null,"",13,18,null,"",0,0,0,0,0,0,0,0,0,0,0,0,1,0,0,2,0,1,2,1,0,0,1,1,0,0,1,0,0,0,0,0,0,0,0,0,0,0,0,0,0]
[19,"Hélio Chagas",112,22,9,null,"",23,8,null,"",23,8,null,"",null,"0*",null,-5,21,10,null,"",15,16,null,"",26,5,null,"SIM",17,14,null,"",null,"0*",null,"",13,18,null,"",19,12,null,"",14,17,null,"",0,0,0,0,0,0,0,0,0,0,0,0,1,1,1,0,1,0,1,0,1,1,2,0,0,1,0,0,0,0,0,0,0,0,0,0,0,0,0,0,0]
[20,"Cláudio Dumont",102,8,28,null,"",2,41,null,"",15,16,null,"",4,36,null,"",25,6,null,"",null,"0*",null,"",null,"0*",null,-5,null,0,null,-5,null,0,null,-5,null,0,null,-5,null,0,null,-5,null,0,null,"",0,1,0,1,0,0,0,1,0,0,0,0,0,0,1,0,0,0,0,0,0,0,0,0,1,0,0,0,0,0,0,0,0,0,0,0,0,0,0,0,0]
[21,"Raphael Reis",97,12,20,null,"",22,9,null,"",18,13,null,"",18,13,null,"",null,"0*",null,"",null,"0*",null,"",null,0,null,"",null,0,null,"",null,0,null,"",null,0,null,"",12,20,null,"",11,22,null,"",0,0,0,0,0,0,0,0,0,0,1,2,0,0,0,0,0,2,0,0,0,1,0,0,0,0,0,0,0,0,0,0,0,0,0,0,0,0,0,0,0]
[22,"Felipe Bouhid",96,null,"0*",null,"",null,"0*",null,"",null,0,null,"",null,0,null,"",null,0,null,"",null,0,null,"",null,0,null,"",18,13,null,"",12,20,null,"",12,20,null,"",14,17,null,"",9,26,null,"",0,0,0,0,0,0,0,0,1,0,0,2,0,1,0,1,0,1,1,0,0,0,0,0,0,0,0,0,1,0,0,0,0,0,0,0,0,0,0,0,0]
[23,"Cláudio Naves",95,24,7,null,"",27,4,null,"",24,7,null,"",33,1,null,"SIM",44,1,null,"SIM",14,17,null,"",14,17,null,"",null,"0*",null,"",null,"0*",null,"",null,0,null,"",18,13,null,"",8,28,null,"",0,0,0,0,0,0,0,1,0,0,0,0,0,2,0,0,0,1,0,0,0,0,0,2,0,0,1,0,0,0,0,0,1,0,0,0,0,0,0,0,0]
[24,"Tati Marcondes",90,23,8,null,"SIM",26,5,null,"",20,11,null,"",22,9,null,"",19,12,null,"",44,1,null,"SIM",null,"0*",null,"",21,10,null,"",13,18,null,"",null,"0*",null,"",17,14,null,"",29,2,null,"SIM",0,0,0,0,0,0,0,0,0,0,0,0,1,0,0,0,1,0,1,1,1,1,1,0,0,1,0,0,1,0,0,0,0,0,0,0,0,0,0,0,0]
[25,"Frederico Papatella",88,5,34,null,"",14,17,null,"",28,3,null,"SIM",null,"0*",null,"",null,"0*",null,"",null,0,null,"",null,0,null,-5,null,0,null,"",null,0,null,-5,9,26,null,"",13,18,null,"",null,0,null,"",0,0,0,0,1,0,0,0,1,0,0,0,1,1,0,0,0,0,0,0,0,0,0,0,0,0,0,1,0,0,0,0,0,0,0,0,0,0,0,0,0]
[26,"Reila Ricardo",71,20,11,null,"",18,13,null,"",29,2,null,"",24,7,null,"",null,"0*",null,"",11,22,null,"",null,"0*",null,"",16,15,null,"",15,16,null,"",null,0,null,-5,null,0,null,-5,null,0,null,-5,0,0,0,0,0,0,0,0,0,0,1,0,0,0,1,1,0,1,0,1,0,0,0,1,0,0,0,0,1,0,0,0,0,0,0,0,0,0,0,0,0]
[27,"Leandro Malias",70,16,15,null,"",25,6,null,"",null,"0*",null,"",null,"0*",null,-5,null,0,null,"",21,10,null,"",19,12,null,"",null,0,null,"",null,0,null,"",null,0,null,"",15,16,null,"",15,16,null,"",0,0,0,0,0,0,0,0,0,0,0,0,0,0,2,1,0,0,1,0,1,0,0,0,1,0,0,0,0,0,0,0,0,0,0,0,0,0,0,0,0]
[28,"Bernardo Freitas",66,26,5,null,"",null,"0*",null,"",6,32,null,"",17,14,null,"",15,16,null,"",27,4,null,"SIM",null,"0*",null,"",null,0,null,"",null,0,null,"",null,0,null,"",null,0,null,"",null,0,null,-5,0,0,0,0,0,1,0,0,0,0,0,0,0,0,1,0,1,0,0,0,0,0,0,0,0,1,1,0,0,0,0,0,0,0,0,0,0,0,0,0,0]
[29,"Marcelo Sant'anna",57,17,14,null,"",21,10,null,"SIM",47,1,null,"SIM",null,"0*",null,"",null,"0*",null,"",6,32,null,"",null,0,null,"",null,0,null,"",null,0,null,"",null,0,null,"",null,0,null,"",null,0,null,"",0,0,0,0,0,1,0,0,0,0,0,0,0,0,0,0,1,0,0,0,1,0,0,0,0,0,0,0,0,0,0,0,0,0,0,0,0,0,0,0,0]
[30,"Lucas Guimarães",54,null,"0*",null,"",32,1,null,"SIM",null,"0*",null,-5,33,1,null,"SIM",7,30,null,"",null,0,null,-5,10,24,null,"",8,28,null,"",null,0,null,-5,null,0,null,-5,null,0,null,-5,null,0,null,-5,0,0,0,0,0,0,1,1,0,1,0,0,0,0,0,0,0,0,0,0,0,0,0,0,0,0,0,0,0,0,0,1,1,0,0,0,0,0,0,0,0]
[31,"Luciano Robervine",38,4,36,null,"",33,1,null,"SIM",16,15,null,null,9,26,null,"",null,"0*",null,-5,null,"0*",null,-5,null,0,null,-5,null,0,null,-5,null,0,null,-5,null,0,null,-5,null,0,null,-5,null,0,null,-5,0,0,0,1,0,0,0,0,1,0,0,0,0,0,0,1,0,0,0,0,0,0,0,0,0,0,0,0,0,0,0,0,1,0,0,0,0,0,0,0,0]
[32,"Lucca Veloso",34,null,"0*",null,"",null,"0*",null,null,null,0,null,"",null,0,null,"",null,0,null,"",null,0,null,"",null,0,null,"",6,32,1,"",50,0,null,"SIM",null,0,null,"",null,0,null,"",31,1,null,"SIM",0,0,0,0,0,1,0,0,0,0,0,0,0,0,0,0,0,0,0,0,0,0,0,0,0,0,0,0,0,0,1,0,0,0,0,0,0,0,0,0,0]
[33,"Roberta Epifânio",34,null,"0*",null,"",28,3,null,"",30,1,null,"",30,1,null,"",null,"0*",null,"",33,1,null,"SIM",18,13,null,"",22,9,null,"",null,0,null,"",null,0,null,"",25,6,null,"",null,0,null,"",0,0,0,0,0,0,0,0,0,0,0,0,0,0,0,0,0,1,0,0,0,1,0,0,1,0,0,1,0,2,0,0,1,0,0,0,0,0,0,0,0]
[34,"Bernardo Gatti",27,null,"0*",null,null,null,"0*",null,"",null,0,null,"",null,0,null,"",null,0,null,"",null,0,null,null,null,0,null,"",null,0,null,"",6,32,null,"",null,0,null,"",null,0,null,"",null,0,null,-5,0,0,0,0,0,2,1,0,1,0,0,0,1,0,0,0,0,0,0,0,0,0,0,0,2,0,0,0,0,0,0,0,0,0,0,0,0,0,0,0,0]
[35,"Pedro Mello",15,null,"0*",null,"",29,2,null,"",null,"0*",null,"",null,0,null,"",null,0,null,"",18,13,null,"",null,0,null,"",null,0,null,"",null,0,null,"",null,0,null,"",null,0,null,"",null,0,null,"",0,0,0,0,0,0,0,0,0,0,0,0,0,0,0,0,0,1,0,0,0,0,0,0,0,0,0,0,1,0,0,0,0,0,0,0,0,0,0,0,0]
[36,"Izabella Rodrigues",5,null,"0*",null,"",null,"0*",null,null,25,6,null,"",14,17,null,"",null,0,null,-5,null,0,null,-5,15,16,null,-5,32,1,null,"SIM",null,0,null,-5,null,0,null,-5,null,0,null,-5,null,0,null,-5,0,0,0,0,0,0,0,0,0,0,0,0,0,1,1,0,0,0,0,0,0,0,0,0,1,0,0,0,0,0,0,1,0,0,0,0,0,0,0,0,0]
[37,"Andre Resende",0,null,"0*",null,"",null,"0*",null,null,null,0,null,"",null,0,null,"",null,0,null,"",null,0,null,"",null,0,null,"",20,11,null,"",null,0,null,-5,null,0,null,-5,null,0,null,-5,null,0,null,-5,0,0,0,0,0,0,0,0,0,0,0,1,0,0,0,0,0,0,0,1,0,1,0,0,0,2,0,0,0,0,0,0,0,0,0,0,0,0,0,0,0]
[38,"SSSSS",0,null,"0*",null,"",null,"0*",null,"",null,0,null,null,null,0,null,"",null,0,null,"",null,0,null,"",null,0,null,null,null,0,null,"",null,0,null,"",null,0,null,"",null,0,null,"",null,0,null,"",0,0,0,0,0,0,0,0,0,0,0,0,0,0,0,1,0,1,1,0,1,0,0,0,0,0,0,0,0,0,0,0,0,0,0,0,0,0,0,0,0]
[39,"Wesley Camargos",0,null,"0*",null,"",null,"0*",null,"",null,0,null,-5,25,6,null,"",null,0,null,-5,null,0,null,-5,17,14,null,"",null,0,null,-5,null,0,null,-5,null,0,null,-5,20,11,null,"",null,0,null,-5,0,0,0,0,0,0,0,0,0,0,0,0,0,0,0,0,1,0,0,1,0,0,0,0,1,0,0,0,0,0,0,0,0,0,0,0,0,0,0,0,0]
[40,"Hugo Denucci",0,null,"0*",null,-5,null,"0*",null,-5,null,0,null,"",null,0,null,-5,null,0,null,"",null,0,null,"",null,0,null,"",null,0,null,-5,null,0,null,-5,null,0,null,-5,null,0,null,-5,null,0,null,-5,0,0,0,0,0,0,0,0,0,0,0,0,0,0,0,0,0,0,0,0,0,0,0,0,0,0,0,0,0,0,0,0,0,0,0,0,0,0,0,0,0]
[41,"Gabriel Garabini",0,null,"0*",null,"",null,"0*",null,null,null,0,null,"",null,0,null,"",null,0,null,"",null,0,null,"",null,0,null,null,null,0,null,"",null,0,null,-5,null,0,null,-5,null,0,null,-5,null,0,null,-5,0,0,0,0,0,0,0,0,0,0,0,0,0,0,0,0,0,0,0,0,0,0,0,0,0,0,0,0,0,0,0,0,0,0,0,0,0,0,0,0,0]
[42,null,0,null,0,null,"",null,0,null,null,null,0,null,"",null,0,null,"",null,0,null,"",null,0,null,"",null,0,null,null,null,0,null,"",null,0,null,"",null,0,null,"",null,0,null,"",null,0,null,"",0,0,0,0,0,0,0,0,0,0,0,0,0,0,0,0,0,0,0,0,0,0,0,0,0,0,0,0,0,0,0,0,0,0,0,0,0,0,0,0,0]
[43,null,0,null,0,null,"",null,0,null,null,null,0,null,"",null,0,null,"",null,0,null,"",null,0,null,"",null,0,null,null,null,0,null,"",null,0,null,"",null,0,null,"",null,0,null,"",null,0,null,null,0,0,0,0,0,0,0,0,0,0,0,0,0,0,0,0,0,0,0,0,0,0,0,0,0,0,0,0,0,0,0,0,0,0,0,0,0,0,0,0,0]
[44,null,0,null,0,null,"",null,0,null,null,null,0,null,"",null,0,null,"",null,0,null,null,null,0,null,null,null,0,null,null,null,0,null,"",null,0,null,"",null,0,null,"",null,0,null,"",null,0,null,null,0,0,0,0,0,0,0,0,0,0,0,0,0,0,0,0,0,0,0,0,0,0,0,0,0,0,0,0,0,0,0,0,0,0,0,0,0,0,0,0,0]
[45,null,0,null,0,null,"",null,0,null,null,null,0,null,"",null,0,null,null,null,0,null,null,null,0,null,null,null,0,null,null,null,0,null,"",null,0,null,"",null,0,null,null,null,0,null,"",null,0,null,null,0,0,0,0,0,0,0,0,0,0,0,0,0,0,0,0,0,0,0,0,0,0,0,0,0,0,0,0,0,0,0,0,0,0,0,0,0,0,0,0,0]
[null,null,null,null,null,null,null,null,null,null,null,null,null,null,null,null,null,null,null,null,null,null,null,null,null,null,null,null,null,null,null,null,null,null,null,null,null,null,null,null,null,null,null,null,null,null,""]
[null,null,null,null,null,null,null,null,null,null,null,null,null,null,null,null,null,null,null,null,null,null,null,null,null,null,null,null,null,null,null,null,null,null,null,null,null,null,null,null,null,null,null,null,null,null,""]
[null,null,null,null,null,null,null,null,null,null,null,null,null,null,null,null,null,null,null,null,null,null,null,null,null,null,null,null,null,null,null,null,null,null,null,null,null,null,null,null,null,null,null,null,null,null,""]
[null,null,null,null,null,null,null,null,null,null,null,null,1,null,null,null,null,null,null,null,null,null,null,null,null,null,null,null,null,null,null,null,null,null,null,null,null,null,null,null,null,null,null,null,null,null,""]
[]
[null,null,null,null,null,null,null,null,null,null,null,29]

{"sheet":"Tabela Equipes","index":7,"n_rows":58,"n_cols":50,"rows_kept":58,"cut":false,"hidden":false,"merged":[[1,42,1,45],[1,46,1,49],[2,2,2,5],[2,6,2,9],[2,10,2,13],[2,14,2,17],[2,18,2,21],[2,22,2,25],[2,26,2,29],[2,30,2,33],[2,34,2,37],[2,38,2,41],[2,42,2,45],[2,46,2,49],[1,22,1,25],[1,26,1,29],[1,30,1,33],[1,34,1,37],[1,38,1,41],[1,2,1,5],[1,6,1,9],[1,10,1,13],[1,14,1,17],[1,18,1,21]]}
[2022,null,null,"OK",null,null,null,"OK",null,null,null,"OK",null,null,null,"OK",null,null,null,"OK",null,null,null,"OK",null,null,null,"OK",null,null,null,"OK",null,null,null,"OK",null,null,null,"OK",null,null,null,"OK",null,null,null,"OK"]
[null,null,"1ª etapa",null,null,null,"2ª etapa",null,null,null,"3ª etapa",null,null,null,"4ª etapa",null,null,null,"5ª etapa",null,null,null,"6ª etapa",null,null,null,"7ª etapa",null,null,null,"8ª etapa",null,null,null,"9ª etapa",null,null,null,"10ª etapa",null,null,null,"11ª etapa",null,null,null,"12ª etapa"]
[null,null,"00:00:00",null,null,null,"00:00:00",null,null,null,"13/03/2022 - 10:00 - Domingo",null,null,null,"00:00:00",null,null,null,"00:00:00",null,null,null,"00:00:00",null,null,null,"00:00:00",null,null,null,"00:00:00",null,null,null,"00:00:00",null,null,null,"00:00:00",null,null,null,"00:00:00",null,null,null,"00:00:00"]
["EQUIPES","Pontuação Geral","Posição","Pontos","Bônus","Penalidade","Posição","Pontos","Bônus","Penalidade","Posição","Pontos","Bônus","Penalidade","Posição","Pontos","Bônus","Penalidade","Posição","Pontos","Bônus","Penalidade","Posição","Pontos","Bônus","Penalidade","Posição","Pontos","Bônus","Penalidade","Posição","Pontos","Bônus","Penalidade","Posição","Pontos","Bônus","Penalidade","Posição","Pontos","Bônus","Penalidade","Posição","Pontos","Bônus","Penalidade","Posição","Pontos","Bônus","Penalidade"]
["Lider",693,null,79,1,null,null,66,0,null,null,77,1,null,null,69,0,null,null,52,0,null,null,11,1,null,null,62,1,null,null,60,0,null,null,83,0,null,null,37,0,null,null,63,1,null,null,29,0]
["Marcelo Campos",413,2,41,1,null,8,28,0,null,4,36,0,null,1,45,0,null,5,34,0,null,20,11,1,null,2,41,1,null,5,34,0,null,3,38,0,null,6,32,0,null,1,45,1,null,10,24,0]
["Marcelo Pereira",249,3,38,0,null,3,38,0,null,2,41,1,null,13,18,0,null,13,18,0,null,0,0,0,null,24,7,0,null,9,26,0,null,1,45,0,null,26,5,0,null,24,7,0,null,26,5,0]
["Wesley Camargos",31,0,0,0,null,0,0,0,null,0,0,0,null,25,6,0,null,0,0,0,null,0,0,0,null,17,14,0,null,0,0,0,null,0,0,0,null,0,0,0,null,20,11,0,null,0,0,0]
["Hugo Denucci",0,0,0,0,null,0,0,0,null,0,0,0,null,0,0,0,null,0,0,0,null,0,0,0,null,0,0,0,null,0,0,0,null,0,0,0,null,0,0,0,null,0,0,0,null,0,0,0]
["X"]
["Santiago",602,null,60,0,null,null,48,0,null,null,35,0,null,null,40,1,null,null,38,0,null,null,62,0,null,null,87,0,null,null,67,0,null,null,36,0,null,null,36,0,null,null,30,0,null,null,61,1]
["Daniel Nahum",394,1,45,0,null,4,36,0,null,5,34,0,null,3,38,1,null,23,8,0,null,3,38,0,null,3,38,0,null,7,30,0,null,4,36,0,null,4,36,0,null,23,8,0,null,1,45,1]
["Pedro Mello",15,0,0,0,null,29,2,0,null,0,0,0,null,0,0,0,null,0,0,0,null,18,13,0,null,0,0,0,null,0,0,0,null,0,0,0,null,0,0,0,null,0,0,0,null,0,0,0]
["Leandro Malias",75,16,15,0,null,25,6,0,null,0,0,0,null,0,0,0,null,0,0,0,null,21,10,0,null,19,12,0,null,0,0,0,null,0,0,0,null,0,0,0,null,15,16,0,null,15,16,0]
["Lucas Guimarães",84,0,0,0,null,32,1,0,null,0,0,0,null,33,1,0,null,7,30,0,null,0,0,0,null,10,24,0,null,8,28,0,null,0,0,0,null,0,0,0,null,0,0,0,null,0,0,0]
["Roberta Epifânio",34,0,0,0,null,28,3,0,null,30,1,0,null,30,1,0,null,0,0,0,null,33,1,0,null,18,13,0,null,22,9,0,null,0,0,0,null,0,0,0,null,25,6,0,null,0,0,0]
["Alpha",574,null,60,0,null,null,39,0,null,null,83,0,null,null,59,0,null,null,48,0,null,null,35,0,null,null,55,0,null,null,51,0,null,null,22,0,null,null,18,0,null,null,64,0,null,null,40,0]
["Guilherme Alves",249,9,26,0,null,11,22,0,null,10,24,0,null,16,15,0,null,11,22,0,null,16,15,0,null,5,34,0,null,4,36,0,null,11,22,0,null,0,0,0,null,6,32,0,null,37,1,0]
["Raphael Reis",97,12,20,0,null,22,9,0,null,18,13,0,null,18,13,0,null,0,0,0,null,0,0,0,null,0,0,0,null,0,0,0,null,0,0,0,null,0,0,0,null,12,20,0,null,11,22,0]
["Bernardo Freitas",71,26,5,0,null,0,0,0,null,6,32,0,null,17,14,0,null,15,16,0,null,27,4,0,null,0,0,0,null,0,0,0,null,0,0,0,null,0,0,0,null,0,0,0,null,0,0,0]
["Hélio Chagas",117,22,9,0,null,23,8,0,null,23,8,0,null,0,0,0,null,21,10,0,null,15,16,0,null,26,5,0,null,17,14,0,null,0,0,0,null,13,18,0,null,19,12,0,null,14,17,0]
["Izabella Rodrigues",40,0,0,0,null,0,0,0,null,25,6,0,null,14,17,0,null,0,0,0,null,0,0,0,null,15,16,0,null,32,1,0,null,0,0,0,null,0,0,0,null,0,0,0,null,0,0,0]
["Ventura",674,null,36,0,null,null,38,0,null,null,56,0,null,null,31,0,null,null,53,0,null,null,107,0,null,null,63,0,null,null,46,0,null,null,15,0,null,null,58,0,null,null,90,0,null,null,81,0]
["Marcelo Sant'anna",57,17,14,0,null,21,10,0,null,47,1,0,null,0,0,0,null,0,0,0,null,6,32,0,null,0,0,0,null,0,0,0,null,0,0,0,null,0,0,0,null,0,0,0,null,0,0,0]
["Wesley Canuto",331,28,3,0,null,10,24,0,null,12,20,0,null,7,30,0,null,10,24,0,null,5,34,0,null,8,28,0,null,3,38,0,null,16,15,0,null,2,41,0,null,4,36,0,null,3,38,0]
["Cláudio Naves",95,24,7,0,null,27,4,0,null,24,7,0,null,33,1,0,null,44,1,0,null,14,17,0,null,14,17,0,null,0,0,0,null,0,0,0,null,0,0,0,null,18,13,0,null,8,28,0]
["Marcelo Chagas",191,19,12,0,null,0,0,0,null,8,28,0,null,0,0,0,null,8,28,0,null,10,24,0,null,13,18,0,null,23,8,0,null,0,0,0,null,14,17,0,null,2,41,0,null,16,15,0]
["XXXX"]
["LQN",1004,null,69,0,null,null,107,0,null,null,97,0,null,null,113,0,null,null,95,0,null,null,100,0,null,null,56,0,null,null,119,1,null,null,43,0,null,null,79,1,null,null,57,0,null,null,67,0]
["Alexandre Melillo",300,11,22,0,null,12,20,0,null,17,14,0,null,2,41,0,null,6,32,0,null,2,41,0,null,4,36,0,null,11,22,0,null,17,14,0,null,5,34,0,null,10,24,0,null,0,0,0]
["Wesley Bambirra",367,10,24,0,null,1,45,0,null,3,38,0,null,5,34,0,null,2,41,0,null,1,45,0,null,12,20,0,null,2,41,0,null,14,17,0,null,0,0,0,null,8,28,0,null,5,34,0]
["SSSSS",50,18,13,0,null,19,12,0,null,0,0,0,null,21,10,0,null,16,15,0,null,0,0,0,null,0,0,0,null,0,0,0,null,0,0,0,null,0,0,0,null,0,0,0,null,0,0,0]
["Marcelo Marcondes",253,21,10,0,null,7,30,0,null,1,45,0,null,8,28,0,null,24,7,0,null,17,14,0,null,0,0,0,null,10,24,0,null,19,12,0,null,1,45,1,null,26,5,0,null,6,32,0]
["Lucca Veloso",34,0,0,0,null,0,0,0,null,0,0,0,null,0,0,0,null,0,0,0,null,0,0,0,null,0,0,0,null,6,32,1,null,50,0,0,null,0,0,0,null,0,0,0,null,31,1,0]
["Clemente Car",769,null,84,0,null,null,98,1,null,null,67,0,null,null,76,0,null,null,71,1,null,null,35,0,null,null,77,0,null,null,45,0,null,null,43,1,null,null,64,0,null,null,65,0,null,null,41,0]
["Marcelo Clemente",300,27,4,0,null,17,14,1,null,11,22,0,null,15,16,0,null,1,45,1,null,9,26,0,null,1,45,0,null,1,45,0,null,7,30,1,null,0,0,0,null,22,9,0,null,2,41,0]
["Cláudio Dumont",127,8,28,0,null,2,41,0,null,15,16,0,null,4,36,0,null,25,6,0,null,0,0,0,null,0,0,0,null,0,0,0,null,0,0,0,null,0,0,0,null,0,0,0,null,0,0,0]
["Frederico Papatella",98,5,34,0,null,14,17,0,null,28,3,0,null,0,0,0,null,0,0,0,null,0,0,0,null,0,0,0,null,0,0,0,null,0,0,0,null,9,26,0,null,13,18,0,null,0,0,0]
["Maurício Júnior",244,13,18,0,null,9,26,0,null,9,26,0,null,10,24,0,null,12,20,0,null,22,9,0,null,6,32,0,null,0,0,0,null,18,13,0,null,3,38,0,null,3,38,0,null,0,0,0]
["XXXXXX",0]
["Delcar",594,null,17,0,null,null,47,0,null,null,61,0,null,null,61,0,null,null,64,0,null,null,64,0,null,null,26,0,null,null,48,0,null,null,109,0,null,null,20,0,null,null,51,0,null,null,26,0]
["Bernardo Gatti",150,25,6,0,null,13,18,0,null,7,30,0,null,6,32,0,null,9,26,0,null,25,6,0,null,0,0,0,null,0,0,0,null,6,32,0,null,0,0,0,null,0,0,0,null,0,0,0]
["Eduardo Henrique",233,0,0,0,null,42,1,0,null,14,17,0,null,12,20,0,null,3,38,0,null,4,36,0,null,9,26,0,null,12,20,0,null,2,41,0,null,0,0,0,null,5,34,0,null,0,0,0]
["Felipe Bouhid",125,0,0,0,null,16,15,0,null,19,12,0,null,29,2,0,null,0,0,0,null,0,0,0,null,0,0,0,null,18,13,0,null,12,20,0,null,12,20,0,null,14,17,0,null,9,26,0]
["Reila Ricardo",86,20,11,0,null,18,13,0,null,29,2,0,null,24,7,0,null,0,0,0,null,11,22,0,null,0,0,0,null,16,15,0,null,15,16,0,null,0,0,0,null,0,0,0,null,0,0,0]
["XXXXXXX",0]
["Incosel",790,null,114,0,null,null,74,0,null,null,34,0,null,null,60,0,null,null,61,0,null,null,58,0,null,null,52,0,null,null,35,0,null,null,88,0,null,null,82,0,null,null,66,0,null,null,66,0]
["Rodrigo Mercadante",135,7,30,0,null,5,34,0,null,0,0,0,null,0,0,0,null,20,11,0,null,7,30,0,null,7,30,0,null,0,0,0,null,0,0,0,null,0,0,0,null,0,0,0,null,0,0,0]
["Jarbas Reis",324,6,32,0,null,6,32,0,null,21,10,0,null,11,22,0,null,4,36,0,null,8,28,0,null,11,22,0,null,13,18,0,null,8,28,0,null,7,30,0,null,7,30,0,null,4,36,0]
["Luciano Robervine",78,4,36,0,null,33,1,0,null,16,15,0,null,9,26,0,null,0,0,0,null,0,0,0,null,0,0,0,null,0,0,0,null,0,0,0,null,0,0,0,null,0,0,0,null,0,0,0]
["Renato Amaral",126,15,16,0,null,24,7,0,null,22,9,0,null,19,12,0,null,17,14,0,null,0,0,0,null,0,0,0,null,0,0,0,null,5,34,0,null,10,24,0,null,21,10,0,null,0,0,0]
["Vitor Gatti",127,0,0,0,null,0,0,0,null,0,0,0,null,0,0,0,null,0,0,0,null,0,0,0,null,0,0,0,null,14,17,0,null,9,26,0,null,8,28,0,null,9,26,0,null,7,30,0]
["Lokamig",456,null,25,0,null,null,32,0,null,null,38,0,null,null,33,0,null,null,51,0,null,null,51,0,null,null,15,0,null,null,49,0,null,null,42,0,null,null,29,0,null,null,51,0,null,null,40,0]
["Rodrigo Ricardo",201,14,17,0,null,15,16,0,null,13,18,0,null,20,11,0,null,14,17,0,null,13,18,0,null,0,0,0,null,15,16,0,null,10,24,0,null,11,22,0,null,11,22,0,null,12,20,0]
["Tati Marcondes",90,23,8,0,null,26,5,0,null,20,11,0,null,22,9,0,null,19,12,0,null,44,1,0,null,0,0,0,null,21,10,0,null,13,18,0,null,0,0,0,null,17,14,0,null,29,2,0]
["Jucimar Vieira",115,0,0,0,null,20,11,0,null,27,4,0,null,23,8,0,null,18,13,0,null,19,12,0,null,16,15,0,null,19,12,0,null,0,0,0,null,24,7,0,null,16,15,0,null,13,18,0]
["Andre Resende",50,0,0,0,null,0,0,0,null,26,5,0,null,26,5,0,null,22,9,0,null,12,20,0,null,0,0,0,null,20,11,0,null,0,0,0,null,0,0,0,null,0,0,0,null,0,0,0]
["Gabriel Garabini",0,0,0,0,null,0,0,0,null,0,0,0,null,0,0,0,null,0,0,0,null,0,0,0,null,0,0,0,null,0,0,0,null,0,0,0,null,0,0,0,null,0,0,0,null,0,0,0]

{"sheet":"Class Elimin 2 Piores Equip","index":8,"n_rows":58,"n_cols":50,"rows_kept":58,"cut":false,"hidden":false,"merged":[[1,42,1,45],[1,46,1,49],[2,2,2,5],[2,6,2,9],[2,10,2,13],[2,14,2,17],[2,18,2,21],[2,22,2,25],[2,26,2,29],[2,30,2,33],[2,34,2,37],[2,38,2,41],[2,42,2,45],[2,46,2,49],[1,22,1,25],[1,26,1,29],[1,30,1,33],[1,34,1,37],[1,38,1,41],[1,2,1,5],[1,6,1,9],[1,10,1,13],[1,14,1,17],[1,18,1,21]]}
[2022,null,null,"OK",null,null,null,"OK",null,null,null,"OK",null,null,null,"OK",null,null,null,"OK",null,null,null,"OK",null,null,null,"OK",null,null,null,"OK",null,null,null,"OK",null,null,null,"OK",null,null,null,"OK",null,null,null,"OK"]
[null,null,"1ª etapa",null,null,null,"2ª etapa",null,null,null,"3ª etapa",null,null,null,"4ª etapa",null,null,null,"5ª etapa",null,null,null,"6ª etapa",null,null,null,"7ª etapa",null,null,null,"8ª etapa",null,null,null,"9ª etapa",null,null,null,"10ª etapa",null,null,null,"11ª etapa",null,null,null,"12ª etapa"]
[null,null,"00:00:00",null,null,null,"00:00:00",null,null,null,"13/03/2022 - 10:00 - Domingo",null,null,null,"00:00:00",null,null,null,"00:00:00",null,null,null,"00:00:00",null,null,null,"00:00:00",null,null,null,"00:00:00",null,null,null,"00:00:00",null,null,null,"00:00:00",null,null,null,"00:00:00",null,null,null,"00:00:00"]
["EQUIPES","Pontuação Geral","Posição","Pontos","Bônus","Penalidade","Posição","Pontos","Bônus","Penalidade","Posição","Pontos","Bônus","Penalidade","Posição","Pontos","Bônus","Penalidade","Posição","Pontos","Bônus","Penalidade","Posição","Pontos","Bônus","Penalidade","Posição","Pontos","Bônus","Penalidade","Posição","Pontos","Bônus","Penalidade","Posição","Pontos","Bônus","Penalidade","Posição","Pontos","Bônus","Penalidade","Posição","Pontos","Bônus","Penalidade","Posição","Pontos","Bônus","Penalidade"]
["LQN",844,null,59,0,null,null,95,0,null,null,97,0,null,null,103,0,null,null,88,0,null,null,100,0,null,null,"56*",0,null,null,97,1,null,null,"43*",0,null,null,79,1,null,null,57,0,null,null,67,0]
["Alexandre Melillo",228,11,22,0,null,12,20,0,null,17,14,0,null,2,41,0,null,6,32,0,null,2,41,0,null,4,"36*",0,null,11,"22*",0,null,17,"14*",0,null,5,34,0,null,10,24,0,null,0,0,0]
["Wesley Bambirra",330,10,24,0,null,1,45,0,null,3,38,0,null,5,34,0,null,2,41,0,null,1,45,0,null,12,"20*",0,null,2,41,0,null,14,"17*",0,null,0,0,0,null,8,28,0,null,5,34,0]
["SSSSS",28,18,13,0,null,19,"12*",0,null,0,0,0,null,21,"10*",0,null,16,15,0,null,0,0,0,null,0,"0*",0,null,0,0,0,null,0,"0*",0,null,0,0,0,null,0,0,0,null,0,0,0]
["Marcelo Marcondes",224,21,"10*",0,null,7,30,0,null,1,45,0,null,8,28,0,null,24,"7*",0,null,17,14,0,null,0,"0*",0,null,10,24,0,null,19,"12*",0,null,1,45,1,null,26,5,0,null,6,32,0]
["Lucca Veloso",34,0,0,0,null,0,0,0,null,0,0,0,null,0,0,0,null,0,0,0,null,0,0,0,null,0,"0*",0,null,6,32,1,null,50,"0*",0,null,0,0,0,null,0,0,0,null,31,1,0]
["Incosel",704,null,98,0,null,null,73,0,null,null,"34*",0,null,null,60,0,null,null,61,0,null,null,58,0,null,null,52,0,null,null,"35*",0,null,null,88,0,null,null,82,0,null,null,66,0,null,null,66,0]
["Rodrigo Mercadante",135,7,30,0,null,5,34,0,null,0,"0*",0,null,0,0,0,null,20,11,0,null,7,30,0,null,7,30,0,null,0,"0*",0,null,0,0,0,null,0,0,0,null,0,0,0,null,0,0,0]
["Jarbas Reis",296,6,32,0,null,6,32,0,null,21,"10*",0,null,11,22,0,null,4,36,0,null,8,28,0,null,11,22,0,null,13,"18*",0,null,8,28,0,null,7,30,0,null,7,30,0,null,4,36,0]
["Luciano Robervine",62,4,36,0,null,33,"1*",0,null,16,"15*",0,null,9,26,0,null,0,0,0,null,0,0,0,null,0,0,0,null,0,"0*",0,null,0,0,0,null,0,0,0,null,0,0,0,null,0,0,0]
["Renato Amaral",101,15,"16*",0,null,24,7,0,null,22,"9*",0,null,19,12,0,null,17,14,0,null,0,0,0,null,0,0,0,null,0,"0*",0,null,5,34,0,null,10,24,0,null,21,10,0,null,0,0,0]
["Vitor Gatti",110,0,0,0,null,0,0,0,null,0,"0*",0,null,0,0,0,null,0,0,0,null,0,0,0,null,0,0,0,null,14,"17*",0,null,9,26,0,null,8,28,0,null,9,26,0,null,7,30,0]
["Clemente Car",672,null,80,0,null,null,84,1,null,null,64,0,null,null,76,0,null,null,71,1,null,null,"35*",0,null,null,77,0,null,null,45,0,null,null,43,1,null,null,64,0,null,null,65,0,null,null,"41*",0]
["Marcelo Clemente",215,27,"4*",0,null,17,"14*",1,null,11,22,0,null,15,16,0,null,1,45,1,null,9,"26*",0,null,1,45,0,null,1,45,0,null,7,30,1,null,0,0,0,null,22,9,0,null,2,"41*",0]
["Cláudio Dumont",127,8,28,0,null,2,41,0,null,15,16,0,null,4,36,0,null,25,6,0,null,0,"0*",0,null,0,0,0,null,0,0,0,null,0,0,0,null,0,0,0,null,0,0,0,null,0,"0*",0]
["Frederico Papatella",95,5,34,0,null,14,17,0,null,28,"3*",0,null,0,0,0,null,0,0,0,null,0,"0*",0,null,0,0,0,null,0,0,0,null,0,0,0,null,9,26,0,null,13,18,0,null,0,"0*",0]
["Maurício Júnior",235,13,18,0,null,9,26,0,null,9,26,0,null,10,24,0,null,12,20,0,null,22,"9*",0,null,6,32,0,null,0,0,0,null,18,13,0,null,3,38,0,null,3,38,0,null,0,"0*",0]
["XXXXXX",0,null,null,null,null,null,null,null,null,null,null,null,null,null,null,null,null,null,null,null,null,null,"*",null,null,null,null,null,null,null,null,null,null,null,null,null,null,null,null,null,null,null,null,null,null,null,"*"]
["Lider",653,null,79,1,null,null,66,0,null,null,77,1,null,null,69,0,null,null,52,0,null,null,"11*",1,null,null,62,1,null,null,60,0,null,null,83,0,null,null,37,0,null,null,63,1,null,null,"29*",0]
["Marcelo Campos",378,2,41,1,null,8,28,0,null,4,36,0,null,1,45,0,null,5,34,0,null,20,"11*",1,null,2,41,1,null,5,34,0,null,3,38,0,null,6,32,0,null,1,45,1,null,10,"24*",0]
["Marcelo Pereira",244,3,38,0,null,3,38,0,null,2,41,1,null,13,18,0,null,13,18,0,null,0,"0*",0,null,24,7,0,null,9,26,0,null,1,45,0,null,26,5,0,null,24,7,0,null,26,"5*",0]
["Wesley Camargos",31,0,0,0,null,0,0,0,null,0,0,0,null,25,6,0,null,0,0,0,null,0,"0*",0,null,17,14,0,null,0,0,0,null,0,0,0,null,0,0,0,null,20,11,0,null,0,"0*",0]
["Hugo Denucci",0,0,0,0,null,0,0,0,null,0,0,0,null,0,0,0,null,0,0,0,null,0,"0*",0,null,0,0,0,null,0,0,0,null,0,0,0,null,0,0,0,null,0,0,0,null,0,"0*",0]
["X",null,null,null,null,null,null,null,null,null,null,null,null,null,null,null,null,null,null,null,null,null,null,"*",null,null,null,null,null,null,null,null,null,null,null,null,null,null,null,null,null,null,null,null,null,null,null,"*"]
["Ventura",607,null,33,0,null,null,38,0,null,null,55,0,null,null,"31*",0,null,null,53,0,null,null,90,0,null,null,63,0,null,null,46,0,null,null,"15*",0,null,null,58,0,null,null,90,0,null,null,81,0]
["Marcelo Sant'anna",56,17,14,0,null,21,10,0,null,47,"1*",0,null,0,"0*",0,null,0,0,0,null,6,32,0,null,0,0,0,null,0,0,0,null,0,"0*",0,null,0,0,0,null,0,0,0,null,0,0,0]
["Wesley Canuto",283,28,"3*",0,null,10,24,0,null,12,20,0,null,7,"30*",0,null,10,24,0,null,5,34,0,null,8,28,0,null,3,38,0,null,16,"15*",0,null,2,41,0,null,4,36,0,null,3,38,0]
["Cláudio Naves",77,24,7,0,null,27,4,0,null,24,7,0,null,33,"1*",0,null,44,1,0,null,14,"17*",0,null,14,17,0,null,0,0,0,null,0,"0*",0,null,0,0,0,null,18,13,0,null,8,28,0]
["Marcelo Chagas",191,19,12,0,null,0,0,0,null,8,28,0,null,0,"0*",0,null,8,28,0,null,10,24,0,null,13,18,0,null,23,8,0,null,0,"0*",0,null,14,17,0,null,2,41,0,null,16,15,0]
["XXXX",null,null,null,null,null,null,null,null,null,null,null,null,null,null,"*",null,null,null,null,null,null,null,null,null,null,null,null,null,null,null,null,null,null,null,"*"]
["Delcar",536,null,"17*",0,null,null,46,0,null,null,59,0,null,null,59,0,null,null,64,0,null,null,64,0,null,null,26,0,null,null,48,0,null,null,93,0,null,null,"20*",0,null,null,51,0,null,null,26,0]
["Bernardo Gatti",144,25,"6*",0,null,13,18,0,null,7,30,0,null,6,32,0,null,9,26,0,null,25,6,0,null,0,0,0,null,0,0,0,null,6,32,0,null,0,"0*",0,null,0,0,0,null,0,0,0]
["Eduardo Henrique",232,0,"0*",0,null,42,"1*",0,null,14,17,0,null,12,20,0,null,3,38,0,null,4,36,0,null,9,26,0,null,12,20,0,null,2,41,0,null,0,"0*",0,null,5,34,0,null,0,0,0]
["Felipe Bouhid",103,0,"0*",0,null,16,15,0,null,19,12,0,null,29,"2*",0,null,0,0,0,null,0,0,0,null,0,0,0,null,18,13,0,null,12,20,0,null,12,"20*",0,null,14,17,0,null,9,26,0]
["Reila Ricardo",57,20,"11*",0,null,18,13,0,null,29,"2*",0,null,24,7,0,null,0,0,0,null,11,22,0,null,0,0,0,null,16,15,0,null,15,"16*",0,null,0,"0*",0,null,0,0,0,null,0,0,0]
["XXXXXXX",0,null,"*",null,null,null,null,null,null,null,null,null,null,null,null,null,null,null,null,null,null,null,null,null,null,null,null,null,null,null,null,null,null,null,null,null,null,null,"*"]
["Santiago",521,null,60,0,null,null,45,0,null,null,"35*",0,null,null,40,1,null,null,38,0,null,null,61,0,null,null,75,0,null,null,67,0,null,null,36,0,null,null,36,0,null,null,"30*",0,null,null,61,1]
["Daniel Nahum",352,1,45,0,null,4,36,0,null,5,"34*",0,null,3,38,1,null,23,8,0,null,3,38,0,null,3,38,0,null,7,30,0,null,4,36,0,null,4,36,0,null,23,"8*",0,null,1,45,1]
["Pedro Mello",13,0,0,0,null,29,"2*",0,null,0,"0*",0,null,0,0,0,null,0,0,0,null,18,13,0,null,0,0,0,null,0,0,0,null,0,0,0,null,0,0,0,null,0,"0*",0,null,0,0,0]
["Leandro Malias",47,16,15,0,null,25,6,0,null,0,"0*",0,null,0,0,0,null,0,0,0,null,21,10,0,null,19,"12*",0,null,0,0,0,null,0,0,0,null,0,0,0,null,15,"16*",0,null,15,16,0]
["Lucas Guimarães",83,0,0,0,null,32,"1*",0,null,0,"0*",0,null,33,1,0,null,7,30,0,null,0,0,0,null,10,24,0,null,8,28,0,null,0,0,0,null,0,0,0,null,0,"0*",0,null,0,0,0]
["Roberta Epifânio",26,0,0,0,null,28,3,0,null,30,"1*",0,null,30,1,0,null,0,0,0,null,33,"1*",0,null,18,13,0,null,22,9,0,null,0,0,0,null,0,0,0,null,25,"6*",0,null,0,0,0]
["Alpha",502,null,55,0,null,null,39,0,null,null,69,0,null,null,46,0,null,null,48,0,null,null,35,0,null,null,55,0,null,null,51,0,null,null,"22*",0,null,null,"18*",0,null,null,64,0,null,null,40,0]
["Guilherme Alves",227,9,26,0,null,11,22,0,null,10,24,0,null,16,15,0,null,11,22,0,null,16,15,0,null,5,34,0,null,4,36,0,null,11,"22*",0,null,0,"0*",0,null,6,32,0,null,37,1,0]
["Raphael Reis",84,12,20,0,null,22,9,0,null,18,13,0,null,18,"13*",0,null,0,0,0,null,0,0,0,null,0,0,0,null,0,0,0,null,0,"0*",0,null,0,"0*",0,null,12,20,0,null,11,22,0]
["Bernardo Freitas",66,26,"5*",0,null,0,0,0,null,6,32,0,null,17,14,0,null,15,16,0,null,27,4,0,null,0,0,0,null,0,0,0,null,0,"0*",0,null,0,"0*",0,null,0,0,0,null,0,0,0]
["Hélio Chagas",91,22,9,0,null,23,8,0,null,23,"8*",0,null,0,0,0,null,21,10,0,null,15,16,0,null,26,5,0,null,17,14,0,null,0,"0*",0,null,13,"18*",0,null,19,12,0,null,14,17,0]
["Izabella Rodrigues",34,0,0,0,null,0,0,0,null,25,"6*",0,null,14,17,0,null,0,0,0,null,0,0,0,null,15,16,0,null,32,1,0,null,0,"0*",0,null,0,"0*",0,null,0,0,0,null,0,0,0]
["Lokamig",387,null,"25*",0,null,null,32,0,null,null,34,0,null,null,28,0,null,null,42,0,null,null,50,0,null,null,"15*",0,null,null,39,0,null,null,42,0,null,null,29,0,null,null,51,0,null,null,40,0]
["Rodrigo Ricardo",184,14,"17*",0,null,15,16,0,null,13,18,0,null,20,11,0,null,14,17,0,null,13,18,0,null,0,"0*",0,null,15,16,0,null,10,24,0,null,11,22,0,null,11,22,0,null,12,20,0]
["Tati Marcondes",71,23,"8*",0,null,26,5,0,null,20,11,0,null,22,9,0,null,19,12,0,null,44,"1*",0,null,0,"0*",0,null,21,"10*",0,null,13,18,0,null,0,0,0,null,17,14,0,null,29,2,0]
["Jucimar Vieira",96,0,"0*",0,null,20,11,0,null,27,"4*",0,null,23,8,0,null,18,13,0,null,19,12,0,null,16,"15*",0,null,19,12,0,null,0,0,0,null,24,7,0,null,16,15,0,null,13,18,0]
["Andre Resende",36,0,"0*",0,null,0,0,0,null,26,5,0,null,26,"5*",0,null,22,"9*",0,null,12,20,0,null,0,"0*",0,null,20,11,0,null,0,0,0,null,0,0,0,null,0,0,0,null,0,0,0]
["Gabriel Garabini",0,0,"0*",0,null,0,0,0,null,0,0,0,null,0,0,0,null,0,0,0,null,0,0,0,null,0,"0*",0,null,0,0,0,null,0,0,0,null,0,0,0,null,0,0,0,null,0,0,0]

{"sheet":"Posição x Pontos","index":9,"n_rows":70,"n_cols":9,"rows_kept":70,"cut":false,"hidden":false,"merged":[]}
[null,null,null,null,null,null,null,"Posição","Pontos"]
[null,null,null,null,null,null,null,1,45]
[null,null,null,null,null,null,null,2,41]
[null,null,null,null,null,null,null,3,38]
[null,null,null,null,null,null,null,4,36]
[null,null,null,null,null,null,null,5,34]
[null,null,null,null,null,null,null,6,32]
[null,null,null,null,null,null,null,7,30]
[null,null,null,null,null,null,null,8,28]
[null,null,null,null,null,null,null,9,26]
[null,null,null,null,null,null,null,10,24]
[null,null,null,null,null,null,null,11,22]
[null,null,null,null,null,null,null,12,20]
[null,null,null,null,null,null,null,13,18]
[null,null,null,null,null,null,null,14,17]
[null,null,null,null,null,null,null,15,16]
[null,null,null,null,null,null,null,16,15]
[null,null,null,null,null,null,null,17,14]
[null,null,null,null,null,null,null,18,13]
[null,null,null,null,null,null,null,19,12]
[null,null,null,null,null,null,null,20,11]
[null,null,null,null,null,null,null,21,10]
[null,null,null,null,null,null,null,22,9]
[null,null,null,null,null,null,null,23,8]
[null,null,null,null,null,null,null,24,7]
[null,null,null,null,null,null,null,25,6]
[null,null,null,null,null,null,null,26,5]
[null,null,null,null,null,null,null,27,4]
[null,null,null,null,null,null,null,28,3]
[null,null,null,null,null,null,null,29,2]
[null,null,null,null,null,null,null,30,1]
[null,null,null,null,null,null,null,31,1]
[null,null,null,null,null,null,null,32,1]
[null,null,null,null,null,null,null,33,1]
[null,null,null,null,null,null,null,34,1]
[null,null,null,null,null,null,null,35,1]
[null,null,null,null,null,null,null,36,1]
[null,null,null,null,null,null,null,37,1]
[null,null,null,null,null,null,null,38,1]
[null,null,null,null,null,null,null,39,1]
[null,null,null,null,null,null,null,40,1]
[null,null,null,null,null,null,null,41,1]
[null,null,null,null,null,null,null,42,1]
[null,null,null,null,null,null,null,43,1]
[null,null,null,null,null,null,null,44,1]
[null,null,null,null,null,null,null,45,1]
[null,null,null,null,null,null,null,46,1]
[null,null,null,null,null,null,null,47,1]
[null,null,null,null,null,null,null,48,1]
[null,null,null,null,null,null,null,49,1]
[null,null,null,null,null,null,null,50,1]
[null,null,null,null,null,null,null,51,1]
[null,null,null,null,null,null,null,52,1]
[null,null,null,null,null,null,null,53,1]
[null,null,null,null,null,null,null,54,1]
[null,null,null,null,null,null,null,55,1]
[null,null,null,null,null,null,null,56,1]
[null,null,null,null,null,null,null,57,1]
[null,null,null,null,null,null,null,58,1]
[null,null,null,null,null,null,null,59,1]
[null,null,null,null,null,null,null,60,1]
[null,null,null,null,null,null,null,61,1]
[null,null,null,null,null,null,null,62,1]
[null,null,null,null,null,null,null,63,1]
[null,null,null,null,null,null,null,64,1]
[null,null,null,null,null,null,null,65,1]
[null,null,null,null,null,null,null,66,1]
[null,null,null,null,null,null,null,67,1]
[null,null,null,null,null,null,null,68,1]
[null,null,null,null,null,null,null,69,1]