{"text_format":"1","workbook":"xlsx","n_sheets":11,"sheets":["ETAPA 12","ETAPA 11","ETAPA 10","ETAPA 9","ETAPA 8","ETAPA 7","ETAPA 6","ETAPA 5","ETAPA 3","ETAPA 2","ETAPA 1"],"not_rendered":{"charts":11,"images":0,"macros":1,"external_links":0,"defined_names":11,"comments":11,"pivot_tables":0},"unopened":[],"bounds":{"document_bytes":16777216,"sheet_cells":100000,"rows_first":2000,"rows_last":500,"rows_between":2000,"halvings":0,"cell_chars":16384,"cell_head_chars":4096},"cells_cut":0,"cells_raw":0,"read":"whole","date_system":"1900"}

{"sheet":"ETAPA 12","index":0,"n_rows":787,"n_cols":12,"rows_kept":787,"cut":false,"hidden":false,"merged":[[0,0,0,6]]}
["Obs.: Selecione até 3 pilotos colocando na frente do seu nome os números 1, 2 e 3.",null,null,null,null,null,null,"PILOTO",{"$f":"J52","v":"Maurício Júnior"},{"$f":"K52","v":"Daniel Nahum"},{"$f":"L52","v":"Marcelo Clemente"}]
[1,"Maurício Júnior",null,null,null,null,null,"MÉDIA",{"$f":"AVERAGE(J53:J97)","v":"00:00:49.912"},{"$f":"AVERAGE(K53:K97)","v":"00:00:49.891"},{"$f":"AVERAGE(L53:L97)","v":"00:00:49.932"}]
[2,"Daniel Nahum",null,null,null,null,null,"MAXIMA",{"$f":"LARGE(J53:J97,1)","v":"00:00:55.464"},{"$f":"LARGE(K53:K97,1)","v":"00:00:56.163"},{"$f":"LARGE(L53:L97,1)","v":"00:00:56.323"}]
[3,"Marcelo Clemente",null,null,null,null,null,"MÍNIMA",{"$f":"SMALL(J53:J97,1)","v":"00:00:49.252"},{"$f":"SMALL(K53:K97,1)","v":"00:00:49.179"},{"$f":"SMALL(L53:L97,1)","v":"00:00:49.286"}]
[null,"Wesley Canuto",null,null,null,null,null,"Desvio Padrão",{"$f":"_xlfn.STDEV.S(J53:J97)","v":"00:00:00.989"},{"$f":"_xlfn.STDEV.S(K53:K97)","v":"00:00:01.094"},{"$f":"_xlfn.STDEV.S(L53:L97)","v":"00:00:01.121"}]
[null,"Jarbas Reis",null,null,null,null,null,"TEMPO TOTAL",{"$f":"SUM(J53:J97,1)","v":1.0219520949074075},{"$f":"SUM(K53:K97,1)","v":1.0219429513888889},{"$f":"SUM(L53:L97,1)","v":1.0219610416666667}]
[null,"Wesley Bambirra"]
[null,"Marcelo Pereira"]
[null,"Marcelo Marcondes"]
[null,"Vitor Gatti"]
[null,"Tati Marcondes"]
[null,"Cláudio Naves"]
[null,"Lucca Veloso",null,null,null,null,null,null,null,null,{"$f":"SMALL(I4:K4,1)-L13","v":"00:00:49.179"}]
[null,"Felipe Bouhid",null,null,null,null,null,null,null,null,{"$f":"LARGE(I3:K3,1)+L13","v":"00:00:56.323"}]
[null,"Marcelo Campos"]
[null,"Raphael Reis"]
[null,"Rodrigo Ricardo"]
[null,"Jucimar Vieira"]
[null,"Guilherme Alves"]
[null,"Hélio Chagas"]
[null,"Leandro Malias"]
[null,"Marcelo Chagas"]
[]
[]
[]
[]
[]
[]
[]
[]
[]
[1]
[]
[]
[]
[]
[]
[]
[]
[]
[]
[]
[]
[]
[]
[]
[]
[]
[]
["ETAPA","PILOTO","NÚMERO VOLTAS","KART","Volta Tm","velocidade Media",null,null,null,{"$f":"MATCH(J52,$B$51:$B$1500,0)","v":1},{"$f":"MATCH(K52,$B$51:$B$1500,0)","v":39},77]
[12,"Maurício Júnior",38,127,"00:00:55.464",51.21,null,null,null,{"$f":"VLOOKUP(J$52,$B$50:$F$1500,2,FALSE)","v":38},{"$f":"VLOOKUP(K$52,$B$50:$F$1500,2,FALSE)","v":38},{"$f":"VLOOKUP(L$52,$B$50:$F$1500,2,FALSE)","v":38}]
[12,"Maurício Júnior",38,127,"00:00:50.327",56.44,null,null,"VOLTA",{"$f":"VLOOKUP(1,$A$2:$B$36,2,FALSE)","v":"Maurício Júnior"},{"$f":"VLOOKUP(2,$A$2:$B$36,2,FALSE)","v":"Daniel Nahum"},{"$f":"VLOOKUP(3,$A$2:$B$36,2,FALSE)","v":"Marcelo Clemente"}]
[12,"Maurício Júnior",38,127,"00:00:50.186",56.6,null,null,1,{"$f":"OFFSET($E$51:$E$1500,J50-1,,J51)","v":"00:00:55.464"},{"$f":"OFFSET($E$51:$E$1500,K50-1,,K51)","v":"00:00:56.163"},{"$f":"OFFSET($E$51:$E$1500,L50-1,,L51)","v":"00:00:56.323"}]
[12,"Maurício Júnior",38,127,"00:00:50.130",56.66,null,null,2,"00:00:50.327","00:00:49.915","00:00:49.889"]
[12,"Maurício Júnior",38,127,"00:00:49.981",56.83,null,null,3,"00:00:50.186","00:00:49.653","00:00:49.920"]
[12,"Maurício Júnior",38,127,"00:00:50.054",56.75,null,null,4,"00:00:50.130","00:00:50.224","00:00:50.057"]
[12,"Maurício Júnior",38,127,"00:00:49.912",56.91,null,null,5,"00:00:49.981","00:00:49.865","00:00:49.941"]
[12,"Maurício Júnior",38,127,"00:00:50.113",56.68,null,null,6,"00:00:50.054","00:00:49.797","00:00:49.947"]
[12,"Maurício Júnior",38,127,"00:00:49.944",56.87,null,null,7,"00:00:49.912","00:00:50.126","00:00:49.901"]
[12,"Maurício Júnior",38,127,"00:00:49.857",56.97,null,null,8,"00:00:50.113","00:00:49.773","00:00:50.111"]
[12,"Maurício Júnior",38,127,"00:00:49.775",57.06,null,null,9,"00:00:49.944","00:00:50.177","00:00:49.958"]
[12,"Maurício Júnior",38,127,"00:00:49.803",57.03,null,null,10,"00:00:49.857","00:00:49.687","00:00:49.939"]
[12,"Maurício Júnior",38,127,"00:00:49.813",57.02,null,null,11,"00:00:49.775","00:00:49.949","00:00:49.701"]
[12,"Maurício Júnior",38,127,"00:00:49.897",56.93,null,null,12,"00:00:49.803","00:00:50.803","00:00:50.111"]
[12,"Maurício Júnior",38,127,"00:00:50.176",56.61,null,null,13,"00:00:49.813","00:00:49.610","00:00:49.727"]
[12,"Maurício Júnior",38,127,"00:00:50.364",56.4,null,null,14,"00:00:49.897","00:00:49.624","00:00:49.696"]
[12,"Maurício Júnior",38,127,"00:00:50.703",56.02,null,null,15,"00:00:50.176","00:00:49.699","00:00:49.926"]
[12,"Maurício Júnior",38,127,"00:00:49.252",57.67,null,null,16,"00:00:50.364","00:00:49.874","00:00:49.787"]
[12,"Maurício Júnior",38,127,"00:00:49.351",57.56,null,null,17,"00:00:50.703","00:00:50.020","00:00:49.673"]
[12,"Maurício Júnior",38,127,"00:00:49.586",57.28,null,null,18,"00:00:49.252","00:00:49.179","00:00:49.553"]
[12,"Maurício Júnior",38,127,"00:00:49.486",57.4,null,null,19,"00:00:49.351","00:00:49.467","00:00:49.987"]
[12,"Maurício Júnior",38,127,"00:00:49.662",57.19,null,null,20,"00:00:49.586","00:00:49.482","00:00:49.565"]
[12,"Maurício Júnior",38,127,"00:00:49.913",56.91,null,null,21,"00:00:49.486","00:00:49.500","00:00:49.462"]
[12,"Maurício Júnior",38,127,"00:00:49.410",57.49,null,null,22,"00:00:49.662","00:00:49.329","00:00:49.694"]
[12,"Maurício Júnior",38,127,"00:00:49.508",57.37,null,null,23,"00:00:49.913","00:00:49.762","00:00:49.890"]
[12,"Maurício Júnior",38,127,"00:00:50.275",56.5,null,null,24,"00:00:49.410","00:00:49.307","00:00:49.308"]
[12,"Maurício Júnior",38,127,"00:00:49.562",57.31,null,null,25,"00:00:49.508","00:00:50.143","00:00:49.696"]
[12,"Maurício Júnior",38,127,"00:00:49.647",57.21,null,null,26,"00:00:50.275","00:00:50.150","00:00:51.387"]
[12,"Maurício Júnior",38,127,"00:00:49.307",57.61,null,null,27,"00:00:49.562","00:00:49.700","00:00:49.432"]
[12,"Maurício Júnior",38,127,"00:00:49.412",57.48,null,null,28,"00:00:49.647","00:00:49.427","00:00:49.461"]
[12,"Maurício Júnior",38,127,"00:00:49.372",57.53,null,null,29,"00:00:49.307","00:00:49.434","00:00:49.286"]
[12,"Maurício Júnior",38,127,"00:00:49.427",57.47,null,null,30,"00:00:49.412","00:00:49.588","00:00:49.497"]
[12,"Maurício Júnior",38,127,"00:00:49.651",57.21,null,null,31,"00:00:49.372","00:00:49.405","00:00:49.641"]
[12,"Maurício Júnior",38,127,"00:00:49.584",57.28,null,null,32,"00:00:49.427","00:00:49.638","00:00:49.573"]
[12,"Maurício Júnior",38,127,"00:00:49.446",57.44,null,null,33,"00:00:49.651","00:00:49.981","00:00:49.459"]
[12,"Maurício Júnior",38,127,"00:00:49.552",57.32,null,null,34,"00:00:49.584","00:00:49.505","00:00:49.503"]
[12,"Maurício Júnior",38,127,"00:00:49.366",57.54,null,null,35,"00:00:49.446","00:00:49.658","00:00:49.625"]
[12,"Maurício Júnior",38,127,"00:00:49.393",57.51,null,null,36,"00:00:49.552","00:00:49.363","00:00:49.392"]
[12,"Daniel Nahum",38,148,"00:00:56.163",50.57,null,null,37,"00:00:49.366","00:00:49.473","00:00:49.541"]
[12,"Daniel Nahum",38,148,"00:00:49.915",56.9,null,null,38,"00:00:49.393","00:00:49.421","00:00:49.875"]
[12,"Daniel Nahum",38,148,"00:00:49.653",57.21,null,null,39]
[12,"Daniel Nahum",38,148,"00:00:50.224",56.55,null,null,40]
[12,"Daniel Nahum",38,148,"00:00:49.865",56.96,null,null,41]
[12,"Daniel Nahum",38,148,"00:00:49.797",57.04,null,null,42]
[12,"Daniel Nahum",38,148,"00:00:50.126",56.67,null,null,43]
[12,"Daniel Nahum",38,148,"00:00:49.773",57.07,null,null,44]
[12,"Daniel Nahum",38,148,"00:00:50.177",56.61,null,null,45]
[12,"Daniel Nahum",38,148,"00:00:49.687",57.17]
[12,"Daniel Nahum",38,148,"00:00:49.949",56.87]
[12,"Daniel Nahum",38,148,"00:00:50.803",55.91]
[12,"Daniel Nahum",38,148,"00:00:49.610",57.25]
[12,"Daniel Nahum",38,148,"00:00:49.624",57.24]
[12,"Daniel Nahum",38,148,"00:00:49.699",57.15]
[12,"Daniel Nahum",38,148,"00:00:49.874",56.95]
[12,"Daniel Nahum",38,148,"00:00:50.020",56.79]
[12,"Daniel Nahum",38,148,"00:00:49.179",57.76]
[12,"Daniel Nahum",38,148,"00:00:49.467",57.42]
[12,"Daniel Nahum",38,148,"00:00:49.482",57.4]
[12,"Daniel Nahum",38,148,"00:00:49.500",57.38]
[12,"Daniel Nahum",38,148,"00:00:49.329",57.58]
[12,"Daniel Nahum",38,148,"00:00:49.762",57.08]
[12,"Daniel Nahum",38,148,"00:00:49.307",57.61]
[12,"Daniel Nahum",38,148,"00:00:50.143",56.65]
[12,"Daniel Nahum",38,148,"00:00:50.150",56.64]
[12,"Daniel Nahum",38,148,"00:00:49.700",57.15]
[12,"Daniel Nahum",38,148,"00:00:49.427",57.47]
[12,"Daniel Nahum",38,148,"00:00:49.434",57.46]
[12,"Daniel Nahum",38,148,"00:00:49.588",57.28]
[12,"Daniel Nahum",38,148,"00:00:49.405",57.49]
[12,"Daniel Nahum",38,148,"00:00:49.638",57.22]
[12,"Daniel Nahum",38,148,"00:00:49.981",56.83]
[12,"Daniel Nahum",38,148,"00:00:49.505",57.38]
[12,"Daniel Nahum",38,148,"00:00:49.658",57.2]
[12,"Daniel Nahum",38,148,"00:00:49.363",57.54]
[12,"Daniel Nahum",38,148,"00:00:49.473",57.41]
[12,"Daniel Nahum",38,148,"00:00:49.421",57.47]
[12,"Marcelo Clemente",38,129,"00:00:56.323",50.43]
[12,"Marcelo Clemente",38,129,"00:00:49.889",56.93]
[12,"Marcelo Clemente",38,129,"00:00:49.920",56.9]
[12,"Marcelo Clemente",38,129,"00:00:50.057",56.74]
[12,"Marcelo Clemente",38,129,"00:00:49.941",56.88]
[12,"Marcelo Clemente",38,129,"00:00:49.947",56.87]
[12,"Marcelo Clemente",38,129,"00:00:49.901",56.92]
[12,"Marcelo Clemente",38,129,"00:00:50.111",56.68]
[12,"Marcelo Clemente",38,129,"00:00:49.958",56.86]
[12,"Marcelo Clemente",38,129,"00:00:49.939",56.88]
[12,"Marcelo Clemente",38,129,"00:00:49.701",57.15]
[12,"Marcelo Clemente",38,129,"00:00:50.111",56.68]
[12,"Marcelo Clemente",38,129,"00:00:49.727",57.12]
[12,"Marcelo Clemente",38,129,"00:00:49.696",57.16]
[12,"Marcelo Clemente",38,129,"00:00:49.926",56.89]
[12,"Marcelo Clemente",38,129,"00:00:49.787",57.05]
[12,"Marcelo Clemente",38,129,"00:00:49.673",57.18]
[12,"Marcelo Clemente",38,129,"00:00:49.553",57.32]
[12,"Marcelo Clemente",38,129,"00:00:49.987",56.82]
[12,"Marcelo Clemente",38,129,"00:00:49.565",57.31]
[12,"Marcelo Clemente",38,129,"00:00:49.462",57.43]
[12,"Marcelo Clemente",38,129,"00:00:49.694",57.16]
[12,"Marcelo Clemente",38,129,"00:00:49.890",56.93]
[12,"Marcelo Clemente",38,129,"00:00:49.308",57.61]
[12,"Marcelo Clemente",38,129,"00:00:49.696",57.16]
[12,"Marcelo Clemente",38,129,"00:00:51.387",55.27]
[12,"Marcelo Clemente",38,129,"00:00:49.432",57.46]
[12,"Marcelo Clemente",38,129,"00:00:49.461",57.43]
[12,"Marcelo Clemente",38,129,"00:00:49.286",57.63]
[12,"Marcelo Clemente",38,129,"00:00:49.497",57.39]
[12,"Marcelo Clemente",38,129,"00:00:49.641",57.22]
[12,"Marcelo Clemente",38,129,"00:00:49.573",57.3]
[12,"Marcelo Clemente",38,129,"00:00:49.459",57.43]
[12,"Marcelo Clemente",38,129,"00:00:49.503",57.38]
[12,"Marcelo Clemente",38,129,"00:00:49.625",57.24]
[12,"Marcelo Clemente",38,129,"00:00:49.392",57.51]
[12,"Marcelo Clemente",38,129,"00:00:49.541",57.33]
[12,"Marcelo Clemente",38,129,"00:00:49.875",56.95]
[12,"Wesley Canuto",38,121,"00:00:56.765",50.04]
[12,"Wesley Canuto",38,121,"00:00:49.803",57.03]
[12,"Wesley Canuto",38,121,"00:00:49.864",56.96]
[12,"Wesley Canuto",38,121,"00:00:49.779",57.06]
[12,"Wesley Canuto",38,121,"00:00:49.760",57.08]
[12,"Wesley Canuto",38,121,"00:00:49.883",56.94]
[12,"Wesley Canuto",38,121,"00:00:50.849",55.86]
[12,"Wesley Canuto",38,121,"00:00:49.738",57.11]
[12,"Wesley Canuto",38,121,"00:00:49.899",56.92]
[12,"Wesley Canuto",38,121,"00:00:49.802",57.03]
[12,"Wesley Canuto",38,121,"00:00:49.768",57.07]
[12,"Wesley Canuto",38,121,"00:00:50.509",56.24]
[12,"Wesley Canuto",38,121,"00:00:49.440",57.45]
[12,"Wesley Canuto",38,121,"00:00:49.733",57.11]
[12,"Wesley Canuto",38,121,"00:00:49.599",57.27]
[12,"Wesley Canuto",38,121,"00:00:49.951",56.86]
[12,"Wesley Canuto",38,121,"00:00:49.537",57.34]
[12,"Wesley Canuto",38,121,"00:00:49.573",57.3]
[12,"Wesley Canuto",38,121,"00:00:49.873",56.95]
[12,"Wesley Canuto",38,121,"00:00:49.603",57.26]
[12,"Wesley Canuto",38,121,"00:00:49.518",57.36]
[12,"Wesley Canuto",38,121,"00:00:49.534",57.34]
[12,"Wesley Canuto",38,121,"00:00:49.944",56.87]
[12,"Wesley Canuto",38,121,"00:00:49.440",57.45]
[12,"Wesley Canuto",38,121,"00:00:49.611",57.25]
[12,"Wesley Canuto",38,121,"00:00:50.190",56.59]
[12,"Wesley Canuto",38,121,"00:00:49.605",57.26]
[12,"Wesley Canuto",38,121,"00:00:49.517",57.36]
[12,"Wesley Canuto",38,121,"00:00:49.444",57.45]
[12,"Wesley Canuto",38,121,"00:00:49.452",57.44]
[12,"Wesley Canuto",38,121,"00:00:49.876",56.95]
[12,"Wesley Canuto",38,121,"00:00:50.062",56.74]
[12,"Wesley Canuto",38,121,"00:00:49.462",57.43]
[12,"Wesley Canuto",38,121,"00:00:49.474",57.41]
[12,"Wesley Canuto",38,121,"00:00:49.678",57.18]
[12,"Wesley Canuto",38,121,"00:00:49.580",57.29]
[12,"Wesley Canuto",38,121,"00:00:49.659",57.2]
[12,"Wesley Canuto",38,121,"00:00:49.879",56.95]
[12,"Jarbas Reis",38,155,"00:00:57.158",49.69]
[12,"Jarbas Reis",38,155,"00:00:50.168",56.62]
[12,"Jarbas Reis",38,155,"00:00:49.958",56.86]
[12,"Jarbas Reis",38,155,"00:00:49.958",56.86]
[12,"Jarbas Reis",38,155,"00:00:49.835",57]
[12,"Jarbas Reis",38,155,"00:00:50.206",56.57]
[12,"Jarbas Reis",38,155,"00:00:50.022",56.78]
[12,"Jarbas Reis",38,155,"00:00:49.673",57.18]
[12,"Jarbas Reis",38,155,"00:00:49.582",57.29]
[12,"Jarbas Reis",38,155,"00:00:49.750",57.09]
[12,"Jarbas Reis",38,155,"00:00:49.669",57.19]
[12,"Jarbas Reis",38,155,"00:00:50.830",55.88]
[12,"Jarbas Reis",38,155,"00:00:49.714",57.13]
[12,"Jarbas Reis",38,155,"00:00:49.760",57.08]
[12,"Jarbas Reis",38,155,"00:00:49.667",57.19]
[12,"Jarbas Reis",38,155,"00:00:49.615",57.25]
[12,"Jarbas Reis",38,155,"00:00:50.382",56.38]
[12,"Jarbas Reis",38,155,"00:00:49.527",57.35]
[12,"Jarbas Reis",38,155,"00:00:49.597",57.27]
[12,"Jarbas Reis",38,155,"00:00:49.501",57.38]
[12,"Jarbas Reis",38,155,"00:00:49.256",57.67]
[12,"Jarbas Reis",38,155,"00:00:49.438",57.45]
[12,"Jarbas Reis",38,155,"00:00:49.879",56.95]
[12,"Jarbas Reis",38,155,"00:00:49.662",57.19]
[12,"Jarbas Reis",38,155,"00:00:49.670",57.19]
[12,"Jarbas Reis",38,155,"00:00:50.449",56.3]
[12,"Jarbas Reis",38,155,"00:00:49.878",56.95]
[12,"Jarbas Reis",38,155,"00:00:49.672",57.18]
[12,"Jarbas Reis",38,155,"00:00:49.648",57.21]
[12,"Jarbas Reis",38,155,"00:00:49.613",57.25]
[12,"Jarbas Reis",38,155,"00:00:49.725",57.12]
[12,"Jarbas Reis",38,155,"00:00:49.730",57.12]
[12,"Jarbas Reis",38,155,"00:00:49.829",57]
[12,"Jarbas Reis",38,155,"00:00:50.398",56.36]
[12,"Jarbas Reis",38,155,"00:00:50.255",56.52]
[12,"Jarbas Reis",38,155,"00:00:49.926",56.89]
[12,"Jarbas Reis",38,155,"00:00:50.092",56.7]
[12,"Jarbas Reis",38,155,"00:00:49.885",56.94]
[12,"Wesley Bambirra",38,144,"00:00:57.023",49.81]
[12,"Wesley Bambirra",38,144,"00:00:50.372",56.39]
[12,"Wesley Bambirra",38,144,"00:00:50.233",56.54]
[12,"Wesley Bambirra",38,144,"00:00:50.124",56.67]
[12,"Wesley Bambirra",38,144,"00:00:50.139",56.65]
[12,"Wesley Bambirra",38,144,"00:00:49.973",56.84]
[12,"Wesley Bambirra",38,144,"00:00:50.276",56.5]
[12,"Wesley Bambirra",38,144,"00:00:50.044",56.76]
[12,"Wesley Bambirra",38,144,"00:00:50.001",56.81]
[12,"Wesley Bambirra",38,144,"00:00:49.792",57.05]
[12,"Wesley Bambirra",38,144,"00:00:49.574",57.3]
[12,"Wesley Bambirra",38,144,"00:00:49.928",56.89]
[12,"Wesley Bambirra",38,144,"00:00:49.842",56.99]
[12,"Wesley Bambirra",38,144,"00:00:50.114",56.68]
[12,"Wesley Bambirra",38,144,"00:00:50.059",56.74]
[12,"Wesley Bambirra",38,144,"00:00:49.841",56.99]
[12,"Wesley Bambirra",38,144,"00:00:49.990",56.82]
[12,"Wesley Bambirra",38,144,"00:00:49.730",57.12]
[12,"Wesley Bambirra",38,144,"00:00:50.178",56.61]
[12,"Wesley Bambirra",38,144,"00:00:49.542",57.33]
[12,"Wesley Bambirra",38,144,"00:00:49.494",57.39]
[12,"Wesley Bambirra",38,144,"00:00:49.574",57.3]
[12,"Wesley Bambirra",38,144,"00:00:49.661",57.2]
[12,"Wesley Bambirra",38,144,"00:00:49.609",57.26]
[12,"Wesley Bambirra",38,144,"00:00:49.508",57.37]
[12,"Wesley Bambirra",38,144,"00:00:49.948",56.87]
[12,"Wesley Bambirra",38,144,"00:00:49.490",57.39]
[12,"Wesley Bambirra",38,144,"00:00:49.628",57.23]
[12,"Wesley Bambirra",38,144,"00:00:49.589",57.28]
[12,"Wesley Bambirra",38,144,"00:00:49.647",57.21]
[12,"Wesley Bambirra",38,144,"00:00:49.704",57.15]
[12,"Wesley Bambirra",38,144,"00:00:49.881",56.94]
[12,"Wesley Bambirra",38,144,"00:00:49.645",57.21]
[12,"Wesley Bambirra",38,144,"00:00:49.896",56.93]
[12,"Wesley Bambirra",38,144,"00:00:50.173",56.61]
[12,"Wesley Bambirra",38,144,"00:00:49.928",56.89]
[12,"Wesley Bambirra",38,144,"00:00:49.832",57]
[12,"Wesley Bambirra",38,144,"00:00:49.688",57.16]
[12,"Marcelo Pereira",38,107,"00:00:56.370",50.39]
[12,"Marcelo Pereira",38,107,"00:00:51.635",55.01]
[12,"Marcelo Pereira",38,107,"00:00:50.154",56.63]
[12,"Marcelo Pereira",38,107,"00:00:50.063",56.74]
[12,"Marcelo Pereira",38,107,"00:00:49.717",57.13]
[12,"Marcelo Pereira",38,107,"00:00:49.822",57.01]
[12,"Marcelo Pereira",38,107,"00:00:49.778",57.06]
[12,"Marcelo Pereira",38,107,"00:00:49.869",56.96]
[12,"Marcelo Pereira",38,107,"00:00:49.706",57.14]
[12,"Marcelo Pereira",38,107,"00:00:49.962",56.85]
[12,"Marcelo Pereira",38,107,"00:00:49.562",57.31]
[12,"Marcelo Pereira",38,107,"00:00:49.874",56.95]
[12,"Marcelo Pereira",38,107,"00:00:49.916",56.9]
[12,"Marcelo Pereira",38,107,"00:00:49.835",57]
[12,"Marcelo Pereira",38,107,"00:00:49.692",57.16]
[12,"Marcelo Pereira",38,107,"00:00:49.675",57.18]
[12,"Marcelo Pereira",38,107,"00:00:49.543",57.33]
[12,"Marcelo Pereira",38,107,"00:00:49.576",57.29]
[12,"Marcelo Pereira",38,107,"00:00:49.661",57.2]
[12,"Marcelo Pereira",38,107,"00:00:49.492",57.39]
[12,"Marcelo Pereira",38,107,"00:00:49.598",57.27]
[12,"Marcelo Pereira",38,107,"00:00:49.594",57.27]
[12,"Marcelo Pereira",38,107,"00:00:49.690",57.16]
[12,"Marcelo Pereira",38,107,"00:00:49.642",57.22]
[12,"Marcelo Pereira",38,107,"00:00:49.480",57.41]
[12,"Marcelo Pereira",38,107,"00:00:49.643",57.22]
[12,"Marcelo Pereira",38,107,"00:00:49.804",57.03]
[12,"Marcelo Pereira",38,107,"00:00:49.573",57.3]
[12,"Marcelo Pereira",38,107,"00:00:49.609",57.26]
[12,"Marcelo Pereira",38,107,"00:00:49.645",57.21]
[12,"Marcelo Pereira",38,107,"00:00:49.641",57.22]
[12,"Marcelo Pereira",38,107,"00:00:49.872",56.95]
[12,"Marcelo Pereira",38,107,"00:00:49.595",57.27]
[12,"Marcelo Pereira",38,107,"00:00:50.681",56.04]
[12,"Marcelo Pereira",38,107,"00:00:50.088",56.71]
[12,"Marcelo Pereira",38,107,"00:00:49.715",57.13]
[12,"Marcelo Pereira",38,107,"00:00:49.902",56.92]
[12,"Marcelo Pereira",38,107,"00:00:50.030",56.77]
[12,"Marcelo Marcondes",38,128,"00:00:56.093",50.64]
[12,"Marcelo Marcondes",38,128,"00:00:52.997",53.6]
[12,"Marcelo Marcondes",38,128,"00:00:51.695",54.95]
[12,"Marcelo Marcondes",38,128,"00:00:50.074",56.72]
[12,"Marcelo Marcondes",38,128,"00:00:50.271",56.5]
[12,"Marcelo Marcondes",38,128,"00:00:49.859",56.97]
[12,"Marcelo Marcondes",38,128,"00:00:50.012",56.79]
[12,"Marcelo Marcondes",38,128,"00:00:49.701",57.15]
[12,"Marcelo Marcondes",38,128,"00:00:49.946",56.87]
[12,"Marcelo Marcondes",38,128,"00:00:49.609",57.26]
[12,"Marcelo Marcondes",38,128,"00:00:49.661",57.2]
[12,"Marcelo Marcondes",38,128,"00:00:49.558",57.31]
[12,"Marcelo Marcondes",38,128,"00:00:49.858",56.97]
[12,"Marcelo Marcondes",38,128,"00:00:50.508",56.24]
[12,"Marcelo Marcondes",38,128,"00:00:49.960",56.85]
[12,"Marcelo Marcondes",38,128,"00:00:49.642",57.22]
[12,"Marcelo Marcondes",38,128,"00:00:49.831",57]
[12,"Marcelo Marcondes",38,128,"00:00:49.851",56.98]
[12,"Marcelo Marcondes",38,128,"00:00:49.581",57.29]
[12,"Marcelo Marcondes",38,128,"00:00:49.649",57.21]
[12,"Marcelo Marcondes",38,128,"00:00:49.573",57.3]
[12,"Marcelo Marcondes",38,128,"00:00:49.490",57.39]
[12,"Marcelo Marcondes",38,128,"00:00:49.637",57.22]
[12,"Marcelo Marcondes",38,128,"00:00:49.797",57.04]
[12,"Marcelo Marcondes",38,128,"00:00:50.062",56.74]
[12,"Marcelo Marcondes",38,128,"00:00:49.728",57.12]
[12,"Marcelo Marcondes",38,128,"00:00:49.773",57.07]
[12,"Marcelo Marcondes",38,128,"00:00:49.699",57.15]
[12,"Marcelo Marcondes",38,128,"00:00:49.685",57.17]
[12,"Marcelo Marcondes",38,128,"00:00:49.719",57.13]
[12,"Marcelo Marcondes",38,128,"00:00:49.916",56.9]
[12,"Marcelo Marcondes",38,128,"00:00:49.901",56.92]
[12,"Marcelo Marcondes",38,128,"00:00:49.904",56.92]
[12,"Marcelo Marcondes",38,128,"00:00:50.253",56.52]
[12,"Marcelo Marcondes",38,128,"00:00:50.249",56.53]
[12,"Marcelo Marcondes",38,128,"00:00:50.192",56.59]
[12,"Marcelo Marcondes",38,128,"00:00:50.259",56.52]
[12,"Marcelo Marcondes",38,128,"00:00:50.001",56.81]
[12,"Vitor Gatti",38,118,"00:00:56.998",49.83]
[12,"Vitor Gatti",38,118,"00:00:50.631",56.1]
[12,"Vitor Gatti",38,118,"00:00:50.136",56.65]
[12,"Vitor Gatti",38,118,"00:00:50.746",55.97]
[12,"Vitor Gatti",38,118,"00:00:50.403",56.35]
[12,"Vitor Gatti",38,118,"00:00:50.150",56.64]
[12,"Vitor Gatti",38,118,"00:00:50.128",56.66]
[12,"Vitor Gatti",38,118,"00:00:50.479",56.27]
[12,"Vitor Gatti",38,118,"00:00:49.805",57.03]
[12,"Vitor Gatti",38,118,"00:00:50.002",56.81]
[12,"Vitor Gatti",38,118,"00:00:49.741",57.1]
[12,"Vitor Gatti",38,118,"00:00:49.804",57.03]
[12,"Vitor Gatti",38,118,"00:00:50.210",56.57]
[12,"Vitor Gatti",38,118,"00:00:50.227",56.55]
[12,"Vitor Gatti",38,118,"00:00:50.003",56.8]
[12,"Vitor Gatti",38,118,"00:00:49.738",57.11]
[12,"Vitor Gatti",38,118,"00:00:49.692",57.16]
[12,"Vitor Gatti",38,118,"00:00:49.694",57.16]
[12,"Vitor Gatti",38,118,"00:00:50.017",56.79]
[12,"Vitor Gatti",38,118,"00:00:50.238",56.54]
[12,"Vitor Gatti",38,118,"00:00:50.110",56.68]
[12,"Vitor Gatti",38,118,"00:00:50.111",56.68]
[12,"Vitor Gatti",38,118,"00:00:50.053",56.75]
[12,"Vitor Gatti",38,118,"00:00:49.982",56.83]
[12,"Vitor Gatti",38,118,"00:00:50.466",56.28]
[12,"Vitor Gatti",38,118,"00:00:49.998",56.81]
[12,"Vitor Gatti",38,118,"00:00:49.966",56.85]
[12,"Vitor Gatti",38,118,"00:00:49.959",56.85]
[12,"Vitor Gatti",38,118,"00:00:50.114",56.68]
[12,"Vitor Gatti",38,118,"00:00:49.992",56.82]
[12,"Vitor Gatti",38,118,"00:00:50.107",56.69]
[12,"Vitor Gatti",38,118,"00:00:50.178",56.61]
[12,"Vitor Gatti",38,118,"00:00:49.987",56.82]
[12,"Vitor Gatti",38,118,"00:00:50.280",56.49]
[12,"Vitor Gatti",38,118,"00:00:50.745",55.97]
[12,"Vitor Gatti",38,118,"00:00:50.124",56.67]
[12,"Vitor Gatti",38,118,"00:00:50.119",56.67]
[12,"Vitor Gatti",38,118,"00:00:50.144",56.64]
[12,"Tati Marcondes",38,124,"00:00:55.716",50.98]
[12,"Tati Marcondes",38,124,"00:00:52.368",54.24]
[12,"Tati Marcondes",38,124,"00:00:50.382",56.38]
[12,"Tati Marcondes",38,124,"00:00:50.165",56.62]
[12,"Tati Marcondes",38,124,"00:00:49.923",56.9]
[12,"Tati Marcondes",38,124,"00:00:49.939",56.88]
[12,"Tati Marcondes",38,124,"00:00:49.965",56.85]
[12,"Tati Marcondes",38,124,"00:00:49.893",56.93]
[12,"Tati Marcondes",38,124,"00:00:49.666",57.19]
[12,"Tati Marcondes",38,124,"00:00:49.689",57.16]
[12,"Tati Marcondes",38,124,"00:00:49.607",57.26]
[12,"Tati Marcondes",38,124,"00:00:49.766",57.08]
[12,"Tati Marcondes",38,124,"00:00:49.628",57.23]
[12,"Tati Marcondes",38,124,"00:00:49.659",57.2]
[12,"Tati Marcondes",38,124,"00:00:50.117",56.68]
[12,"Tati Marcondes",38,124,"00:00:49.674",57.18]
[12,"Tati Marcondes",38,124,"00:00:49.956",56.86]
[12,"Tati Marcondes",38,124,"00:00:49.528",57.35]
[12,"Tati Marcondes",38,124,"00:00:49.559",57.31]
[12,"Tati Marcondes",38,124,"00:00:49.654",57.2]
[12,"Tati Marcondes",38,124,"00:00:49.470",57.42]
[12,"Tati Marcondes",38,124,"00:00:49.688",57.16]
[12,"Tati Marcondes",38,124,"00:00:49.550",57.32]
[12,"Tati Marcondes",38,124,"00:00:49.673",57.18]
[12,"Tati Marcondes",38,124,"00:00:49.587",57.28]
[12,"Tati Marcondes",38,124,"00:00:49.712",57.14]
[12,"Tati Marcondes",38,124,"00:00:50.035",56.77]
[12,"Tati Marcondes",38,124,"00:00:49.710",57.14]
[12,"Tati Marcondes",38,124,"00:00:49.652",57.21]
[12,"Tati Marcondes",38,124,"00:00:49.655",57.2]
[12,"Tati Marcondes",38,124,"00:00:49.793",57.04]
[12,"Tati Marcondes",38,124,"00:00:50.022",56.78]
[12,"Tati Marcondes",38,124,"00:00:49.898",56.92]
[12,"Tati Marcondes",38,124,"00:00:50.135",56.66]
[12,"Tati Marcondes",38,124,"00:01:01.942",45.86]
[12,"Tati Marcondes",38,124,"00:00:50.276",56.5]
[12,"Tati Marcondes",38,124,"00:00:50.068",56.73]
[12,"Tati Marcondes",38,124,"00:00:50.110",56.68]
[12,"Cláudio Naves",38,106,"00:00:55.683",51.01]
[12,"Cláudio Naves",38,106,"00:00:53.096",53.5]
[12,"Cláudio Naves",38,106,"00:00:50.301",56.47]
[12,"Cláudio Naves",38,106,"00:00:50.301",56.47]
[12,"Cláudio Naves",38,106,"00:00:50.060",56.74]
[12,"Cláudio Naves",38,106,"00:00:50.204",56.58]
[12,"Cláudio Naves",38,106,"00:00:49.888",56.94]
[12,"Cláudio Naves",38,106,"00:00:49.916",56.9]
[12,"Cláudio Naves",38,106,"00:00:49.682",57.17]
[12,"Cláudio Naves",38,106,"00:00:49.787",57.05]
[12,"Cláudio Naves",38,106,"00:00:49.725",57.12]
[12,"Cláudio Naves",38,106,"00:00:49.806",57.03]
[12,"Cláudio Naves",38,106,"00:00:50.263",56.51]
[12,"Cláudio Naves",38,106,"00:00:51.471",55.18]
[12,"Cláudio Naves",38,106,"00:00:50.231",56.55]
[12,"Cláudio Naves",38,106,"00:00:50.065",56.73]
[12,"Cláudio Naves",38,106,"00:00:50.099",56.7]
[12,"Cláudio Naves",38,106,"00:00:50.633",56.1]
[12,"Cláudio Naves",38,106,"00:00:50.045",56.76]
[12,"Cláudio Naves",38,106,"00:00:50.219",56.56]
[12,"Cláudio Naves",38,106,"00:00:50.137",56.65]
[12,"Cláudio Naves",38,106,"00:00:50.172",56.61]
[12,"Cláudio Naves",38,106,"00:00:49.929",56.89]
[12,"Cláudio Naves",38,106,"00:00:51.066",55.62]
[12,"Cláudio Naves",38,106,"00:00:50.561",56.18]
[12,"Cláudio Naves",38,106,"00:00:50.226",56.55]
[12,"Cláudio Naves",38,106,"00:00:50.117",56.68]
[12,"Cláudio Naves",38,106,"00:00:50.119",56.67]
[12,"Cláudio Naves",38,106,"00:00:50.197",56.59]
[12,"Cláudio Naves",38,106,"00:00:50.132",56.66]
[12,"Cláudio Naves",38,106,"00:00:50.499",56.25]
[12,"Cláudio Naves",38,106,"00:00:50.411",56.34]
[12,"Cláudio Naves",38,106,"00:00:50.146",56.64]
[12,"Cláudio Naves",38,106,"00:00:50.220",56.56]
[12,"Cláudio Naves",38,106,"00:00:50.071",56.73]
[12,"Cláudio Naves",38,106,"00:00:49.894",56.93]
[12,"Cláudio Naves",38,106,"00:00:50.246",56.53]
[12,"Cláudio Naves",38,106,"00:00:49.979",56.83]
[12,"Lucca Veloso",38,149,"00:00:56.028",50.7]
[12,"Lucca Veloso",38,149,"00:00:52.815",53.78]
[12,"Lucca Veloso",38,149,"00:00:50.528",56.21]
[12,"Lucca Veloso",38,149,"00:00:50.330",56.44]
[12,"Lucca Veloso",38,149,"00:00:50.131",56.66]
[12,"Lucca Veloso",38,149,"00:00:50.400",56.36]
[12,"Lucca Veloso",38,149,"00:00:50.539",56.2]
[12,"Lucca Veloso",38,149,"00:00:50.180",56.6]
[12,"Lucca Veloso",38,149,"00:00:50.562",56.18]
[12,"Lucca Veloso",38,149,"00:00:49.883",56.94]
[12,"Lucca Veloso",38,149,"00:00:49.809",57.03]
[12,"Lucca Veloso",38,149,"00:00:49.895",56.93]
[12,"Lucca Veloso",38,149,"00:00:50.208",56.57]
[12,"Lucca Veloso",38,149,"00:00:50.104",56.69]
[12,"Lucca Veloso",38,149,"00:00:50.625",56.11]
[12,"Lucca Veloso",38,149,"00:00:50.237",56.54]
[12,"Lucca Veloso",38,149,"00:00:50.182",56.6]
[12,"Lucca Veloso",38,149,"00:00:49.992",56.82]
[12,"Lucca Veloso",38,149,"00:00:50.055",56.75]
[12,"Lucca Veloso",38,149,"00:00:50.279",56.49]
[12,"Lucca Veloso",38,149,"00:00:50.290",56.48]
[12,"Lucca Veloso",38,149,"00:00:50.026",56.78]
[12,"Lucca Veloso",38,149,"00:00:49.834",57]
[12,"Lucca Veloso",38,149,"00:00:50.518",56.23]
[12,"Lucca Veloso",38,149,"00:00:50.851",55.86]
[12,"Lucca Veloso",38,149,"00:00:50.300",56.47]
[12,"Lucca Veloso",38,149,"00:00:50.257",56.52]
[12,"Lucca Veloso",38,149,"00:00:50.244",56.53]
[12,"Lucca Veloso",38,149,"00:00:50.189",56.59]
[12,"Lucca Veloso",38,149,"00:00:50.188",56.6]
[12,"Lucca Veloso",38,149,"00:00:50.213",56.57]
[12,"Lucca Veloso",38,149,"00:00:50.588",56.15]
[12,"Lucca Veloso",38,149,"00:00:49.933",56.88]
[12,"Lucca Veloso",38,149,"00:00:50.306",56.46]
[12,"Lucca Veloso",38,149,"00:00:50.072",56.73]
[12,"Lucca Veloso",38,149,"00:00:49.966",56.85]
[12,"Lucca Veloso",38,149,"00:00:50.059",56.74]
[12,"Lucca Veloso",38,149,"00:00:50.034",56.77]
[12,"Felipe Bouhid",38,104,"00:00:56.031",50.69]
[12,"Felipe Bouhid",38,104,"00:00:50.985",55.71]
[12,"Felipe Bouhid",38,104,"00:00:50.352",56.41]
[12,"Felipe Bouhid",38,104,"00:00:50.832",55.88]
[12,"Felipe Bouhid",38,104,"00:00:50.186",56.6]
[12,"Felipe Bouhid",38,104,"00:00:50.639",56.09]
[12,"Felipe Bouhid",38,104,"00:00:50.379",56.38]
[12,"Felipe Bouhid",38,104,"00:00:50.393",56.36]
[12,"Felipe Bouhid",38,104,"00:00:50.102",56.69]
[12,"Felipe Bouhid",38,104,"00:00:50.119",56.67]
[12,"Felipe Bouhid",38,104,"00:00:50.265",56.51]
[12,"Felipe Bouhid",38,104,"00:00:49.828",57]
[12,"Felipe Bouhid",38,104,"00:00:50.265",56.51]
[12,"Felipe Bouhid",38,104,"00:00:51.151",55.53]
[12,"Felipe Bouhid",38,104,"00:00:50.893",55.81]
[12,"Felipe Bouhid",38,104,"00:00:50.272",56.5]
[12,"Felipe Bouhid",38,104,"00:00:50.049",56.75]
[12,"Felipe Bouhid",38,104,"00:00:50.161",56.63]
[12,"Felipe Bouhid",38,104,"00:00:49.930",56.89]
[12,"Felipe Bouhid",38,104,"00:00:50.225",56.55]
[12,"Felipe Bouhid",38,104,"00:00:50.243",56.53]
[12,"Felipe Bouhid",38,104,"00:00:50.058",56.74]
[12,"Felipe Bouhid",38,104,"00:00:49.936",56.88]
[12,"Felipe Bouhid",38,104,"00:00:50.576",56.16]
[12,"Felipe Bouhid",38,104,"00:00:51.259",55.41]
[12,"Felipe Bouhid",38,104,"00:00:50.313",56.45]
[12,"Felipe Bouhid",38,104,"00:00:50.209",56.57]
[12,"Felipe Bouhid",38,104,"00:00:50.486",56.26]
[12,"Felipe Bouhid",38,104,"00:00:50.163",56.62]
[12,"Felipe Bouhid",38,104,"00:00:50.025",56.78]
[12,"Felipe Bouhid",38,104,"00:00:50.281",56.49]
[12,"Felipe Bouhid",38,104,"00:00:50.096",56.7]
[12,"Felipe Bouhid",38,104,"00:00:50.718",56]
[12,"Felipe Bouhid",38,104,"00:00:50.095",56.7]
[12,"Felipe Bouhid",38,104,"00:00:49.983",56.83]
[12,"Felipe Bouhid",38,104,"00:00:50.067",56.73]
[12,"Felipe Bouhid",38,104,"00:00:50.078",56.72]
[12,"Felipe Bouhid",38,104,"00:00:50.172",56.61]
[12,"Marcelo Campos",38,142,"00:00:57.127",49.72]
[12,"Marcelo Campos",38,142,"00:01:02.488",45.46]
[12,"Marcelo Campos",38,142,"00:00:50.469",56.28]
[12,"Marcelo Campos",38,142,"00:00:50.490",56.26]
[12,"Marcelo Campos",38,142,"00:00:50.446",56.31]
[12,"Marcelo Campos",38,142,"00:00:50.494",56.25]
[12,"Marcelo Campos",38,142,"00:00:50.496",56.25]
[12,"Marcelo Campos",38,142,"00:00:50.475",56.27]
[12,"Marcelo Campos",38,142,"00:00:50.731",55.99]
[12,"Marcelo Campos",38,142,"00:00:50.329",56.44]
[12,"Marcelo Campos",38,142,"00:00:50.160",56.63]
[12,"Marcelo Campos",38,142,"00:00:50.335",56.43]
[12,"Marcelo Campos",38,142,"00:00:50.344",56.42]
[12,"Marcelo Campos",38,142,"00:00:50.657",56.07]
[12,"Marcelo Campos",38,142,"00:00:50.411",56.34]
[12,"Marcelo Campos",38,142,"00:00:50.271",56.5]
[12,"Marcelo Campos",38,142,"00:00:50.370",56.39]
[12,"Marcelo Campos",38,142,"00:00:49.987",56.82]
[12,"Marcelo Campos",38,142,"00:00:50.100",56.69]
[12,"Marcelo Campos",38,142,"00:00:50.003",56.8]
[12,"Marcelo Campos",38,142,"00:00:50.225",56.55]
[12,"Marcelo Campos",38,142,"00:00:50.065",56.73]
[12,"Marcelo Campos",38,142,"00:00:50.452",56.3]
[12,"Marcelo Campos",38,142,"00:00:50.176",56.61]
[12,"Marcelo Campos",38,142,"00:00:50.639",56.09]
[12,"Marcelo Campos",38,142,"00:00:51.334",55.33]
[12,"Marcelo Campos",38,142,"00:00:50.465",56.28]
[12,"Marcelo Campos",38,142,"00:00:50.603",56.13]
[12,"Marcelo Campos",38,142,"00:00:50.548",56.19]
[12,"Marcelo Campos",38,142,"00:00:50.475",56.27]
[12,"Marcelo Campos",38,142,"00:00:50.386",56.37]
[12,"Marcelo Campos",38,142,"00:00:50.585",56.15]
[12,"Marcelo Campos",38,142,"00:00:50.116",56.68]
[12,"Marcelo Campos",38,142,"00:00:50.727",55.99]
[12,"Marcelo Campos",38,142,"00:00:50.766",55.95]
[12,"Marcelo Campos",38,142,"00:00:50.525",56.22]
[12,"Marcelo Campos",38,142,"00:00:50.767",55.95]
[12,"Marcelo Campos",38,142,"00:00:51.664",54.98]
[12,"Raphael Reis",38,110,"00:00:56.373",50.39]
[12,"Raphael Reis",38,110,"00:00:52.988",53.6]
[12,"Raphael Reis",38,110,"00:00:51.355",55.31]
[12,"Raphael Reis",38,110,"00:00:50.767",55.95]
[12,"Raphael Reis",38,110,"00:00:51.631",55.01]
[12,"Raphael Reis",38,110,"00:00:50.670",56.06]
[12,"Raphael Reis",38,110,"00:00:50.726",55.99]
[12,"Raphael Reis",38,110,"00:00:50.477",56.27]
[12,"Raphael Reis",38,110,"00:00:50.853",55.86]
[12,"Raphael Reis",38,110,"00:00:50.689",56.04]
[12,"Raphael Reis",38,110,"00:00:51.028",55.66]
[12,"Raphael Reis",38,110,"00:00:50.577",56.16]
[12,"Raphael Reis",38,110,"00:00:50.853",55.86]
[12,"Raphael Reis",38,110,"00:00:51.207",55.47]
[12,"Raphael Reis",38,110,"00:00:50.731",55.99]
[12,"Raphael Reis",38,110,"00:00:50.649",56.08]
[12,"Raphael Reis",38,110,"00:00:50.562",56.18]
[12,"Raphael Reis",38,110,"00:00:50.889",55.82]
[12,"Raphael Reis",38,110,"00:00:50.307",56.46]
[12,"Raphael Reis",38,110,"00:00:50.246",56.53]
[12,"Raphael Reis",38,110,"00:00:50.969",55.73]
[12,"Raphael Reis",38,110,"00:00:49.984",56.83]
[12,"Raphael Reis",38,110,"00:00:50.477",56.27]
[12,"Raphael Reis",38,110,"00:00:50.554",56.19]
[12,"Raphael Reis",38,110,"00:00:50.791",55.92]
[12,"Raphael Reis",38,110,"00:00:51.880",54.75]
[12,"Raphael Reis",38,110,"00:00:51.164",55.52]
[12,"Raphael Reis",38,110,"00:00:51.306",55.36]
[12,"Raphael Reis",38,110,"00:00:51.525",55.13]
[12,"Raphael Reis",38,110,"00:00:50.885",55.82]
[12,"Raphael Reis",38,110,"00:00:50.788",55.93]
[12,"Raphael Reis",38,110,"00:00:50.944",55.76]
[12,"Raphael Reis",38,110,"00:00:50.695",56.03]
[12,"Raphael Reis",38,110,"00:00:50.830",55.88]
[12,"Raphael Reis",38,110,"00:00:51.047",55.64]
[12,"Raphael Reis",38,110,"00:00:50.740",55.98]
[12,"Raphael Reis",38,110,"00:00:51.795",54.84]
[12,"Raphael Reis",38,110,"00:00:51.565",55.08]
[12,"Rodrigo Ricardo",38,140,"00:00:56.100",50.63]
[12,"Rodrigo Ricardo",38,140,"00:00:53.225",53.37]
[12,"Rodrigo Ricardo",38,140,"00:00:52.149",54.47]
[12,"Rodrigo Ricardo",38,140,"00:00:50.487",56.26]
[12,"Rodrigo Ricardo",38,140,"00:00:50.771",55.95]
[12,"Rodrigo Ricardo",38,140,"00:00:50.201",56.58]
[12,"Rodrigo Ricardo",38,140,"00:00:50.427",56.33]
[12,"Rodrigo Ricardo",38,140,"00:00:50.357",56.41]
[12,"Rodrigo Ricardo",38,140,"00:00:50.681",56.04]
[12,"Rodrigo Ricardo",38,140,"00:00:50.717",56]
[12,"Rodrigo Ricardo",38,140,"00:00:50.852",55.86]
[12,"Rodrigo Ricardo",38,140,"00:00:50.618",56.11]
[12,"Rodrigo Ricardo",38,140,"00:00:50.573",56.16]
[12,"Rodrigo Ricardo",38,140,"00:00:51.237",55.44]
[12,"Rodrigo Ricardo",38,140,"00:00:50.703",56.02]
[12,"Rodrigo Ricardo",38,140,"00:00:50.741",55.98]
[12,"Rodrigo Ricardo",38,140,"00:00:50.493",56.25]
[12,"Rodrigo Ricardo",38,140,"00:00:50.322",56.44]
[12,"Rodrigo Ricardo",38,140,"00:00:50.278",56.49]
[12,"Rodrigo Ricardo",38,140,"00:00:50.342",56.42]
[12,"Rodrigo Ricardo",38,140,"00:00:50.976",55.72]
[12,"Rodrigo Ricardo",38,140,"00:00:50.073",56.73]
[12,"Rodrigo Ricardo",38,140,"00:00:51.887",54.74]
[12,"Rodrigo Ricardo",38,140,"00:00:50.953",55.75]
[12,"Rodrigo Ricardo",38,140,"00:00:50.188",56.6]
[12,"Rodrigo Ricardo",38,140,"00:00:51.154",55.53]
[12,"Rodrigo Ricardo",38,140,"00:00:51.212",55.46]
[12,"Rodrigo Ricardo",38,140,"00:00:50.807",55.91]
[12,"Rodrigo Ricardo",38,140,"00:00:51.938",54.69]
[12,"Rodrigo Ricardo",38,140,"00:00:51.188",55.49]
[12,"Rodrigo Ricardo",38,140,"00:00:50.741",55.98]
[12,"Rodrigo Ricardo",38,140,"00:00:50.774",55.94]
[12,"Rodrigo Ricardo",38,140,"00:00:51.992",54.63]
[12,"Rodrigo Ricardo",38,140,"00:00:50.434",56.32]
[12,"Rodrigo Ricardo",38,140,"00:00:50.350",56.41]
[12,"Rodrigo Ricardo",38,140,"00:00:50.579",56.16]
[12,"Rodrigo Ricardo",38,140,"00:00:51.822",54.81]
[12,"Rodrigo Ricardo",38,140,"00:00:51.487",55.17]
[12,"Jucimar Vieira",38,123,"00:00:56.797",50.01]
[12,"Jucimar Vieira",38,123,"00:00:53.922",52.68]
[12,"Jucimar Vieira",38,123,"00:00:53.811",52.78]
[12,"Jucimar Vieira",38,123,"00:00:51.330",55.34]
[12,"Jucimar Vieira",38,123,"00:00:50.827",55.88]
[12,"Jucimar Vieira",38,123,"00:00:50.762",55.96]
[12,"Jucimar Vieira",38,123,"00:00:51.052",55.64]
[12,"Jucimar Vieira",38,123,"00:00:50.512",56.23]
[12,"Jucimar Vieira",38,123,"00:00:50.404",56.35]
[12,"Jucimar Vieira",38,123,"00:00:50.659",56.07]
[12,"Jucimar Vieira",38,123,"00:00:50.188",56.6]
[12,"Jucimar Vieira",38,123,"00:00:50.777",55.94]
[12,"Jucimar Vieira",38,123,"00:00:50.742",55.98]
[12,"Jucimar Vieira",38,123,"00:00:50.803",55.91]
[12,"Jucimar Vieira",38,123,"00:00:50.526",56.22]
[12,"Jucimar Vieira",38,123,"00:00:50.552",56.19]
[12,"Jucimar Vieira",38,123,"00:00:50.374",56.39]
[12,"Jucimar Vieira",38,123,"00:00:50.107",56.69]
[12,"Jucimar Vieira",38,123,"00:00:50.077",56.72]
[12,"Jucimar Vieira",38,123,"00:00:50.316",56.45]
[12,"Jucimar Vieira",38,123,"00:00:50.812",55.9]
[12,"Jucimar Vieira",38,123,"00:00:49.901",56.92]
[12,"Jucimar Vieira",38,123,"00:00:51.059",55.63]
[12,"Jucimar Vieira",38,123,"00:00:50.378",56.38]
[12,"Jucimar Vieira",38,123,"00:00:50.708",56.01]
[12,"Jucimar Vieira",38,123,"00:00:51.466",55.19]
[12,"Jucimar Vieira",38,123,"00:00:51.323",55.34]
[12,"Jucimar Vieira",38,123,"00:00:51.197",55.48]
[12,"Jucimar Vieira",38,123,"00:00:51.412",55.25]
[12,"Jucimar Vieira",38,123,"00:00:51.040",55.65]
[12,"Jucimar Vieira",38,123,"00:00:50.831",55.88]
[12,"Jucimar Vieira",38,123,"00:00:50.772",55.94]
[12,"Jucimar Vieira",38,123,"00:00:50.905",55.8]
[12,"Jucimar Vieira",38,123,"00:00:51.028",55.66]
[12,"Jucimar Vieira",38,123,"00:00:50.742",55.98]
[12,"Jucimar Vieira",38,123,"00:00:50.670",56.06]
[12,"Jucimar Vieira",38,123,"00:00:51.802",54.83]
[12,"Jucimar Vieira",38,123,"00:00:52.215",54.4]
[12,"Guilherme Alves",35,102,"00:00:56.561",50.22]
[12,"Guilherme Alves",35,102,"00:00:49.848",56.98]
[12,"Guilherme Alves",35,102,"00:00:50.009",56.8]
[12,"Guilherme Alves",35,102,"00:00:50.793",55.92]
[12,"Guilherme Alves",35,102,"00:00:49.701",57.15]
[12,"Guilherme Alves",35,102,"00:00:49.872",56.95]
[12,"Guilherme Alves",35,102,"00:00:50.062",56.74]
[12,"Guilherme Alves",35,102,"00:00:49.735",57.11]
[12,"Guilherme Alves",35,102,"00:00:50.020",56.79]
[12,"Guilherme Alves",35,102,"00:00:49.806",57.03]
[12,"Guilherme Alves",35,102,"00:00:49.737",57.11]
[12,"Guilherme Alves",35,102,"00:00:49.849",56.98]
[12,"Guilherme Alves",35,102,"00:00:49.863",56.96]
[12,"Guilherme Alves",35,102,"00:00:49.678",57.18]
[12,"Guilherme Alves",35,102,"00:00:49.801",57.03]
[12,"Guilherme Alves",35,102,"00:00:50.061",56.74]
[12,"Guilherme Alves",35,102,"00:00:49.521",57.36]
[12,"Guilherme Alves",35,102,"00:00:49.463",57.42]
[12,"Guilherme Alves",35,102,"00:00:49.512",57.37]
[12,"Guilherme Alves",35,102,"00:00:49.730",57.12]
[12,"Guilherme Alves",35,102,"00:00:49.431",57.46]
[12,"Guilherme Alves",35,102,"00:00:49.502",57.38]
[12,"Guilherme Alves",35,102,"00:00:50.373",56.39]
[12,"Guilherme Alves",35,102,"00:00:49.467",57.42]
[12,"Guilherme Alves",35,102,"00:00:49.642",57.22]
[12,"Guilherme Alves",35,102,"00:00:51.300",55.37]
[12,"Guilherme Alves",35,102,"00:00:49.661",57.2]
[12,"Guilherme Alves",35,102,"00:00:49.639",57.22]
[12,"Guilherme Alves",35,102,"00:00:49.609",57.26]
[12,"Guilherme Alves",35,102,"00:00:49.724",57.12]
[12,"Guilherme Alves",35,102,"00:00:49.740",57.1]
[12,"Guilherme Alves",35,102,"00:00:49.686",57.17]
[12,"Guilherme Alves",35,102,"00:00:49.833",57]
[12,"Guilherme Alves",35,102,"00:00:52.774",53.82]
[12,"Guilherme Alves",35,102,"00:01:00.481",46.96]
[12,"Hélio Chagas",30,108,"00:00:57.116",49.73]
[12,"Hélio Chagas",30,108,"00:00:53.943",52.66]
[12,"Hélio Chagas",30,108,"00:00:50.598",56.14]
[12,"Hélio Chagas",30,108,"00:00:51.364",55.3]
[12,"Hélio Chagas",30,108,"00:00:50.808",55.9]
[12,"Hélio Chagas",30,108,"00:00:50.600",56.13]
[12,"Hélio Chagas",30,108,"00:00:50.671",56.06]
[12,"Hélio Chagas",30,108,"00:00:50.791",55.92]
[12,"Hélio Chagas",30,108,"00:00:50.835",55.87]
[12,"Hélio Chagas",30,108,"00:00:50.350",56.41]
[12,"Hélio Chagas",30,108,"00:00:51.121",55.56]
[12,"Hélio Chagas",30,108,"00:01:01.031",46.54]
[12,"Hélio Chagas",30,108,"00:00:50.649",56.08]
[12,"Hélio Chagas",30,108,"00:00:51.255",55.42]
[12,"Hélio Chagas",30,108,"00:00:50.849",55.86]
[12,"Hélio Chagas",30,108,"00:00:50.597",56.14]
[12,"Hélio Chagas",30,108,"00:00:51.065",55.62]
[12,"Hélio Chagas",30,108,"00:00:50.729",55.99]
[12,"Hélio Chagas",30,108,"00:00:50.985",55.71]
[12,"Hélio Chagas",30,108,"00:00:51.273",55.4]
[12,"Hélio Chagas",30,108,"00:00:51.185",55.49]
[12,"Hélio Chagas",30,108,"00:00:51.184",55.49]
[12,"Hélio Chagas",30,108,"00:00:51.009",55.68]
[12,"Hélio Chagas",30,108,"00:00:50.963",55.73]
[12,"Hélio Chagas",30,108,"00:00:50.724",56]
[12,"Hélio Chagas",30,108,"00:00:50.696",56.03]
[12,"Hélio Chagas",30,108,"00:00:51.132",55.55]
[12,"Hélio Chagas",30,108,"00:00:50.731",55.99]
[12,"Hélio Chagas",30,108,"00:00:50.991",55.7]
[12,"Hélio Chagas",30,108,"00:00:51.426",55.23]
[12,"Leandro Malias",18,130,"00:00:57.325",49.55]
[12,"Leandro Malias",18,130,"00:00:53.450",53.14]
[12,"Leandro Malias",18,130,"00:00:53.341",53.25]
[12,"Leandro Malias",18,130,"00:00:51.399",55.26]
[12,"Leandro Malias",18,130,"00:00:51.499",55.15]
[12,"Leandro Malias",18,130,"00:00:51.219",55.46]
[12,"Leandro Malias",18,130,"00:00:51.420",55.24]
[12,"Leandro Malias",18,130,"00:00:50.867",55.84]
[12,"Leandro Malias",18,130,"00:00:51.515",55.14]
[12,"Leandro Malias",18,130,"00:00:50.469",56.28]
[12,"Leandro Malias",18,130,"00:00:50.406",56.35]
[12,"Leandro Malias",18,130,"00:00:50.529",56.21]
[12,"Leandro Malias",18,130,"00:00:50.776",55.94]
[12,"Leandro Malias",18,130,"00:00:51.767",54.87]
[12,"Leandro Malias",18,130,"00:00:51.390",55.27]
[12,"Leandro Malias",18,130,"00:00:51.529",55.12]
[12,"Leandro Malias",18,130,"00:00:51.007",55.69]
[12,"Leandro Malias",18,130,"00:00:51.506",55.15]
[12,"Marcelo Chagas",7,112,"00:00:56.269",50.48]
[12,"Marcelo Chagas",7,112,"00:00:50.006",56.8]
[12,"Marcelo Chagas",7,112,"00:00:50.170",56.62]
[12,"Marcelo Chagas",7,112,"00:00:50.071",56.73]
[12,"Marcelo Chagas",7,112,"00:00:51.346",55.32]
[12,"Marcelo Chagas",7,112,"00:00:50.843",55.87]
[12,"Marcelo Chagas",7,112,"00:00:52.257",54.35]
[13,null,null,null,"00:00:00"]

{"sheet":"ETAPA 11","index":1,"n_rows":779,"n_cols":12,"rows_kept":779,"cut":false,"hidden":false,"merged":[[0,0,0,6]]}
["Obs.: Selecione até 3 pilotos colocando na frente do seu nome os números 1, 2 e 3.",null,null,null,null,null,null,"PILOTO",{"$f":"J52","v":"Marcelo Campos"},{"$f":"K52","v":"Marcelo Chagas"},{"$f":"L52","v":"Maurício Júnior"}]
[1,"Marcelo Campos",null,null,null,null,null,"MÉDIA",{"$f":"AVERAGE(J53:J97)","v":"00:01:06.826"},{"$f":"AVERAGE(K53:K97)","v":"00:01:06.833"},{"$f":"AVERAGE(L53:L97)","v":"00:01:06.885"}]
[2,"Marcelo Chagas",null,null,null,null,null,"MAXIMA",{"$f":"LARGE(J53:J97,1)","v":"00:01:16.530"},{"$f":"LARGE(K53:K97,1)","v":"00:01:13.260"},{"$f":"LARGE(L53:L97,1)","v":"00:01:10.287"}]
[3,"Maurício Júnior",null,null,null,null,null,"MÍNIMA",{"$f":"SMALL(J53:J97,1)","v":"00:01:05.786"},{"$f":"SMALL(K53:K97,1)","v":"00:01:05.862"},{"$f":"SMALL(L53:L97,1)","v":"00:01:05.915"}]
[null,"Marcelo Pereira",null,null,null,null,null,"Desvio Padrão",{"$f":"_xlfn.STDEV.S(J53:J97)","v":"00:00:02.023"},{"$f":"_xlfn.STDEV.S(K53:K97)","v":"00:00:01.351"},{"$f":"_xlfn.STDEV.S(L53:L97)","v":"00:00:00.836"}]
[null,"Wesley Canuto",null,null,null,null,null,"TEMPO TOTAL",{"$f":"SUM(J53:J97,1)","v":1.0208831828703704},{"$f":"SUM(K53:K97,1)","v":1.0208854050925926},{"$f":"SUM(L53:L97,1)","v":1.0209014467592592}]
[null,"Eduardo Henrique"]
[null,"Guilherme Alves"]
[null,"Jarbas Reis"]
[null,"Wesley Bambirra"]
[null,"JEAN PAUL"]
[null,"Vitor Gatti"]
[null,"Alexandre Melillo",null,null,null,null,null,null,null,null,{"$f":"SMALL(I4:K4,1)-L13","v":"00:01:05.786"}]
[null,"Rodrigo Ricardo",null,null,null,null,null,null,null,null,{"$f":"LARGE(I3:K3,1)+L13","v":"00:01:16.530"}]
[null,"Raphael Reis"]
[null,"Frederico Papatella"]
[null,"CARLOS SAMPAIO"]
[null,"Felipe Bouhid"]
[null,"Leandro Malias"]
[null,"Jucimar Vieira"]
[null,"Tati Marcondes"]
[null,"Cláudio Naves"]
[null,"Hélio Chagas"]
[null,"Wesley Camargos"]
[null,"Renato Amaral"]
[null,"Marcelo Clemente"]
[null,"Daniel Nahum"]
[null,"Roberta Epifânio"]
[null,"Marcelo Marcondes"]
[]
[]
[1]
[]
[]
[]
[]
[]
[]
[]
[]
[]
[]
[]
[]
[]
[]
[]
[]
[]
["ETAPA","PILOTO","NÚMERO VOLTAS","KART","Volta Tm","velocidade Media",null,null,null,{"$f":"MATCH(J52,$B$51:$B$1500,0)","v":1},{"$f":"MATCH(K52,$B$51:$B$1500,0)","v":28},55]
[11,"Marcelo Campos",27,110,"00:01:16.530",51.6,null,null,null,{"$f":"VLOOKUP(J$52,$B$50:$F$1500,2,FALSE)","v":27},{"$f":"VLOOKUP(K$52,$B$50:$F$1500,2,FALSE)","v":27},{"$f":"VLOOKUP(L$52,$B$50:$F$1500,2,FALSE)","v":27}]
[11,"Marcelo Campos",27,110,"00:01:07.924",58.14,null,null,"VOLTA",{"$f":"VLOOKUP(1,$A$2:$B$36,2,FALSE)","v":"Marcelo Campos"},{"$f":"VLOOKUP(2,$A$2:$B$36,2,FALSE)","v":"Marcelo Chagas"},{"$f":"VLOOKUP(3,$A$2:$B$36,2,FALSE)","v":"Maurício Júnior"}]
[11,"Marcelo Campos",27,110,"00:01:07.487",58.52,null,null,1,{"$f":"OFFSET($E$51:$E$1500,J50-1,,J51)","v":"00:01:16.530"},{"$f":"OFFSET($E$51:$E$1500,K50-1,,K51)","v":"00:01:13.260"},{"$f":"OFFSET($E$51:$E$1500,L50-1,,L51)","v":"00:01:10.287"}]
[11,"Marcelo Campos",27,110,"00:01:06.758",59.16,null,null,2,"00:01:07.924","00:01:07.166","00:01:07.917"]
[11,"Marcelo Campos",27,110,"00:01:06.240",59.62,null,null,3,"00:01:07.487","00:01:06.973","00:01:07.217"]
[11,"Marcelo Campos",27,110,"00:01:06.241",59.62,null,null,4,"00:01:06.758","00:01:06.640","00:01:06.938"]
[11,"Marcelo Campos",27,110,"00:01:06.674",59.23,null,null,5,"00:01:06.240","00:01:06.364","00:01:06.924"]
[11,"Marcelo Campos",27,110,"00:01:05.855",59.97,null,null,6,"00:01:06.241","00:01:06.582","00:01:06.516"]
[11,"Marcelo Campos",27,110,"00:01:06.155",59.7,null,null,7,"00:01:06.674","00:01:06.645","00:01:06.803"]
[11,"Marcelo Campos",27,110,"00:01:06.270",59.59,null,null,8,"00:01:05.855","00:01:06.553","00:01:06.551"]
[11,"Marcelo Campos",27,110,"00:01:06.266",59.6,null,null,9,"00:01:06.155","00:01:06.760","00:01:06.458"]
[11,"Marcelo Campos",27,110,"00:01:05.998",59.84,null,null,10,"00:01:06.270","00:01:06.735","00:01:06.793"]
[11,"Marcelo Campos",27,110,"00:01:05.923",59.91,null,null,11,"00:01:06.266","00:01:06.808","00:01:06.533"]
[11,"Marcelo Campos",27,110,"00:01:06.270",59.59,null,null,12,"00:01:05.998","00:01:06.944","00:01:06.440"]
[11,"Marcelo Campos",27,110,"00:01:06.122",59.73,null,null,13,"00:01:05.923","00:01:06.564","00:01:06.506"]
[11,"Marcelo Campos",27,110,"00:01:06.023",59.82,null,null,14,"00:01:06.270","00:01:06.357","00:01:06.783"]
[11,"Marcelo Campos",27,110,"00:01:06.819",59.1,null,null,15,"00:01:06.122","00:01:06.599","00:01:06.713"]
[11,"Marcelo Campos",27,110,"00:01:06.041",59.8,null,null,16,"00:01:06.023","00:01:06.206","00:01:06.382"]
[11,"Marcelo Campos",27,110,"00:01:06.120",59.73,null,null,17,"00:01:06.819","00:01:06.206","00:01:06.433"]
[11,"Marcelo Campos",27,110,"00:01:05.786",60.03,null,null,18,"00:01:06.041","00:01:06.159","00:01:06.430"]
[11,"Marcelo Campos",27,110,"00:01:06.046",59.79,null,null,19,"00:01:06.120","00:01:05.960","00:01:06.788"]
[11,"Marcelo Campos",27,110,"00:01:07.442",58.56,null,null,20,"00:01:05.786","00:01:05.862","00:01:06.231"]
[11,"Marcelo Campos",27,110,"00:01:06.680",59.23,null,null,21,"00:01:06.046","00:01:06.052","00:01:06.404"]
[11,"Marcelo Campos",27,110,"00:01:05.984",59.85,null,null,22,"00:01:07.442","00:01:07.342","00:01:07.898"]
[11,"Marcelo Campos",27,110,"00:01:06.411",59.47,null,null,23,"00:01:06.680","00:01:06.388","00:01:06.858"]
[11,"Marcelo Campos",27,110,"00:01:06.536",59.35,null,null,24,"00:01:05.984","00:01:06.281","00:01:05.915"]
[11,"Marcelo Campos",27,110,"00:01:07.706",58.33,null,null,25,"00:01:06.411","00:01:06.422","00:01:06.772"]
[11,"Marcelo Chagas",27,128,"00:01:13.260",53.91,null,null,26,"00:01:06.536","00:01:07.021","00:01:06.502"]
[11,"Marcelo Chagas",27,128,"00:01:07.166",58.8,null,null,27,"00:01:07.706","00:01:07.650","00:01:07.893"]
[11,"Marcelo Chagas",27,128,"00:01:06.973",58.97,null,null,28]
[11,"Marcelo Chagas",27,128,"00:01:06.640",59.26,null,null,29]
[11,"Marcelo Chagas",27,128,"00:01:06.364",59.51,null,null,30]
[11,"Marcelo Chagas",27,128,"00:01:06.582",59.31,null,null,31]
[11,"Marcelo Chagas",27,128,"00:01:06.645",59.26,null,null,32]
[11,"Marcelo Chagas",27,128,"00:01:06.553",59.34,null,null,33]
[11,"Marcelo Chagas",27,128,"00:01:06.760",59.16,null,null,34]
[11,"Marcelo Chagas",27,128,"00:01:06.735",59.18,null,null,35]
[11,"Marcelo Chagas",27,128,"00:01:06.808",59.11,null,null,36]
[11,"Marcelo Chagas",27,128,"00:01:06.944",58.99,null,null,37]
[11,"Marcelo Chagas",27,128,"00:01:06.564",59.33,null,null,38]
[11,"Marcelo Chagas",27,128,"00:01:06.357",59.51,null,null,39]
[11,"Marcelo Chagas",27,128,"00:01:06.599",59.3,null,null,40]
[11,"Marcelo Chagas",27,128,"00:01:06.206",59.65,null,null,41]
[11,"Marcelo Chagas",27,128,"00:01:06.206",59.65,null,null,42]
[11,"Marcelo Chagas",27,128,"00:01:06.159",59.69,null,null,43]
[11,"Marcelo Chagas",27,128,"00:01:05.960",59.87,null,null,44]
[11,"Marcelo Chagas",27,128,"00:01:05.862",59.96,null,null,45]
[11,"Marcelo Chagas",27,128,"00:01:06.052",59.79]
[11,"Marcelo Chagas",27,128,"00:01:07.342",58.64]
[11,"Marcelo Chagas",27,128,"00:01:06.388",59.49]
[11,"Marcelo Chagas",27,128,"00:01:06.281",59.58]
[11,"Marcelo Chagas",27,128,"00:01:06.422",59.46]
[11,"Marcelo Chagas",27,128,"00:01:07.021",58.92]
[11,"Marcelo Chagas",27,128,"00:01:07.650",58.38]
[11,"Maurício Júnior",27,103,"00:01:10.287",56.19]
[11,"Maurício Júnior",27,103,"00:01:07.917",58.15]
[11,"Maurício Júnior",27,103,"00:01:07.217",58.75]
[11,"Maurício Júnior",27,103,"00:01:06.938",59]
[11,"Maurício Júnior",27,103,"00:01:06.924",59.01]
[11,"Maurício Júnior",27,103,"00:01:06.516",59.37]
[11,"Maurício Júnior",27,103,"00:01:06.803",59.12]
[11,"Maurício Júnior",27,103,"00:01:06.551",59.34]
[11,"Maurício Júnior",27,103,"00:01:06.458",59.42]
[11,"Maurício Júnior",27,103,"00:01:06.793",59.13]
[11,"Maurício Júnior",27,103,"00:01:06.533",59.36]
[11,"Maurício Júnior",27,103,"00:01:06.440",59.44]
[11,"Maurício Júnior",27,103,"00:01:06.506",59.38]
[11,"Maurício Júnior",27,103,"00:01:06.783",59.13]
[11,"Maurício Júnior",27,103,"00:01:06.713",59.2]
[11,"Maurício Júnior",27,103,"00:01:06.382",59.49]
[11,"Maurício Júnior",27,103,"00:01:06.433",59.45]
[11,"Maurício Júnior",27,103,"00:01:06.430",59.45]
[11,"Maurício Júnior",27,103,"00:01:06.788",59.13]
[11,"Maurício Júnior",27,103,"00:01:06.231",59.63]
[11,"Maurício Júnior",27,103,"00:01:06.404",59.47]
[11,"Maurício Júnior",27,103,"00:01:07.898",58.16]
[11,"Maurício Júnior",27,103,"00:01:06.858",59.07]
[11,"Maurício Júnior",27,103,"00:01:05.915",59.91]
[11,"Maurício Júnior",27,103,"00:01:06.772",59.14]
[11,"Maurício Júnior",27,103,"00:01:06.502",59.38]
[11,"Maurício Júnior",27,103,"00:01:07.893",58.17]
[11,"Marcelo Pereira",27,142,"00:01:12.976",54.12]
[11,"Marcelo Pereira",27,142,"00:01:07.972",58.1]
[11,"Marcelo Pereira",27,142,"00:01:07.728",58.31]
[11,"Marcelo Pereira",27,142,"00:01:07.133",58.83]
[11,"Marcelo Pereira",27,142,"00:01:06.374",59.5]
[11,"Marcelo Pereira",27,142,"00:01:06.261",59.6]
[11,"Marcelo Pereira",27,142,"00:01:06.390",59.48]
[11,"Marcelo Pereira",27,142,"00:01:06.183",59.67]
[11,"Marcelo Pereira",27,142,"00:01:06.445",59.44]
[11,"Marcelo Pereira",27,142,"00:01:06.484",59.4]
[11,"Marcelo Pereira",27,142,"00:01:06.492",59.39]
[11,"Marcelo Pereira",27,142,"00:01:06.470",59.41]
[11,"Marcelo Pereira",27,142,"00:01:06.398",59.48]
[11,"Marcelo Pereira",27,142,"00:01:06.586",59.31]
[11,"Marcelo Pereira",27,142,"00:01:06.506",59.38]
[11,"Marcelo Pereira",27,142,"00:01:06.462",59.42]
[11,"Marcelo Pereira",27,142,"00:01:06.442",59.44]
[11,"Marcelo Pereira",27,142,"00:01:06.266",59.6]
[11,"Marcelo Pereira",27,142,"00:01:06.211",59.65]
[11,"Marcelo Pereira",27,142,"00:01:06.259",59.6]
[11,"Marcelo Pereira",27,142,"00:01:06.462",59.42]
[11,"Marcelo Pereira",27,142,"00:01:06.287",59.58]
[11,"Marcelo Pereira",27,142,"00:01:06.236",59.62]
[11,"Marcelo Pereira",27,142,"00:01:06.264",59.6]
[11,"Marcelo Pereira",27,142,"00:01:06.150",59.7]
[11,"Marcelo Pereira",27,142,"00:01:06.415",59.46]
[11,"Marcelo Pereira",27,142,"00:01:06.154",59.7]
[11,"Wesley Canuto",27,143,"00:01:12.043",54.82]
[11,"Wesley Canuto",27,143,"00:01:07.307",58.67]
[11,"Wesley Canuto",27,143,"00:01:07.178",58.79]
[11,"Wesley Canuto",27,143,"00:01:06.572",59.32]
[11,"Wesley Canuto",27,143,"00:01:06.964",58.97]
[11,"Wesley Canuto",27,143,"00:01:06.647",59.26]
[11,"Wesley Canuto",27,143,"00:01:06.846",59.08]
[11,"Wesley Canuto",27,143,"00:01:06.723",59.19]
[11,"Wesley Canuto",27,143,"00:01:06.762",59.15]
[11,"Wesley Canuto",27,143,"00:01:06.675",59.23]
[11,"Wesley Canuto",27,143,"00:01:07.372",58.62]
[11,"Wesley Canuto",27,143,"00:01:07.122",58.84]
[11,"Wesley Canuto",27,143,"00:01:06.823",59.1]
[11,"Wesley Canuto",27,143,"00:01:06.681",59.23]
[11,"Wesley Canuto",27,143,"00:01:06.467",59.42]
[11,"Wesley Canuto",27,143,"00:01:06.383",59.49]
[11,"Wesley Canuto",27,143,"00:01:06.392",59.48]
[11,"Wesley Canuto",27,143,"00:01:06.552",59.34]
[11,"Wesley Canuto",27,143,"00:01:06.617",59.28]
[11,"Wesley Canuto",27,143,"00:01:06.676",59.23]
[11,"Wesley Canuto",27,143,"00:01:07.431",58.57]
[11,"Wesley Canuto",27,143,"00:01:06.330",59.54]
[11,"Wesley Canuto",27,143,"00:01:06.324",59.54]
[11,"Wesley Canuto",27,143,"00:01:06.436",59.44]
[11,"Wesley Canuto",27,143,"00:01:06.695",59.21]
[11,"Wesley Canuto",27,143,"00:01:06.520",59.37]
[11,"Wesley Canuto",27,143,"00:01:07.509",58.5]
[11,"Eduardo Henrique",27,130,"00:01:13.227",53.93]
[11,"Eduardo Henrique",27,130,"00:01:08.177",57.93]
[11,"Eduardo Henrique",27,130,"00:01:07.434",58.56]
[11,"Eduardo Henrique",27,130,"00:01:06.795",59.12]
[11,"Eduardo Henrique",27,130,"00:01:06.663",59.24]
[11,"Eduardo Henrique",27,130,"00:01:07.111",58.85]
[11,"Eduardo Henrique",27,130,"00:01:06.603",59.29]
[11,"Eduardo Henrique",27,130,"00:01:06.983",58.96]
[11,"Eduardo Henrique",27,130,"00:01:07.120",58.84]
[11,"Eduardo Henrique",27,130,"00:01:06.520",59.37]
[11,"Eduardo Henrique",27,130,"00:01:06.362",59.51]
[11,"Eduardo Henrique",27,130,"00:01:06.407",59.47]
[11,"Eduardo Henrique",27,130,"00:01:06.557",59.34]
[11,"Eduardo Henrique",27,130,"00:01:06.403",59.47]
[11,"Eduardo Henrique",27,130,"00:01:06.821",59.1]
[11,"Eduardo Henrique",27,130,"00:01:06.250",59.61]
[11,"Eduardo Henrique",27,130,"00:01:06.375",59.5]
[11,"Eduardo Henrique",27,130,"00:01:06.456",59.43]
[11,"Eduardo Henrique",27,130,"00:01:06.139",59.71]
[11,"Eduardo Henrique",27,130,"00:01:06.285",59.58]
[11,"Eduardo Henrique",27,130,"00:01:06.640",59.26]
[11,"Eduardo Henrique",27,130,"00:01:06.544",59.35]
[11,"Eduardo Henrique",27,130,"00:01:06.459",59.42]
[11,"Eduardo Henrique",27,130,"00:01:06.507",59.38]
[11,"Eduardo Henrique",27,130,"00:01:06.734",59.18]
[11,"Eduardo Henrique",27,130,"00:01:06.194",59.66]
[11,"Eduardo Henrique",27,130,"00:01:07.223",58.75]
[11,"Guilherme Alves",27,102,"00:01:14.561",52.97]
[11,"Guilherme Alves",27,102,"00:01:07.700",58.33]
[11,"Guilherme Alves",27,102,"00:01:07.860",58.2]
[11,"Guilherme Alves",27,102,"00:01:08.540",57.62]
[11,"Guilherme Alves",27,102,"00:01:06.791",59.13]
[11,"Guilherme Alves",27,102,"00:01:06.562",59.33]
[11,"Guilherme Alves",27,102,"00:01:06.308",59.56]
[11,"Guilherme Alves",27,102,"00:01:06.804",59.12]
[11,"Guilherme Alves",27,102,"00:01:06.532",59.36]
[11,"Guilherme Alves",27,102,"00:01:06.578",59.32]
[11,"Guilherme Alves",27,102,"00:01:06.531",59.36]
[11,"Guilherme Alves",27,102,"00:01:06.386",59.49]
[11,"Guilherme Alves",27,102,"00:01:06.718",59.19]
[11,"Guilherme Alves",27,102,"00:01:06.468",59.42]
[11,"Guilherme Alves",27,102,"00:01:06.531",59.36]
[11,"Guilherme Alves",27,102,"00:01:06.560",59.33]
[11,"Guilherme Alves",27,102,"00:01:06.491",59.39]
[11,"Guilherme Alves",27,102,"00:01:06.747",59.17]
[11,"Guilherme Alves",27,102,"00:01:06.592",59.3]
[11,"Guilherme Alves",27,102,"00:01:06.529",59.36]
[11,"Guilherme Alves",27,102,"00:01:06.539",59.35]
[11,"Guilherme Alves",27,102,"00:01:06.451",59.43]
[11,"Guilherme Alves",27,102,"00:01:06.693",59.21]
[11,"Guilherme Alves",27,102,"00:01:06.262",59.6]
[11,"Guilherme Alves",27,102,"00:01:06.641",59.26]
[11,"Guilherme Alves",27,102,"00:01:06.532",59.36]
[11,"Guilherme Alves",27,102,"00:01:06.757",59.16]
[11,"Jarbas Reis",27,133,"00:01:20.589",49]
[11,"Jarbas Reis",27,133,"00:01:08.737",57.45]
[11,"Jarbas Reis",27,133,"00:01:08.081",58.01]
[11,"Jarbas Reis",27,133,"00:01:06.688",59.22]
[11,"Jarbas Reis",27,133,"00:01:06.649",59.25]
[11,"Jarbas Reis",27,133,"00:01:07.765",58.28]
[11,"Jarbas Reis",27,133,"00:01:07.356",58.63]
[11,"Jarbas Reis",27,133,"00:01:07.693",58.34]
[11,"Jarbas Reis",27,133,"00:01:07.300",58.68]
[11,"Jarbas Reis",27,133,"00:01:07.417",58.58]
[11,"Jarbas Reis",27,133,"00:01:06.875",59.05]
[11,"Jarbas Reis",27,133,"00:01:06.767",59.15]
[11,"Jarbas Reis",27,133,"00:01:06.691",59.22]
[11,"Jarbas Reis",27,133,"00:01:06.568",59.33]
[11,"Jarbas Reis",27,133,"00:01:06.268",59.59]
[11,"Jarbas Reis",27,133,"00:01:06.370",59.5]
[11,"Jarbas Reis",27,133,"00:01:06.569",59.32]
[11,"Jarbas Reis",27,133,"00:01:06.302",59.56]
[11,"Jarbas Reis",27,133,"00:01:06.412",59.47]
[11,"Jarbas Reis",27,133,"00:01:06.148",59.7]
[11,"Jarbas Reis",27,133,"00:01:06.563",59.33]
[11,"Jarbas Reis",27,133,"00:01:07.231",58.74]
[11,"Jarbas Reis",27,133,"00:01:06.486",59.4]
[11,"Jarbas Reis",27,133,"00:01:06.694",59.21]
[11,"Jarbas Reis",27,133,"00:01:06.304",59.56]
[11,"Jarbas Reis",27,133,"00:01:06.653",59.25]
[11,"Jarbas Reis",27,133,"00:01:06.831",59.09]
[11,"Wesley Bambirra",27,121,"00:01:14.938",52.7]
[11,"Wesley Bambirra",27,121,"00:01:09.907",56.49]
[11,"Wesley Bambirra",27,121,"00:01:07.594",58.43]
[11,"Wesley Bambirra",27,121,"00:01:06.955",58.98]
[11,"Wesley Bambirra",27,121,"00:01:07.426",58.57]
[11,"Wesley Bambirra",27,121,"00:01:07.628",58.4]
[11,"Wesley Bambirra",27,121,"00:01:06.988",58.95]
[11,"Wesley Bambirra",27,121,"00:01:07.262",58.71]
[11,"Wesley Bambirra",27,121,"00:01:08.099",57.99]
[11,"Wesley Bambirra",27,121,"00:01:07.921",58.14]
[11,"Wesley Bambirra",27,121,"00:01:07.551",58.46]
[11,"Wesley Bambirra",27,121,"00:01:07.786",58.26]
[11,"Wesley Bambirra",27,121,"00:01:06.765",59.15]
[11,"Wesley Bambirra",27,121,"00:01:06.694",59.21]
[11,"Wesley Bambirra",27,121,"00:01:06.508",59.38]
[11,"Wesley Bambirra",27,121,"00:01:06.529",59.36]
[11,"Wesley Bambirra",27,121,"00:01:06.553",59.34]
[11,"Wesley Bambirra",27,121,"00:01:06.226",59.63]
[11,"Wesley Bambirra",27,121,"00:01:06.818",59.1]
[11,"Wesley Bambirra",27,121,"00:01:06.586",59.31]
[11,"Wesley Bambirra",27,121,"00:01:06.584",59.31]
[11,"Wesley Bambirra",27,121,"00:01:06.658",59.25]
[11,"Wesley Bambirra",27,121,"00:01:06.264",59.6]
[11,"Wesley Bambirra",27,121,"00:01:06.923",59.01]
[11,"Wesley Bambirra",27,121,"00:01:06.544",59.35]
[11,"Wesley Bambirra",27,121,"00:01:06.795",59.12]
[11,"Wesley Bambirra",27,121,"00:01:06.865",59.06]
[11,"JEAN PAUL",27,109,"00:01:14.021",53.35]
[11,"JEAN PAUL",27,109,"00:01:09.247",57.03]
[11,"JEAN PAUL",27,109,"00:01:07.354",58.63]
[11,"JEAN PAUL",27,109,"00:01:07.566",58.45]
[11,"JEAN PAUL",27,109,"00:01:07.296",58.68]
[11,"JEAN PAUL",27,109,"00:01:08.041",58.04]
[11,"JEAN PAUL",27,109,"00:01:08.947",57.28]
[11,"JEAN PAUL",27,109,"00:01:07.359",58.63]
[11,"JEAN PAUL",27,109,"00:01:08.055",58.03]
[11,"JEAN PAUL",27,109,"00:01:07.320",58.66]
[11,"JEAN PAUL",27,109,"00:01:07.643",58.38]
[11,"JEAN PAUL",27,109,"00:01:07.721",58.32]
[11,"JEAN PAUL",27,109,"00:01:06.876",59.05]
[11,"JEAN PAUL",27,109,"00:01:07.021",58.92]
[11,"JEAN PAUL",27,109,"00:01:06.593",59.3]
[11,"JEAN PAUL",27,109,"00:01:06.606",59.29]
[11,"JEAN PAUL",27,109,"00:01:06.277",59.59]
[11,"JEAN PAUL",27,109,"00:01:06.619",59.28]
[11,"JEAN PAUL",27,109,"00:01:06.887",59.04]
[11,"JEAN PAUL",27,109,"00:01:06.362",59.51]
[11,"JEAN PAUL",27,109,"00:01:06.485",59.4]
[11,"JEAN PAUL",27,109,"00:01:06.746",59.17]
[11,"JEAN PAUL",27,109,"00:01:06.253",59.61]
[11,"JEAN PAUL",27,109,"00:01:06.840",59.08]
[11,"JEAN PAUL",27,109,"00:01:06.585",59.31]
[11,"JEAN PAUL",27,109,"00:01:06.621",59.28]
[11,"JEAN PAUL",27,109,"00:01:06.997",58.95]
[11,"Vitor Gatti",27,120,"00:01:17.984",50.64]
[11,"Vitor Gatti",27,120,"00:01:10.927",55.68]
[11,"Vitor Gatti",27,120,"00:01:08.347",57.78]
[11,"Vitor Gatti",27,120,"00:01:08.963",57.27]
[11,"Vitor Gatti",27,120,"00:01:07.182",58.78]
[11,"Vitor Gatti",27,120,"00:01:07.252",58.72]
[11,"Vitor Gatti",27,120,"00:01:06.863",59.06]
[11,"Vitor Gatti",27,120,"00:01:07.543",58.47]
[11,"Vitor Gatti",27,120,"00:01:08.446",57.7]
[11,"Vitor Gatti",27,120,"00:01:08.761",57.43]
[11,"Vitor Gatti",27,120,"00:01:07.100",58.86]
[11,"Vitor Gatti",27,120,"00:01:07.404",58.59]
[11,"Vitor Gatti",27,120,"00:01:06.951",58.99]
[11,"Vitor Gatti",27,120,"00:01:06.607",59.29]
[11,"Vitor Gatti",27,120,"00:01:06.839",59.09]
[11,"Vitor Gatti",27,120,"00:01:08.005",58.07]
[11,"Vitor Gatti",27,120,"00:01:07.381",58.61]
[11,"Vitor Gatti",27,120,"00:01:06.573",59.32]
[11,"Vitor Gatti",27,120,"00:01:06.636",59.27]
[11,"Vitor Gatti",27,120,"00:01:06.516",59.37]
[11,"Vitor Gatti",27,120,"00:01:06.424",59.45]
[11,"Vitor Gatti",27,120,"00:01:06.555",59.34]
[11,"Vitor Gatti",27,120,"00:01:06.638",59.26]
[11,"Vitor Gatti",27,120,"00:01:07.304",58.68]
[11,"Vitor Gatti",27,120,"00:01:06.646",59.26]
[11,"Vitor Gatti",27,120,"00:01:06.879",59.05]
[11,"Vitor Gatti",27,120,"00:01:07.793",58.25]
[11,"Alexandre Melillo",27,137,"00:01:16.792",51.43]
[11,"Alexandre Melillo",27,137,"00:01:09.271",57.01]
[11,"Alexandre Melillo",27,137,"00:01:07.377",58.61]
[11,"Alexandre Melillo",27,137,"00:01:08.541",57.62]
[11,"Alexandre Melillo",27,137,"00:01:07.661",58.37]
[11,"Alexandre Melillo",27,137,"00:01:07.383",58.61]
[11,"Alexandre Melillo",27,137,"00:01:08.632",57.54]
[11,"Alexandre Melillo",27,137,"00:01:09.447",56.87]
[11,"Alexandre Melillo",27,137,"00:01:07.924",58.14]
[11,"Alexandre Melillo",27,137,"00:01:08.381",57.75]
[11,"Alexandre Melillo",27,137,"00:01:07.779",58.27]
[11,"Alexandre Melillo",27,137,"00:01:07",58.94]
[11,"Alexandre Melillo",27,137,"00:01:06.895",59.04]
[11,"Alexandre Melillo",27,137,"00:01:07.350",58.64]
[11,"Alexandre Melillo",27,137,"00:01:07.237",58.74]
[11,"Alexandre Melillo",27,137,"00:01:07.381",58.61]
[11,"Alexandre Melillo",27,137,"00:01:06.826",59.1]
[11,"Alexandre Melillo",27,137,"00:01:07.029",58.92]
[11,"Alexandre Melillo",27,137,"00:01:06.891",59.04]
[11,"Alexandre Melillo",27,137,"00:01:06.700",59.21]
[11,"Alexandre Melillo",27,137,"00:01:06.886",59.04]
[11,"Alexandre Melillo",27,137,"00:01:06.578",59.32]
[11,"Alexandre Melillo",27,137,"00:01:06.648",59.25]
[11,"Alexandre Melillo",27,137,"00:01:06.963",58.98]
[11,"Alexandre Melillo",27,137,"00:01:07.003",58.94]
[11,"Alexandre Melillo",27,137,"00:01:06.900",59.03]
[11,"Alexandre Melillo",27,137,"00:01:08.175",57.93]
[11,"Rodrigo Ricardo",27,126,"00:01:10.853",55.74]
[11,"Rodrigo Ricardo",27,126,"00:01:08.783",57.42]
[11,"Rodrigo Ricardo",27,126,"00:01:08.465",57.68]
[11,"Rodrigo Ricardo",27,126,"00:01:07.842",58.21]
[11,"Rodrigo Ricardo",27,126,"00:01:07.717",58.32]
[11,"Rodrigo Ricardo",27,126,"00:01:08.230",57.88]
[11,"Rodrigo Ricardo",27,126,"00:01:08.010",58.07]
[11,"Rodrigo Ricardo",27,126,"00:01:07.922",58.14]
[11,"Rodrigo Ricardo",27,126,"00:01:07.911",58.15]
[11,"Rodrigo Ricardo",27,126,"00:01:07.554",58.46]
[11,"Rodrigo Ricardo",27,126,"00:01:07.542",58.47]
[11,"Rodrigo Ricardo",27,126,"00:01:07.391",58.6]
[11,"Rodrigo Ricardo",27,126,"00:01:07.594",58.43]
[11,"Rodrigo Ricardo",27,126,"00:01:07.369",58.62]
[11,"Rodrigo Ricardo",27,126,"00:01:07.821",58.23]
[11,"Rodrigo Ricardo",27,126,"00:01:07.869",58.19]
[11,"Rodrigo Ricardo",27,126,"00:01:07.202",58.77]
[11,"Rodrigo Ricardo",27,126,"00:01:07.833",58.22]
[11,"Rodrigo Ricardo",27,126,"00:01:07.919",58.15]
[11,"Rodrigo Ricardo",27,126,"00:01:07.247",58.73]
[11,"Rodrigo Ricardo",27,126,"00:01:07.769",58.27]
[11,"Rodrigo Ricardo",27,126,"00:01:07.667",58.36]
[11,"Rodrigo Ricardo",27,126,"00:01:08.120",57.97]
[11,"Rodrigo Ricardo",27,126,"00:01:07.924",58.14]
[11,"Rodrigo Ricardo",27,126,"00:01:07.650",58.38]
[11,"Rodrigo Ricardo",27,126,"00:01:07.451",58.55]
[11,"Rodrigo Ricardo",27,126,"00:01:07.533",58.48]
[11,"Raphael Reis",27,112,"00:01:15.981",51.98]
[11,"Raphael Reis",27,112,"00:01:09.157",57.1]
[11,"Raphael Reis",27,112,"00:01:09.434",56.88]
[11,"Raphael Reis",27,112,"00:01:07.800",58.25]
[11,"Raphael Reis",27,112,"00:01:07.350",58.64]
[11,"Raphael Reis",27,112,"00:01:07.300",58.68]
[11,"Raphael Reis",27,112,"00:01:07.080",58.87]
[11,"Raphael Reis",27,112,"00:01:08.360",57.77]
[11,"Raphael Reis",27,112,"00:01:07.829",58.22]
[11,"Raphael Reis",27,112,"00:01:08.078",58.01]
[11,"Raphael Reis",27,112,"00:01:07.513",58.5]
[11,"Raphael Reis",27,112,"00:01:07.253",58.72]
[11,"Raphael Reis",27,112,"00:01:07.095",58.86]
[11,"Raphael Reis",27,112,"00:01:07.759",58.28]
[11,"Raphael Reis",27,112,"00:01:07.321",58.66]
[11,"Raphael Reis",27,112,"00:01:08.083",58.01]
[11,"Raphael Reis",27,112,"00:01:07.901",58.16]
[11,"Raphael Reis",27,112,"00:01:07.115",58.84]
[11,"Raphael Reis",27,112,"00:01:07.377",58.61]
[11,"Raphael Reis",27,112,"00:01:07.691",58.34]
[11,"Raphael Reis",27,112,"00:01:07.541",58.47]
[11,"Raphael Reis",27,112,"00:01:07.435",58.56]
[11,"Raphael Reis",27,112,"00:01:07.326",58.66]
[11,"Raphael Reis",27,112,"00:01:07.830",58.22]
[11,"Raphael Reis",27,112,"00:01:07.624",58.4]
[11,"Raphael Reis",27,112,"00:01:07.637",58.39]
[11,"Raphael Reis",27,112,"00:01:07.206",58.76]
[11,"Frederico Papatella",27,134,"00:01:13.494",53.73]
[11,"Frederico Papatella",27,134,"00:01:08.593",57.57]
[11,"Frederico Papatella",27,134,"00:01:09.131",57.13]
[11,"Frederico Papatella",27,134,"00:01:08.408",57.73]
[11,"Frederico Papatella",27,134,"00:01:07.618",58.4]
[11,"Frederico Papatella",27,134,"00:01:08.075",58.01]
[11,"Frederico Papatella",27,134,"00:01:07.877",58.18]
[11,"Frederico Papatella",27,134,"00:01:08.017",58.06]
[11,"Frederico Papatella",27,134,"00:01:08.021",58.06]
[11,"Frederico Papatella",27,134,"00:01:07.681",58.35]
[11,"Frederico Papatella",27,134,"00:01:07.688",58.34]
[11,"Frederico Papatella",27,134,"00:01:09.290",57]
[11,"Frederico Papatella",27,134,"00:01:07.492",58.51]
[11,"Frederico Papatella",27,134,"00:01:07.586",58.43]
[11,"Frederico Papatella",27,134,"00:01:08.867",57.35]
[11,"Frederico Papatella",27,134,"00:01:07.370",58.62]
[11,"Frederico Papatella",27,134,"00:01:08.010",58.07]
[11,"Frederico Papatella",27,134,"00:01:07.101",58.85]
[11,"Frederico Papatella",27,134,"00:01:07.969",58.1]
[11,"Frederico Papatella",27,134,"00:01:07.623",58.4]
[11,"Frederico Papatella",27,134,"00:01:07.758",58.28]
[11,"Frederico Papatella",27,134,"00:01:07.148",58.81]
[11,"Frederico Papatella",27,134,"00:01:07.603",58.42]
[11,"Frederico Papatella",27,134,"00:01:07.806",58.24]
[11,"Frederico Papatella",27,134,"00:01:07.630",58.39]
[11,"Frederico Papatella",27,134,"00:01:07.608",58.41]
[11,"Frederico Papatella",27,134,"00:01:07.265",58.71]
[11,"CARLOS SAMPAIO",27,129,"00:01:13.316",53.87]
[11,"CARLOS SAMPAIO",27,129,"00:01:08.916",57.3]
[11,"CARLOS SAMPAIO",27,129,"00:01:07.336",58.65]
[11,"CARLOS SAMPAIO",27,129,"00:01:07.849",58.21]
[11,"CARLOS SAMPAIO",27,129,"00:01:08.651",57.53]
[11,"CARLOS SAMPAIO",27,129,"00:01:20.383",49.13]
[11,"CARLOS SAMPAIO",27,129,"00:01:07.388",58.6]
[11,"CARLOS SAMPAIO",27,129,"00:01:07.308",58.67]
[11,"CARLOS SAMPAIO",27,129,"00:01:07.373",58.62]
[11,"CARLOS SAMPAIO",27,129,"00:01:07.164",58.8]
[11,"CARLOS SAMPAIO",27,129,"00:01:07.296",58.68]
[11,"CARLOS SAMPAIO",27,129,"00:01:07.259",58.72]
[11,"CARLOS SAMPAIO",27,129,"00:01:06.660",59.24]
[11,"CARLOS SAMPAIO",27,129,"00:01:06.824",59.1]
[11,"CARLOS SAMPAIO",27,129,"00:01:06.819",59.1]
[11,"CARLOS SAMPAIO",27,129,"00:01:06.972",58.97]
[11,"CARLOS SAMPAIO",27,129,"00:01:07.483",58.52]
[11,"CARLOS SAMPAIO",27,129,"00:01:07.091",58.86]
[11,"CARLOS SAMPAIO",27,129,"00:01:06.894",59.04]
[11,"CARLOS SAMPAIO",27,129,"00:01:06.994",58.95]
[11,"CARLOS SAMPAIO",27,129,"00:01:07.101",58.85]
[11,"CARLOS SAMPAIO",27,129,"00:01:07.257",58.72]
[11,"CARLOS SAMPAIO",27,129,"00:01:07.299",58.68]
[11,"CARLOS SAMPAIO",27,129,"00:01:07.037",58.91]
[11,"CARLOS SAMPAIO",27,129,"00:01:07.060",58.89]
[11,"CARLOS SAMPAIO",27,129,"00:01:06.796",59.12]
[11,"CARLOS SAMPAIO",27,129,"00:01:07.195",58.77]
[11,"Felipe Bouhid",27,104,"00:01:14.256",53.18]
[11,"Felipe Bouhid",27,104,"00:01:08.863",57.35]
[11,"Felipe Bouhid",27,104,"00:01:09.169",57.09]
[11,"Felipe Bouhid",27,104,"00:01:08.158",57.94]
[11,"Felipe Bouhid",27,104,"00:01:08.064",58.02]
[11,"Felipe Bouhid",27,104,"00:01:09.505",56.82]
[11,"Felipe Bouhid",27,104,"00:01:06.969",58.97]
[11,"Felipe Bouhid",27,104,"00:01:09.985",56.43]
[11,"Felipe Bouhid",27,104,"00:01:07.871",58.19]
[11,"Felipe Bouhid",27,104,"00:01:08.860",57.35]
[11,"Felipe Bouhid",27,104,"00:01:07.522",58.49]
[11,"Felipe Bouhid",27,104,"00:01:08.771",57.43]
[11,"Felipe Bouhid",27,104,"00:01:07.421",58.58]
[11,"Felipe Bouhid",27,104,"00:01:07.768",58.28]
[11,"Felipe Bouhid",27,104,"00:01:07.615",58.41]
[11,"Felipe Bouhid",27,104,"00:01:07.089",58.87]
[11,"Felipe Bouhid",27,104,"00:01:07.299",58.68]
[11,"Felipe Bouhid",27,104,"00:01:07.587",58.43]
[11,"Felipe Bouhid",27,104,"00:01:07.524",58.49]
[11,"Felipe Bouhid",27,104,"00:01:07.420",58.58]
[11,"Felipe Bouhid",27,104,"00:01:07.054",58.9]
[11,"Felipe Bouhid",27,104,"00:01:06.489",59.4]
[11,"Felipe Bouhid",27,104,"00:01:07.547",58.47]
[11,"Felipe Bouhid",27,104,"00:01:07.998",58.08]
[11,"Felipe Bouhid",27,104,"00:01:07.833",58.22]
[11,"Felipe Bouhid",27,104,"00:01:07.580",58.44]
[11,"Felipe Bouhid",27,104,"00:01:07.444",58.56]
[11,"Leandro Malias",27,111,"00:01:16.596",51.56]
[11,"Leandro Malias",27,111,"00:01:10.983",55.64]
[11,"Leandro Malias",27,111,"00:01:08.932",57.29]
[11,"Leandro Malias",27,111,"00:01:09.833",56.55]
[11,"Leandro Malias",27,111,"00:01:08.362",57.77]
[11,"Leandro Malias",27,111,"00:01:07.776",58.27]
[11,"Leandro Malias",27,111,"00:01:07.545",58.47]
[11,"Leandro Malias",27,111,"00:01:07.309",58.67]
[11,"Leandro Malias",27,111,"00:01:07.148",58.81]
[11,"Leandro Malias",27,111,"00:01:07.589",58.43]
[11,"Leandro Malias",27,111,"00:01:08.362",57.77]
[11,"Leandro Malias",27,111,"00:01:07.761",58.28]
[11,"Leandro Malias",27,111,"00:01:08.246",57.87]
[11,"Leandro Malias",27,111,"00:01:06.952",58.99]
[11,"Leandro Malias",27,111,"00:01:07.458",58.54]
[11,"Leandro Malias",27,111,"00:01:07.258",58.72]
[11,"Leandro Malias",27,111,"00:01:07.779",58.27]
[11,"Leandro Malias",27,111,"00:01:07.039",58.91]
[11,"Leandro Malias",27,111,"00:01:07.139",58.82]
[11,"Leandro Malias",27,111,"00:01:07.264",58.71]
[11,"Leandro Malias",27,111,"00:01:06.883",59.05]
[11,"Leandro Malias",27,111,"00:01:06.851",59.07]
[11,"Leandro Malias",27,111,"00:01:07.183",58.78]
[11,"Leandro Malias",27,111,"00:01:07.842",58.21]
[11,"Leandro Malias",27,111,"00:01:08.524",57.63]
[11,"Leandro Malias",27,111,"00:01:07.273",58.7]
[11,"Leandro Malias",27,111,"00:01:07.128",58.83]
[11,"Jucimar Vieira",27,144,"00:01:15.748",52.14]
[11,"Jucimar Vieira",27,144,"00:01:09.506",56.82]
[11,"Jucimar Vieira",27,144,"00:01:09.730",56.64]
[11,"Jucimar Vieira",27,144,"00:01:07.998",58.08]
[11,"Jucimar Vieira",27,144,"00:01:07.582",58.44]
[11,"Jucimar Vieira",27,144,"00:01:07.447",58.55]
[11,"Jucimar Vieira",27,144,"00:01:07.541",58.47]
[11,"Jucimar Vieira",27,144,"00:01:07.928",58.14]
[11,"Jucimar Vieira",27,144,"00:01:08.432",57.71]
[11,"Jucimar Vieira",27,144,"00:01:09.345",56.95]
[11,"Jucimar Vieira",27,144,"00:01:08.623",57.55]
[11,"Jucimar Vieira",27,144,"00:01:07.372",58.62]
[11,"Jucimar Vieira",27,144,"00:01:07.688",58.34]
[11,"Jucimar Vieira",27,144,"00:01:07.394",58.6]
[11,"Jucimar Vieira",27,144,"00:01:07.244",58.73]
[11,"Jucimar Vieira",27,144,"00:01:07.197",58.77]
[11,"Jucimar Vieira",27,144,"00:01:07.543",58.47]
[11,"Jucimar Vieira",27,144,"00:01:07.279",58.7]
[11,"Jucimar Vieira",27,144,"00:01:08.501",57.65]
[11,"Jucimar Vieira",27,144,"00:01:07.648",58.38]
[11,"Jucimar Vieira",27,144,"00:01:08.070",58.02]
[11,"Jucimar Vieira",27,144,"00:01:07.221",58.75]
[11,"Jucimar Vieira",27,144,"00:01:07.632",58.39]
[11,"Jucimar Vieira",27,144,"00:01:07.903",58.16]
[11,"Jucimar Vieira",27,144,"00:01:08.101",57.99]
[11,"Jucimar Vieira",27,144,"00:01:08.092",58]
[11,"Jucimar Vieira",27,144,"00:01:08.242",57.87]
[11,"Tati Marcondes",27,105,"00:01:17.270",51.11]
[11,"Tati Marcondes",27,105,"00:01:10.324",56.16]
[11,"Tati Marcondes",27,105,"00:01:08.709",57.48]
[11,"Tati Marcondes",27,105,"00:01:09.484",56.84]
[11,"Tati Marcondes",27,105,"00:01:08.360",57.77]
[11,"Tati Marcondes",27,105,"00:01:09.020",57.22]
[11,"Tati Marcondes",27,105,"00:01:08.180",57.92]
[11,"Tati Marcondes",27,105,"00:01:07.256",58.72]
[11,"Tati Marcondes",27,105,"00:01:07.269",58.71]
[11,"Tati Marcondes",27,105,"00:01:07.959",58.11]
[11,"Tati Marcondes",27,105,"00:01:07.070",58.88]
[11,"Tati Marcondes",27,105,"00:01:08.712",57.47]
[11,"Tati Marcondes",27,105,"00:01:08.073",58.01]
[11,"Tati Marcondes",27,105,"00:01:08.023",58.06]
[11,"Tati Marcondes",27,105,"00:01:07.877",58.18]
[11,"Tati Marcondes",27,105,"00:01:07.033",58.91]
[11,"Tati Marcondes",27,105,"00:01:07.395",58.6]
[11,"Tati Marcondes",27,105,"00:01:07.257",58.72]
[11,"Tati Marcondes",27,105,"00:01:07.080",58.87]
[11,"Tati Marcondes",27,105,"00:01:07.250",58.72]
[11,"Tati Marcondes",27,105,"00:01:07.243",58.73]
[11,"Tati Marcondes",27,105,"00:01:08.441",57.7]
[11,"Tati Marcondes",27,105,"00:01:07.620",58.4]
[11,"Tati Marcondes",27,105,"00:01:07.653",58.37]
[11,"Tati Marcondes",27,105,"00:01:08.487",57.66]
[11,"Tati Marcondes",27,105,"00:01:08.098",57.99]
[11,"Tati Marcondes",27,105,"00:01:07",58.94]
[11,"Cláudio Naves",27,101,"00:01:15.089",52.59]
[11,"Cláudio Naves",27,101,"00:01:12.350",54.58]
[11,"Cláudio Naves",27,101,"00:01:08.616",57.56]
[11,"Cláudio Naves",27,101,"00:01:09.412",56.9]
[11,"Cláudio Naves",27,101,"00:01:08.731",57.46]
[11,"Cláudio Naves",27,101,"00:01:08.858",57.35]
[11,"Cláudio Naves",27,101,"00:01:08.862",57.35]
[11,"Cláudio Naves",27,101,"00:01:08.836",57.37]
[11,"Cláudio Naves",27,101,"00:01:08.128",57.97]
[11,"Cláudio Naves",27,101,"00:01:09.438",56.87]
[11,"Cláudio Naves",27,101,"00:01:09.072",57.18]
[11,"Cláudio Naves",27,101,"00:01:08.336",57.79]
[11,"Cláudio Naves",27,101,"00:01:08.704",57.48]
[11,"Cláudio Naves",27,101,"00:01:08.294",57.83]
[11,"Cláudio Naves",27,101,"00:01:08.696",57.49]
[11,"Cláudio Naves",27,101,"00:01:08.255",57.86]
[11,"Cláudio Naves",27,101,"00:01:08.315",57.81]
[11,"Cláudio Naves",27,101,"00:01:08.487",57.66]
[11,"Cláudio Naves",27,101,"00:01:08.428",57.71]
[11,"Cláudio Naves",27,101,"00:01:08.677",57.5]
[11,"Cláudio Naves",27,101,"00:01:08.316",57.81]
[11,"Cláudio Naves",27,101,"00:01:08.283",57.84]
[11,"Cláudio Naves",27,101,"00:01:08.556",57.61]
[11,"Cláudio Naves",27,101,"00:01:08.449",57.7]
[11,"Cláudio Naves",27,101,"00:01:08.348",57.78]
[11,"Cláudio Naves",27,101,"00:01:08.947",57.28]
[11,"Cláudio Naves",27,101,"00:01:09.702",56.66]
[11,"Hélio Chagas",27,119,"00:01:18.460",50.33]
[11,"Hélio Chagas",27,119,"00:01:12.067",54.8]
[11,"Hélio Chagas",27,119,"00:01:08.321",57.8]
[11,"Hélio Chagas",27,119,"00:01:08.558",57.6]
[11,"Hélio Chagas",27,119,"00:01:08.918",57.3]
[11,"Hélio Chagas",27,119,"00:01:08.034",58.05]
[11,"Hélio Chagas",27,119,"00:01:08.776",57.42]
[11,"Hélio Chagas",27,119,"00:01:13.276",53.89]
[11,"Hélio Chagas",27,119,"00:01:08.870",57.34]
[11,"Hélio Chagas",27,119,"00:01:07.955",58.11]
[11,"Hélio Chagas",27,119,"00:01:08.295",57.83]
[11,"Hélio Chagas",27,119,"00:01:08.607",57.56]
[11,"Hélio Chagas",27,119,"00:01:08.519",57.64]
[11,"Hélio Chagas",27,119,"00:01:08.451",57.69]
[11,"Hélio Chagas",27,119,"00:01:08.326",57.8]
[11,"Hélio Chagas",27,119,"00:01:08.365",57.77]
[11,"Hélio Chagas",27,119,"00:01:08.475",57.67]
[11,"Hélio Chagas",27,119,"00:01:08.279",57.84]
[11,"Hélio Chagas",27,119,"00:01:08.259",57.86]
[11,"Hélio Chagas",27,119,"00:01:08.357",57.77]
[11,"Hélio Chagas",27,119,"00:01:08.202",57.9]
[11,"Hélio Chagas",27,119,"00:01:07.962",58.11]
[11,"Hélio Chagas",27,119,"00:01:07.798",58.25]
[11,"Hélio Chagas",27,119,"00:01:07.672",58.36]
[11,"Hélio Chagas",27,119,"00:01:07.918",58.15]
[11,"Hélio Chagas",27,119,"00:01:09.017",57.22]
[11,"Hélio Chagas",27,119,"00:01:11.403",55.31]
[11,"Wesley Camargos",26,117,"00:01:21.355",48.54]
[11,"Wesley Camargos",26,117,"00:01:12.297",54.62]
[11,"Wesley Camargos",26,117,"00:01:10.008",56.41]
[11,"Wesley Camargos",26,117,"00:01:10.298",56.18]
[11,"Wesley Camargos",26,117,"00:01:10.054",56.37]
[11,"Wesley Camargos",26,117,"00:01:09.725",56.64]
[11,"Wesley Camargos",26,117,"00:01:09.876",56.52]
[11,"Wesley Camargos",26,117,"00:01:09.614",56.73]
[11,"Wesley Camargos",26,117,"00:01:09.704",56.66]
[11,"Wesley Camargos",26,117,"00:01:09.852",56.54]
[11,"Wesley Camargos",26,117,"00:01:09.474",56.84]
[11,"Wesley Camargos",26,117,"00:01:09.676",56.68]
[11,"Wesley Camargos",26,117,"00:01:09.287",57]
[11,"Wesley Camargos",26,117,"00:01:09.613",56.73]
[11,"Wesley Camargos",26,117,"00:01:09.622",56.72]
[11,"Wesley Camargos",26,117,"00:01:10.127",56.31]
[11,"Wesley Camargos",26,117,"00:01:10.575",55.96]
[11,"Wesley Camargos",26,117,"00:01:16.413",51.68]
[11,"Wesley Camargos",26,117,"00:01:11.332",55.36]
[11,"Wesley Camargos",26,117,"00:01:14.035",53.34]
[11,"Wesley Camargos",26,117,"00:01:11.964",54.88]
[11,"Wesley Camargos",26,117,"00:01:09.088",57.16]
[11,"Wesley Camargos",26,117,"00:01:10.816",55.77]
[11,"Wesley Camargos",26,117,"00:01:13.194",53.96]
[11,"Wesley Camargos",26,117,"00:01:11.667",55.1]
[11,"Wesley Camargos",26,117,"00:01:10.510",56.01]
[11,"Renato Amaral",26,140,"00:01:29.765",43.99]
[11,"Renato Amaral",26,140,"00:01:08.186",57.92]
[11,"Renato Amaral",26,140,"00:01:07.483",58.52]
[11,"Renato Amaral",26,140,"00:01:08.563",57.6]
[11,"Renato Amaral",26,140,"00:01:07.616",58.41]
[11,"Renato Amaral",26,140,"00:01:07.214",58.76]
[11,"Renato Amaral",26,140,"00:01:07.362",58.63]
[11,"Renato Amaral",26,140,"00:01:07.033",58.91]
[11,"Renato Amaral",26,140,"00:01:06.868",59.06]
[11,"Renato Amaral",26,140,"00:01:08.995",57.24]
[11,"Renato Amaral",26,140,"00:01:08.120",57.97]
[11,"Renato Amaral",26,140,"00:01:06.881",59.05]
[11,"Renato Amaral",26,140,"00:01:06.876",59.05]
[11,"Renato Amaral",26,140,"00:01:06.675",59.23]
[11,"Renato Amaral",26,140,"00:01:07.124",58.83]
[11,"Renato Amaral",26,140,"00:01:07.026",58.92]
[11,"Renato Amaral",26,140,"00:02:19.815",28.25]
[11,"Renato Amaral",26,140,"00:01:09.798",56.58]
[11,"Renato Amaral",26,140,"00:01:07.921",58.14]
[11,"Renato Amaral",26,140,"00:01:07.779",58.27]
[11,"Renato Amaral",26,140,"00:01:08.963",57.27]
[11,"Renato Amaral",26,140,"00:01:07.077",58.88]
[11,"Renato Amaral",26,140,"00:01:07.291",58.69]
[11,"Renato Amaral",26,140,"00:01:07.700",58.33]
[11,"Renato Amaral",26,140,"00:01:07.517",58.49]
[11,"Renato Amaral",26,140,"00:01:07.315",58.67]
[11,"Marcelo Clemente",25,124,"00:01:12.950",54.14]
[11,"Marcelo Clemente",25,124,"00:01:08.562",57.6]
[11,"Marcelo Clemente",25,124,"00:01:08.668",57.51]
[11,"Marcelo Clemente",25,124,"00:01:08.996",57.24]
[11,"Marcelo Clemente",25,124,"00:01:07.766",58.28]
[11,"Marcelo Clemente",25,124,"00:01:09.030",57.21]
[11,"Marcelo Clemente",25,124,"00:01:08.100",57.99]
[11,"Marcelo Clemente",25,124,"00:01:08.946",57.28]
[11,"Marcelo Clemente",25,124,"00:01:08.379",57.75]
[11,"Marcelo Clemente",25,124,"00:01:08.925",57.3]
[11,"Marcelo Clemente",25,124,"00:01:08.649",57.53]
[11,"Marcelo Clemente",25,124,"00:01:09.452",56.86]
[11,"Marcelo Clemente",25,124,"00:01:09.521",56.81]
[11,"Marcelo Clemente",25,124,"00:01:10.525",56]
[11,"Marcelo Clemente",25,124,"00:01:09.485",56.84]
[11,"Marcelo Clemente",25,124,"00:02:56.768",22.34]
[11,"Marcelo Clemente",25,124,"00:01:09.519",56.81]
[11,"Marcelo Clemente",25,124,"00:01:07.839",58.21]
[11,"Marcelo Clemente",25,124,"00:01:07.652",58.38]
[11,"Marcelo Clemente",25,124,"00:01:07.568",58.45]
[11,"Marcelo Clemente",25,124,"00:01:07.417",58.58]
[11,"Marcelo Clemente",25,124,"00:01:08.091",58]
[11,"Marcelo Clemente",25,124,"00:01:07.470",58.53]
[11,"Marcelo Clemente",25,124,"00:01:07.397",58.6]
[11,"Marcelo Clemente",25,124,"00:01:07.997",58.08]
[11,"Daniel Nahum",24,116,"00:04:54.578",13.41]
[11,"Daniel Nahum",24,116,"00:01:08.672",57.51]
[11,"Daniel Nahum",24,116,"00:01:06.794",59.13]
[11,"Daniel Nahum",24,116,"00:01:06.630",59.27]
[11,"Daniel Nahum",24,116,"00:01:06.857",59.07]
[11,"Daniel Nahum",24,116,"00:01:06.881",59.05]
[11,"Daniel Nahum",24,116,"00:01:06.804",59.12]
[11,"Daniel Nahum",24,116,"00:01:06.506",59.38]
[11,"Daniel Nahum",24,116,"00:01:07.408",58.59]
[11,"Daniel Nahum",24,116,"00:01:24.718",46.62]
[11,"Daniel Nahum",24,116,"00:01:06.662",59.24]
[11,"Daniel Nahum",24,116,"00:01:06.402",59.47]
[11,"Daniel Nahum",24,116,"00:01:06.367",59.51]
[11,"Daniel Nahum",24,116,"00:01:06.814",59.11]
[11,"Daniel Nahum",24,116,"00:01:07.241",58.73]
[11,"Daniel Nahum",24,116,"00:01:06.558",59.33]
[11,"Daniel Nahum",24,116,"00:01:06.518",59.37]
[11,"Daniel Nahum",24,116,"00:01:06.365",59.51]
[11,"Daniel Nahum",24,116,"00:01:06.528",59.36]
[11,"Daniel Nahum",24,116,"00:01:06.526",59.36]
[11,"Daniel Nahum",24,116,"00:01:07.122",58.84]
[11,"Daniel Nahum",24,116,"00:01:06.283",59.58]
[11,"Daniel Nahum",24,116,"00:01:06.027",59.81]
[11,"Daniel Nahum",24,116,"00:01:06.517",59.37]
[11,"Roberta Epifânio",23,118,"00:01:21.241",48.61]
[11,"Roberta Epifânio",23,118,"00:01:15.965",51.99]
[11,"Roberta Epifânio",23,118,"00:01:15.195",52.52]
[11,"Roberta Epifânio",23,118,"00:01:16.262",51.78]
[11,"Roberta Epifânio",23,118,"00:01:16.968",51.31]
[11,"Roberta Epifânio",23,118,"00:01:16.338",51.73]
[11,"Roberta Epifânio",23,118,"00:01:15.730",52.15]
[11,"Roberta Epifânio",23,118,"00:01:21.312",48.57]
[11,"Roberta Epifânio",23,118,"00:01:22.613",47.8]
[11,"Roberta Epifânio",23,118,"00:01:19.310",49.79]
[11,"Roberta Epifânio",23,118,"00:01:16.720",51.48]
[11,"Roberta Epifânio",23,118,"00:01:16.411",51.68]
[11,"Roberta Epifânio",23,118,"00:01:21.318",48.56]
[11,"Roberta Epifânio",23,118,"00:01:21.831",48.26]
[11,"Roberta Epifânio",23,118,"00:01:21.044",48.73]
[11,"Roberta Epifânio",23,118,"00:01:18.587",50.25]
[11,"Roberta Epifânio",23,118,"00:01:17.092",51.23]
[11,"Roberta Epifânio",23,118,"00:01:19.451",49.71]
[11,"Roberta Epifânio",23,118,"00:01:16.886",51.36]
[11,"Roberta Epifânio",23,118,"00:01:21.036",48.73]
[11,"Roberta Epifânio",23,118,"00:01:16.180",51.84]
[11,"Roberta Epifânio",23,118,"00:01:16.815",51.41]
[11,"Roberta Epifânio",23,118,"00:01:17.499",50.96]
[11,"Marcelo Marcondes",11,138,"00:01:10.633",55.91]
[11,"Marcelo Marcondes",11,138,"00:01:08.280",57.84]
[11,"Marcelo Marcondes",11,138,"00:01:07.372",58.62]
[11,"Marcelo Marcondes",11,138,"00:01:06.891",59.04]
[11,"Marcelo Marcondes",11,138,"00:01:07.661",58.37]
[11,"Marcelo Marcondes",11,138,"00:01:06.433",59.45]
[11,"Marcelo Marcondes",11,138,"00:01:06.755",59.16]
[11,"Marcelo Marcondes",11,138,"00:01:06.598",59.3]
[11,"Marcelo Marcondes",11,138,"00:01:06.766",59.15]
[11,"Marcelo Marcondes",11,138,"00:01:06.737",59.18]
[11,"Marcelo Marcondes",11,138,"00:01:06.809",59.11]

{"sheet":"ETAPA 10","index":2,"n_rows":571,"n_cols":12,"rows_kept":571,"cut":false,"hidden":false,"merged":[[0,0,0,6]]}
["Obs.: Selecione até 3 pilotos colocando na frente do seu nome os números 1, 2 e 3.",null,null,null,null,null,null,"PILOTO",{"$f":"J52","v":"Marcelo Marcondes"},{"$f":"K52","v":"Wesley Canuto"},{"$f":"L52","v":"Maurício Júnior"}]
[1,"Marcelo Marcondes",null,null,null,null,null,"MÉDIA",{"$f":"AVERAGE(J53:J97)","v":"00:00:55.923"},{"$f":"AVERAGE(K53:K97)","v":"00:00:55.988"},{"$f":"AVERAGE(L53:L97)","v":"00:00:56.088"}]
[2,"Wesley Canuto",null,null,null,null,null,"MAXIMA",{"$f":"LARGE(J53:J97,1)","v":"00:01:01.663"},{"$f":"LARGE(K53:K97,1)","v":"00:01:03.494"},{"$f":"LARGE(L53:L97,1)","v":"00:01:03.837"}]
[3,"Maurício Júnior",null,null,null,null,null,"MÍNIMA",{"$f":"SMALL(J53:J97,1)","v":"00:00:55.380"},{"$f":"SMALL(K53:K97,1)","v":"00:00:55.403"},{"$f":"SMALL(L53:L97,1)","v":"00:00:55.510"}]
[null,"Daniel Nahum",null,null,null,null,null,"Desvio Padrão",{"$f":"_xlfn.STDEV.S(J53:J97)","v":"00:00:01.082"},{"$f":"_xlfn.STDEV.S(K53:K97)","v":"00:00:01.369"},{"$f":"_xlfn.STDEV.S(L53:L97)","v":"00:00:01.423"}]
[null,"Alexandre Melillo",null,null,null,null,null,"TEMPO TOTAL",{"$f":"SUM(J53:J97,1)","v":1.0213594444444445},{"$f":"SUM(K53:K97,1)","v":1.0213843402777778},{"$f":"SUM(L53:L97,1)","v":1.0214224421296296}]
[null,"Marcelo Pereira"]
[null,"Marcelo Campos"]
[null,"Jarbas Reis"]
[null,"Vitor Gatti"]
[null,"Frederico Papatella"]
[null,"Renato Amaral"]
[null,"Rodrigo Ricardo",null,null,null,null,null,null,null,null,{"$f":"SMALL(I4:K4,1)-L13","v":"00:00:55.380"}]
[null,"Felipe Bouhid",null,null,null,null,null,null,null,null,{"$f":"LARGE(I3:K3,1)+L13","v":"00:01:03.837"}]
[null,"Jucimar Vieira"]
[null,"Hélio Chagas"]
[null,"Marcelo Chagas"]
[]
[]
[]
[]
[]
[]
[]
[]
[]
[]
[]
[]
[]
[]
[1]
[]
[]
[]
[]
[]
[]
[]
[]
[]
[]
[]
[]
[]
[]
[]
[]
[]
["ETAPA","PILOTO","NÚMERO VOLTAS","KART","Volta Tm","velocidade Media",null,null,null,{"$f":"MATCH(J52,$B$51:$B$1500,0)","v":1},{"$f":"MATCH(K52,$B$51:$B$1500,0)","v":34},67]
[10,"Marcelo Marcondes",33,114,"00:01:01.663",57.56,null,null,null,{"$f":"VLOOKUP(J$52,$B$50:$F$1500,2,FALSE)","v":33},{"$f":"VLOOKUP(K$52,$B$50:$F$1500,2,FALSE)","v":33},{"$f":"VLOOKUP(L$52,$B$50:$F$1500,2,FALSE)","v":33}]
[10,"Marcelo Marcondes",33,114,"00:00:57.134",62.13,null,null,"VOLTA",{"$f":"VLOOKUP(1,$A$2:$B$36,2,FALSE)","v":"Marcelo Marcondes"},{"$f":"VLOOKUP(2,$A$2:$B$36,2,FALSE)","v":"Wesley Canuto"},{"$f":"VLOOKUP(3,$A$2:$B$36,2,FALSE)","v":"Maurício Júnior"}]
[10,"Marcelo Marcondes",33,114,"00:00:56.383",62.96,null,null,1,{"$f":"OFFSET($E$51:$E$1500,J50-1,,J51)","v":"00:01:01.663"},{"$f":"OFFSET($E$51:$E$1500,K50-1,,K51)","v":"00:01:03.494"},{"$f":"OFFSET($E$51:$E$1500,L50-1,,L51)","v":"00:01:03.837"}]
[10,"Marcelo Marcondes",33,114,"00:00:56.460",62.87,null,null,2,"00:00:57.134","00:00:56.219","00:00:56.293"]
[10,"Marcelo Marcondes",33,114,"00:00:55.872",63.53,null,null,3,"00:00:56.383","00:00:56.388","00:00:57.259"]
[10,"Marcelo Marcondes",33,114,"00:00:55.841",63.57,null,null,4,"00:00:56.460","00:00:56.359","00:00:56.028"]
[10,"Marcelo Marcondes",33,114,"00:00:55.642",63.79,null,null,5,"00:00:55.872","00:00:55.834","00:00:55.942"]
[10,"Marcelo Marcondes",33,114,"00:00:55.650",63.78,null,null,6,"00:00:55.841","00:00:55.843","00:00:55.871"]
[10,"Marcelo Marcondes",33,114,"00:00:55.629",63.81,null,null,7,"00:00:55.642","00:00:55.643","00:00:55.690"]
[10,"Marcelo Marcondes",33,114,"00:00:55.731",63.69,null,null,8,"00:00:55.650","00:00:55.647","00:00:55.920"]
[10,"Marcelo Marcondes",33,114,"00:00:55.643",63.79,null,null,9,"00:00:55.629","00:00:55.628","00:00:55.763"]
[10,"Marcelo Marcondes",33,114,"00:00:55.618",63.82,null,null,10,"00:00:55.731","00:00:55.736","00:00:56.037"]
[10,"Marcelo Marcondes",33,114,"00:00:55.799",63.61,null,null,11,"00:00:55.643","00:00:55.639","00:00:55.824"]
[10,"Marcelo Marcondes",33,114,"00:00:55.560",63.89,null,null,12,"00:00:55.618","00:00:55.629","00:00:55.811"]
[10,"Marcelo Marcondes",33,114,"00:00:55.454",64.010000000000005,null,null,13,"00:00:55.799","00:00:55.789","00:00:55.819"]
[10,"Marcelo Marcondes",33,114,"00:00:55.512",63.94,null,null,14,"00:00:55.560","00:00:55.578","00:00:55.771"]
[10,"Marcelo Marcondes",33,114,"00:00:55.680",63.75,null,null,15,"00:00:55.454","00:00:55.436","00:00:55.938"]
[10,"Marcelo Marcondes",33,114,"00:00:55.578",63.87,null,null,16,"00:00:55.512","00:00:55.510","00:00:55.731"]
[10,"Marcelo Marcondes",33,114,"00:00:55.640",63.8,null,null,17,"00:00:55.680","00:00:55.682","00:00:55.775"]
[10,"Marcelo Marcondes",33,114,"00:00:55.571",63.88,null,null,18,"00:00:55.578","00:00:55.584","00:00:55.837"]
[10,"Marcelo Marcondes",33,114,"00:00:55.622",63.82,null,null,19,"00:00:55.640","00:00:55.720","00:00:55.867"]
[10,"Marcelo Marcondes",33,114,"00:00:55.645",63.79,null,null,20,"00:00:55.571","00:00:55.487","00:00:55.800"]
[10,"Marcelo Marcondes",33,114,"00:00:55.618",63.82,null,null,21,"00:00:55.622","00:00:55.650","00:00:55.986"]
[10,"Marcelo Marcondes",33,114,"00:00:55.380",64.099999999999994,null,null,22,"00:00:55.645","00:00:55.618","00:00:55.748"]
[10,"Marcelo Marcondes",33,114,"00:00:55.539",63.91,null,null,23,"00:00:55.618","00:00:55.615","00:00:55.638"]
[10,"Marcelo Marcondes",33,114,"00:00:55.500",63.96,null,null,24,"00:00:55.380","00:00:55.403","00:00:55.635"]
[10,"Marcelo Marcondes",33,114,"00:00:55.690",63.74,null,null,25,"00:00:55.539","00:00:55.539","00:00:55.622"]
[10,"Marcelo Marcondes",33,114,"00:00:55.791",63.62,null,null,26,"00:00:55.500","00:00:55.622","00:00:55.605"]
[10,"Marcelo Marcondes",33,114,"00:00:55.723",63.7,null,null,27,"00:00:55.690","00:00:56.121","00:00:55.510"]
[10,"Marcelo Marcondes",33,114,"00:00:55.673",63.76,null,null,28,"00:00:55.791","00:00:56.002","00:00:55.911"]
[10,"Marcelo Marcondes",33,114,"00:00:55.707",63.72,null,null,29,"00:00:55.723","00:00:55.939","00:00:55.799"]
[10,"Marcelo Marcondes",33,114,"00:00:55.855",63.55,null,null,30,"00:00:55.673","00:00:55.850","00:00:55.542"]
[10,"Marcelo Marcondes",33,114,"00:00:55.653",63.78,null,null,31,"00:00:55.707","00:00:55.787","00:00:55.728"]
[10,"Wesley Canuto",33,111,"00:01:03.494",55.9,null,null,32,"00:00:55.855","00:00:55.852","00:00:55.581"]
[10,"Wesley Canuto",33,111,"00:00:56.219",63.14,null,null,33,"00:00:55.653","00:00:55.764","00:00:55.781"]
[10,"Wesley Canuto",33,111,"00:00:56.388",62.95,null,null,34]
[10,"Wesley Canuto",33,111,"00:00:56.359",62.98,null,null,35]
[10,"Wesley Canuto",33,111,"00:00:55.834",63.57,null,null,36]
[10,"Wesley Canuto",33,111,"00:00:55.843",63.56,null,null,37]
[10,"Wesley Canuto",33,111,"00:00:55.643",63.79,null,null,38]
[10,"Wesley Canuto",33,111,"00:00:55.647",63.79,null,null,39]
[10,"Wesley Canuto",33,111,"00:00:55.628",63.81,null,null,40]
[10,"Wesley Canuto",33,111,"00:00:55.736",63.69,null,null,41]
[10,"Wesley Canuto",33,111,"00:00:55.639",63.8,null,null,42]
[10,"Wesley Canuto",33,111,"00:00:55.629",63.81,null,null,43]
[10,"Wesley Canuto",33,111,"00:00:55.789",63.63,null,null,44]
[10,"Wesley Canuto",33,111,"00:00:55.578",63.87,null,null,45]
[10,"Wesley Canuto",33,111,"00:00:55.436",64.03]
[10,"Wesley Canuto",33,111,"00:00:55.510",63.95]
[10,"Wesley Canuto",33,111,"00:00:55.682",63.75]
[10,"Wesley Canuto",33,111,"00:00:55.584",63.86]
[10,"Wesley Canuto",33,111,"00:00:55.720",63.7]
[10,"Wesley Canuto",33,111,"00:00:55.487",63.97]
[10,"Wesley Canuto",33,111,"00:00:55.650",63.78]
[10,"Wesley Canuto",33,111,"00:00:55.618",63.82]
[10,"Wesley Canuto",33,111,"00:00:55.615",63.82]
[10,"Wesley Canuto",33,111,"00:00:55.403",64.069999999999993]
[10,"Wesley Canuto",33,111,"00:00:55.539",63.91]
[10,"Wesley Canuto",33,111,"00:00:55.622",63.82]
[10,"Wesley Canuto",33,111,"00:00:56.121",63.25]
[10,"Wesley Canuto",33,111,"00:00:56.002",63.38]
[10,"Wesley Canuto",33,111,"00:00:55.939",63.45]
[10,"Wesley Canuto",33,111,"00:00:55.850",63.56]
[10,"Wesley Canuto",33,111,"00:00:55.787",63.63]
[10,"Wesley Canuto",33,111,"00:00:55.852",63.55]
[10,"Wesley Canuto",33,111,"00:00:55.764",63.65]
[10,"Maurício Júnior",33,154,"00:01:03.837",55.6]
[10,"Maurício Júnior",33,154,"00:00:56.293",63.06]
[10,"Maurício Júnior",33,154,"00:00:57.259",61.99]
[10,"Maurício Júnior",33,154,"00:00:56.028",63.35]
[10,"Maurício Júnior",33,154,"00:00:55.942",63.45]
[10,"Maurício Júnior",33,154,"00:00:55.871",63.53]
[10,"Maurício Júnior",33,154,"00:00:55.690",63.74]
[10,"Maurício Júnior",33,154,"00:00:55.920",63.48]
[10,"Maurício Júnior",33,154,"00:00:55.763",63.66]
[10,"Maurício Júnior",33,154,"00:00:56.037",63.34]
[10,"Maurício Júnior",33,154,"00:00:55.824",63.59]
[10,"Maurício Júnior",33,154,"00:00:55.811",63.6]
[10,"Maurício Júnior",33,154,"00:00:55.819",63.59]
[10,"Maurício Júnior",33,154,"00:00:55.771",63.65]
[10,"Maurício Júnior",33,154,"00:00:55.938",63.46]
[10,"Maurício Júnior",33,154,"00:00:55.731",63.69]
[10,"Maurício Júnior",33,154,"00:00:55.775",63.64]
[10,"Maurício Júnior",33,154,"00:00:55.837",63.57]
[10,"Maurício Júnior",33,154,"00:00:55.867",63.54]
[10,"Maurício Júnior",33,154,"00:00:55.800",63.61]
[10,"Maurício Júnior",33,154,"00:00:55.986",63.4]
[10,"Maurício Júnior",33,154,"00:00:55.748",63.67]
[10,"Maurício Júnior",33,154,"00:00:55.638",63.8]
[10,"Maurício Júnior",33,154,"00:00:55.635",63.8]
[10,"Maurício Júnior",33,154,"00:00:55.622",63.82]
[10,"Maurício Júnior",33,154,"00:00:55.605",63.84]
[10,"Maurício Júnior",33,154,"00:00:55.510",63.95]
[10,"Maurício Júnior",33,154,"00:00:55.911",63.49]
[10,"Maurício Júnior",33,154,"00:00:55.799",63.61]
[10,"Maurício Júnior",33,154,"00:00:55.542",63.91]
[10,"Maurício Júnior",33,154,"00:00:55.728",63.7]
[10,"Maurício Júnior",33,154,"00:00:55.581",63.86]
[10,"Maurício Júnior",33,154,"00:00:55.781",63.63]
[10,"Daniel Nahum",33,104,"00:01:04.382",55.13]
[10,"Daniel Nahum",33,104,"00:00:58.201",60.99]
[10,"Daniel Nahum",33,104,"00:00:56.952",62.33]
[10,"Daniel Nahum",33,104,"00:00:56.638",62.67]
[10,"Daniel Nahum",33,104,"00:00:56.416",62.92]
[10,"Daniel Nahum",33,104,"00:00:56.094",63.28]
[10,"Daniel Nahum",33,104,"00:00:55.886",63.52]
[10,"Daniel Nahum",33,104,"00:00:55.650",63.78]
[10,"Daniel Nahum",33,104,"00:00:56.401",62.94]
[10,"Daniel Nahum",33,104,"00:00:56.964",62.31]
[10,"Daniel Nahum",33,104,"00:00:55.798",63.62]
[10,"Daniel Nahum",33,104,"00:00:56.003",63.38]
[10,"Daniel Nahum",33,104,"00:00:56.067",63.31]
[10,"Daniel Nahum",33,104,"00:00:55.874",63.53]
[10,"Daniel Nahum",33,104,"00:00:55.919",63.48]
[10,"Daniel Nahum",33,104,"00:00:55.894",63.51]
[10,"Daniel Nahum",33,104,"00:00:55.982",63.41]
[10,"Daniel Nahum",33,104,"00:00:55.662",63.77]
[10,"Daniel Nahum",33,104,"00:00:55.673",63.76]
[10,"Daniel Nahum",33,104,"00:00:55.647",63.79]
[10,"Daniel Nahum",33,104,"00:00:55.547",63.9]
[10,"Daniel Nahum",33,104,"00:00:55.520",63.93]
[10,"Daniel Nahum",33,104,"00:00:56.069",63.31]
[10,"Daniel Nahum",33,104,"00:00:55.895",63.5]
[10,"Daniel Nahum",33,104,"00:00:55.638",63.8]
[10,"Daniel Nahum",33,104,"00:00:56.099",63.27]
[10,"Daniel Nahum",33,104,"00:00:55.763",63.66]
[10,"Daniel Nahum",33,104,"00:00:55.746",63.67]
[10,"Daniel Nahum",33,104,"00:00:55.677",63.75]
[10,"Daniel Nahum",33,104,"00:00:55.937",63.46]
[10,"Daniel Nahum",33,104,"00:00:55.695",63.73]
[10,"Daniel Nahum",33,104,"00:00:55.883",63.52]
[10,"Daniel Nahum",33,104,"00:00:56.050",63.33]
[10,"Alexandre Melillo",33,101,"00:01:02.932",56.4]
[10,"Alexandre Melillo",33,101,"00:00:57.367",61.88]
[10,"Alexandre Melillo",33,101,"00:00:56.847",62.44]
[10,"Alexandre Melillo",33,101,"00:00:56.039",63.34]
[10,"Alexandre Melillo",33,101,"00:00:56.278",63.07]
[10,"Alexandre Melillo",33,101,"00:00:56.042",63.34]
[10,"Alexandre Melillo",33,101,"00:00:56.280",63.07]
[10,"Alexandre Melillo",33,101,"00:00:56.123",63.25]
[10,"Alexandre Melillo",33,101,"00:00:56.978",62.3]
[10,"Alexandre Melillo",33,101,"00:00:57.266",61.98]
[10,"Alexandre Melillo",33,101,"00:00:56.832",62.46]
[10,"Alexandre Melillo",33,101,"00:00:56.028",63.35]
[10,"Alexandre Melillo",33,101,"00:00:56.001",63.38]
[10,"Alexandre Melillo",33,101,"00:00:55.662",63.77]
[10,"Alexandre Melillo",33,101,"00:00:56.032",63.35]
[10,"Alexandre Melillo",33,101,"00:00:56.087",63.29]
[10,"Alexandre Melillo",33,101,"00:00:55.856",63.55]
[10,"Alexandre Melillo",33,101,"00:00:55.708",63.72]
[10,"Alexandre Melillo",33,101,"00:00:55.761",63.66]
[10,"Alexandre Melillo",33,101,"00:00:55.799",63.61]
[10,"Alexandre Melillo",33,101,"00:00:55.778",63.64]
[10,"Alexandre Melillo",33,101,"00:00:55.619",63.82]
[10,"Alexandre Melillo",33,101,"00:00:55.906",63.49]
[10,"Alexandre Melillo",33,101,"00:00:55.935",63.46]
[10,"Alexandre Melillo",33,101,"00:00:55.780",63.64]
[10,"Alexandre Melillo",33,101,"00:00:55.998",63.39]
[10,"Alexandre Melillo",33,101,"00:00:55.796",63.62]
[10,"Alexandre Melillo",33,101,"00:00:55.795",63.62]
[10,"Alexandre Melillo",33,101,"00:00:55.874",63.53]
[10,"Alexandre Melillo",33,101,"00:00:56.034",63.35]
[10,"Alexandre Melillo",33,101,"00:00:56.182",63.18]
[10,"Alexandre Melillo",33,101,"00:00:56.221",63.14]
[10,"Alexandre Melillo",33,101,"00:00:56.171",63.19]
[10,"Marcelo Pereira",33,125,"00:01:04.325",55.18]
[10,"Marcelo Pereira",33,125,"00:00:57.948",61.25]
[10,"Marcelo Pereira",33,125,"00:00:56.878",62.41]
[10,"Marcelo Pereira",33,125,"00:00:56.196",63.16]
[10,"Marcelo Pereira",33,125,"00:00:56.070",63.31]
[10,"Marcelo Pereira",33,125,"00:00:56.280",63.07]
[10,"Marcelo Pereira",33,125,"00:00:56.033",63.35]
[10,"Marcelo Pereira",33,125,"00:00:56.223",63.13]
[10,"Marcelo Pereira",33,125,"00:00:56.812",62.48]
[10,"Marcelo Pereira",33,125,"00:00:56.952",62.33]
[10,"Marcelo Pereira",33,125,"00:00:56.070",63.31]
[10,"Marcelo Pereira",33,125,"00:00:56.007",63.38]
[10,"Marcelo Pereira",33,125,"00:00:56.065",63.31]
[10,"Marcelo Pereira",33,125,"00:00:55.872",63.53]
[10,"Marcelo Pereira",33,125,"00:00:55.930",63.47]
[10,"Marcelo Pereira",33,125,"00:00:55.829",63.58]
[10,"Marcelo Pereira",33,125,"00:00:55.791",63.62]
[10,"Marcelo Pereira",33,125,"00:00:55.874",63.53]
[10,"Marcelo Pereira",33,125,"00:00:55.672",63.76]
[10,"Marcelo Pereira",33,125,"00:00:55.638",63.8]
[10,"Marcelo Pereira",33,125,"00:00:55.657",63.78]
[10,"Marcelo Pereira",33,125,"00:00:55.568",63.88]
[10,"Marcelo Pereira",33,125,"00:00:56.089",63.29]
[10,"Marcelo Pereira",33,125,"00:00:56.099",63.27]
[10,"Marcelo Pereira",33,125,"00:00:55.693",63.74]
[10,"Marcelo Pereira",33,125,"00:00:55.824",63.59]
[10,"Marcelo Pereira",33,125,"00:00:55.760",63.66]
[10,"Marcelo Pereira",33,125,"00:00:55.749",63.67]
[10,"Marcelo Pereira",33,125,"00:00:55.674",63.76]
[10,"Marcelo Pereira",33,125,"00:00:55.939",63.45]
[10,"Marcelo Pereira",33,125,"00:00:55.695",63.73]
[10,"Marcelo Pereira",33,125,"00:00:59.031",60.13]
[10,"Marcelo Pereira",33,125,"00:00:56.467",62.86]
[10,"Marcelo Campos",33,131,"00:01:04.760",54.81]
[10,"Marcelo Campos",33,131,"00:00:57.503",61.73]
[10,"Marcelo Campos",33,131,"00:00:56.583",62.73]
[10,"Marcelo Campos",33,131,"00:00:56.286",63.06]
[10,"Marcelo Campos",33,131,"00:00:56.047",63.33]
[10,"Marcelo Campos",33,131,"00:00:56.498",62.83]
[10,"Marcelo Campos",33,131,"00:00:56.267",63.08]
[10,"Marcelo Campos",33,131,"00:00:56.438",62.89]
[10,"Marcelo Campos",33,131,"00:00:56.844",62.44]
[10,"Marcelo Campos",33,131,"00:00:56.695",62.61]
[10,"Marcelo Campos",33,131,"00:00:56.070",63.31]
[10,"Marcelo Campos",33,131,"00:00:56.015",63.37]
[10,"Marcelo Campos",33,131,"00:00:56.058",63.32]
[10,"Marcelo Campos",33,131,"00:00:55.874",63.53]
[10,"Marcelo Campos",33,131,"00:00:55.928",63.47]
[10,"Marcelo Campos",33,131,"00:00:55.827",63.58]
[10,"Marcelo Campos",33,131,"00:00:55.798",63.62]
[10,"Marcelo Campos",33,131,"00:00:55.875",63.53]
[10,"Marcelo Campos",33,131,"00:00:55.668",63.76]
[10,"Marcelo Campos",33,131,"00:00:55.634",63.8]
[10,"Marcelo Campos",33,131,"00:00:55.914",63.48]
[10,"Marcelo Campos",33,131,"00:00:55.644",63.79]
[10,"Marcelo Campos",33,131,"00:00:56.299",63.05]
[10,"Marcelo Campos",33,131,"00:00:56.059",63.32]
[10,"Marcelo Campos",33,131,"00:00:55.765",63.65]
[10,"Marcelo Campos",33,131,"00:00:55.701",63.73]
[10,"Marcelo Campos",33,131,"00:00:55.865",63.54]
[10,"Marcelo Campos",33,131,"00:00:55.611",63.83]
[10,"Marcelo Campos",33,131,"00:00:55.868",63.54]
[10,"Marcelo Campos",33,131,"00:00:55.755",63.66]
[10,"Marcelo Campos",33,131,"00:00:55.797",63.62]
[10,"Marcelo Campos",33,131,"00:01:03.204",56.16]
[10,"Marcelo Campos",33,131,"00:00:56.805",62.49]
[10,"Jarbas Reis",33,118,"00:01:02.650",56.66]
[10,"Jarbas Reis",33,118,"00:00:56.330",63.01]
[10,"Jarbas Reis",33,118,"00:00:56.859",62.43]
[10,"Jarbas Reis",33,118,"00:00:56.463",62.87]
[10,"Jarbas Reis",33,118,"00:00:55.962",63.43]
[10,"Jarbas Reis",33,118,"00:00:56.473",62.85]
[10,"Jarbas Reis",33,118,"00:00:55.902",63.5]
[10,"Jarbas Reis",33,118,"00:00:56.143",63.22]
[10,"Jarbas Reis",33,118,"00:00:56.437",62.89]
[10,"Jarbas Reis",33,118,"00:00:56.261",63.09]
[10,"Jarbas Reis",33,118,"00:00:56.396",62.94]
[10,"Jarbas Reis",33,118,"00:00:56.175",63.19]
[10,"Jarbas Reis",33,118,"00:00:55.941",63.45]
[10,"Jarbas Reis",33,118,"00:00:56.132",63.24]
[10,"Jarbas Reis",33,118,"00:00:56.074",63.3]
[10,"Jarbas Reis",33,118,"00:00:56.093",63.28]
[10,"Jarbas Reis",33,118,"00:00:56.049",63.33]
[10,"Jarbas Reis",33,118,"00:00:56.088",63.29]
[10,"Jarbas Reis",33,118,"00:00:56.235",63.12]
[10,"Jarbas Reis",33,118,"00:00:56.172",63.19]
[10,"Jarbas Reis",33,118,"00:00:56.154",63.21]
[10,"Jarbas Reis",33,118,"00:00:56.149",63.22]
[10,"Jarbas Reis",33,118,"00:00:56.898",62.39]
[10,"Jarbas Reis",33,118,"00:00:55.728",63.7]
[10,"Jarbas Reis",33,118,"00:00:55.974",63.42]
[10,"Jarbas Reis",33,118,"00:00:55.656",63.78]
[10,"Jarbas Reis",33,118,"00:00:55.972",63.42]
[10,"Jarbas Reis",33,118,"00:00:55.689",63.74]
[10,"Jarbas Reis",33,118,"00:00:55.720",63.7]
[10,"Jarbas Reis",33,118,"00:00:55.819",63.59]
[10,"Jarbas Reis",33,118,"00:00:55.696",63.73]
[10,"Jarbas Reis",33,118,"00:01:09.474",51.09]
[10,"Jarbas Reis",33,118,"00:00:57.166",62.09]
[10,"Vitor Gatti",33,124,"00:01:04.638",54.92]
[10,"Vitor Gatti",33,124,"00:00:57.391",61.85]
[10,"Vitor Gatti",33,124,"00:00:56.886",62.4]
[10,"Vitor Gatti",33,124,"00:00:56.369",62.97]
[10,"Vitor Gatti",33,124,"00:00:56.925",62.36]
[10,"Vitor Gatti",33,124,"00:00:56.993",62.28]
[10,"Vitor Gatti",33,124,"00:00:56.303",63.04]
[10,"Vitor Gatti",33,124,"00:00:56.092",63.28]
[10,"Vitor Gatti",33,124,"00:00:56.371",62.97]
[10,"Vitor Gatti",33,124,"00:00:56.768",62.53]
[10,"Vitor Gatti",33,124,"00:00:57.059",62.21]
[10,"Vitor Gatti",33,124,"00:00:56.910",62.37]
[10,"Vitor Gatti",33,124,"00:00:56.454",62.88]
[10,"Vitor Gatti",33,124,"00:00:56.421",62.91]
[10,"Vitor Gatti",33,124,"00:00:56.342",63]
[10,"Vitor Gatti",33,124,"00:00:56.401",62.94]
[10,"Vitor Gatti",33,124,"00:00:56.606",62.71]
[10,"Vitor Gatti",33,124,"00:00:56.539",62.78]
[10,"Vitor Gatti",33,124,"00:00:56.554",62.76]
[10,"Vitor Gatti",33,124,"00:00:56.236",63.12]
[10,"Vitor Gatti",33,124,"00:00:56.439",62.89]
[10,"Vitor Gatti",33,124,"00:00:56.273",63.08]
[10,"Vitor Gatti",33,124,"00:00:56.406",62.93]
[10,"Vitor Gatti",33,124,"00:00:56.291",63.06]
[10,"Vitor Gatti",33,124,"00:00:56.112",63.26]
[10,"Vitor Gatti",33,124,"00:00:56.604",62.71]
[10,"Vitor Gatti",33,124,"00:00:56.388",62.95]
[10,"Vitor Gatti",33,124,"00:00:56.275",63.08]
[10,"Vitor Gatti",33,124,"00:00:57.907",61.3]
[10,"Vitor Gatti",33,124,"00:00:56.710",62.59]
[10,"Vitor Gatti",33,124,"00:00:56.327",63.02]
[10,"Vitor Gatti",33,124,"00:00:56.415",62.92]
[10,"Vitor Gatti",33,124,"00:00:56.576",62.74]
[10,"Frederico Papatella",33,102,"00:01:04.003",55.46]
[10,"Frederico Papatella",33,102,"00:00:58.286",60.9]
[10,"Frederico Papatella",33,102,"00:00:57.584",61.64]
[10,"Frederico Papatella",33,102,"00:00:56.510",62.81]
[10,"Frederico Papatella",33,102,"00:00:58.112",61.08]
[10,"Frederico Papatella",33,102,"00:00:56.801",62.49]
[10,"Frederico Papatella",33,102,"00:00:57.004",62.27]
[10,"Frederico Papatella",33,102,"00:00:56.635",62.68]
[10,"Frederico Papatella",33,102,"00:00:56.795",62.5]
[10,"Frederico Papatella",33,102,"00:00:56.390",62.95]
[10,"Frederico Papatella",33,102,"00:00:56.441",62.89]
[10,"Frederico Papatella",33,102,"00:00:56.062",63.32]
[10,"Frederico Papatella",33,102,"00:00:56.342",63]
[10,"Frederico Papatella",33,102,"00:00:56.309",63.04]
[10,"Frederico Papatella",33,102,"00:00:56.128",63.24]
[10,"Frederico Papatella",33,102,"00:00:56.311",63.04]
[10,"Frederico Papatella",33,102,"00:00:56.639",62.67]
[10,"Frederico Papatella",33,102,"00:00:56.406",62.93]
[10,"Frederico Papatella",33,102,"00:00:56.374",62.97]
[10,"Frederico Papatella",33,102,"00:00:56.274",63.08]
[10,"Frederico Papatella",33,102,"00:00:56.339",63]
[10,"Frederico Papatella",33,102,"00:00:56.339",63]
[10,"Frederico Papatella",33,102,"00:00:56.190",63.17]
[10,"Frederico Papatella",33,102,"00:00:56.342",63]
[10,"Frederico Papatella",33,102,"00:00:56.449",62.88]
[10,"Frederico Papatella",33,102,"00:00:56.867",62.42]
[10,"Frederico Papatella",33,102,"00:00:56.286",63.06]
[10,"Frederico Papatella",33,102,"00:00:56.397",62.94]
[10,"Frederico Papatella",33,102,"00:00:56.662",62.65]
[10,"Frederico Papatella",33,102,"00:00:56.473",62.85]
[10,"Frederico Papatella",33,102,"00:00:56.287",63.06]
[10,"Frederico Papatella",33,102,"00:00:56.363",62.98]
[10,"Frederico Papatella",33,102,"00:00:56.337",63.01]
[10,"Renato Amaral",33,147,"00:01:03.468",55.93]
[10,"Renato Amaral",33,147,"00:00:58.282",60.9]
[10,"Renato Amaral",33,147,"00:00:57.292",61.96]
[10,"Renato Amaral",33,147,"00:00:56.599",62.71]
[10,"Renato Amaral",33,147,"00:00:56.849",62.44]
[10,"Renato Amaral",33,147,"00:00:56.726",62.57]
[10,"Renato Amaral",33,147,"00:00:56.623",62.69]
[10,"Renato Amaral",33,147,"00:00:56.578",62.74]
[10,"Renato Amaral",33,147,"00:00:56.731",62.57]
[10,"Renato Amaral",33,147,"00:00:56.717",62.58]
[10,"Renato Amaral",33,147,"00:00:57.306",61.94]
[10,"Renato Amaral",33,147,"00:00:56.859",62.43]
[10,"Renato Amaral",33,147,"00:00:56.400",62.94]
[10,"Renato Amaral",33,147,"00:00:56.267",63.08]
[10,"Renato Amaral",33,147,"00:00:56.297",63.05]
[10,"Renato Amaral",33,147,"00:00:56.513",62.81]
[10,"Renato Amaral",33,147,"00:00:57.970",61.23]
[10,"Renato Amaral",33,147,"00:00:56.976",62.3]
[10,"Renato Amaral",33,147,"00:00:56.262",63.09]
[10,"Renato Amaral",33,147,"00:00:56.545",62.77]
[10,"Renato Amaral",33,147,"00:00:56.276",63.07]
[10,"Renato Amaral",33,147,"00:00:56.205",63.15]
[10,"Renato Amaral",33,147,"00:00:56.060",63.32]
[10,"Renato Amaral",33,147,"00:00:56.176",63.19]
[10,"Renato Amaral",33,147,"00:00:56.137",63.23]
[10,"Renato Amaral",33,147,"00:00:57.273",61.98]
[10,"Renato Amaral",33,147,"00:00:56.247",63.11]
[10,"Renato Amaral",33,147,"00:00:56.160",63.21]
[10,"Renato Amaral",33,147,"00:00:56.560",62.76]
[10,"Renato Amaral",33,147,"00:00:56.731",62.57]
[10,"Renato Amaral",33,147,"00:00:56.337",63.01]
[10,"Renato Amaral",33,147,"00:00:56.233",63.12]
[10,"Renato Amaral",33,147,"00:00:56.499",62.83]
[10,"Rodrigo Ricardo",33,152,"00:01:02.354",56.93]
[10,"Rodrigo Ricardo",33,152,"00:00:56.906",62.38]
[10,"Rodrigo Ricardo",33,152,"00:00:58.001",61.2]
[10,"Rodrigo Ricardo",33,152,"00:00:56.754",62.54]
[10,"Rodrigo Ricardo",33,152,"00:00:56.490",62.84]
[10,"Rodrigo Ricardo",33,152,"00:00:56.656",62.65]
[10,"Rodrigo Ricardo",33,152,"00:00:56.392",62.95]
[10,"Rodrigo Ricardo",33,152,"00:00:57.064",62.2]
[10,"Rodrigo Ricardo",33,152,"00:00:56.830",62.46]
[10,"Rodrigo Ricardo",33,152,"00:00:57.610",61.61]
[10,"Rodrigo Ricardo",33,152,"00:00:57.412",61.83]
[10,"Rodrigo Ricardo",33,152,"00:00:56.923",62.36]
[10,"Rodrigo Ricardo",33,152,"00:00:56.460",62.87]
[10,"Rodrigo Ricardo",33,152,"00:00:57.013",62.26]
[10,"Rodrigo Ricardo",33,152,"00:00:56.380",62.96]
[10,"Rodrigo Ricardo",33,152,"00:00:56.218",63.14]
[10,"Rodrigo Ricardo",33,152,"00:01:04.358",55.15]
[10,"Rodrigo Ricardo",33,152,"00:00:56.386",62.95]
[10,"Rodrigo Ricardo",33,152,"00:00:56.275",63.08]
[10,"Rodrigo Ricardo",33,152,"00:00:56.166",63.2]
[10,"Rodrigo Ricardo",33,152,"00:00:56.140",63.23]
[10,"Rodrigo Ricardo",33,152,"00:00:56.274",63.08]
[10,"Rodrigo Ricardo",33,152,"00:00:55.964",63.43]
[10,"Rodrigo Ricardo",33,152,"00:00:56.181",63.18]
[10,"Rodrigo Ricardo",33,152,"00:00:56.240",63.12]
[10,"Rodrigo Ricardo",33,152,"00:00:56.182",63.18]
[10,"Rodrigo Ricardo",33,152,"00:00:56.114",63.26]
[10,"Rodrigo Ricardo",33,152,"00:00:56.122",63.25]
[10,"Rodrigo Ricardo",33,152,"00:00:55.886",63.52]
[10,"Rodrigo Ricardo",33,152,"00:00:55.852",63.55]
[10,"Rodrigo Ricardo",33,152,"00:00:55.915",63.48]
[10,"Rodrigo Ricardo",33,152,"00:00:55.978",63.41]
[10,"Rodrigo Ricardo",33,152,"00:00:56.494",62.83]
[10,"Felipe Bouhid",33,121,"00:01:03.889",55.56]
[10,"Felipe Bouhid",33,121,"00:00:58.488",60.69]
[10,"Felipe Bouhid",33,121,"00:00:57.448",61.79]
[10,"Felipe Bouhid",33,121,"00:00:56.948",62.33]
[10,"Felipe Bouhid",33,121,"00:00:57.620",61.6]
[10,"Felipe Bouhid",33,121,"00:00:57.290",61.96]
[10,"Felipe Bouhid",33,121,"00:00:57.728",61.49]
[10,"Felipe Bouhid",33,121,"00:00:56.931",62.35]
[10,"Felipe Bouhid",33,121,"00:00:57.087",62.18]
[10,"Felipe Bouhid",33,121,"00:00:57.121",62.14]
[10,"Felipe Bouhid",33,121,"00:00:57.289",61.96]
[10,"Felipe Bouhid",33,121,"00:00:57.187",62.07]
[10,"Felipe Bouhid",33,121,"00:00:58.553",60.62]
[10,"Felipe Bouhid",33,121,"00:00:58.637",60.54]
[10,"Felipe Bouhid",33,121,"00:00:58.245",60.94]
[10,"Felipe Bouhid",33,121,"00:00:56.721",62.58]
[10,"Felipe Bouhid",33,121,"00:00:56.664",62.64]
[10,"Felipe Bouhid",33,121,"00:00:56.976",62.3]
[10,"Felipe Bouhid",33,121,"00:00:56.981",62.29]
[10,"Felipe Bouhid",33,121,"00:00:56.883",62.4]
[10,"Felipe Bouhid",33,121,"00:00:56.973",62.3]
[10,"Felipe Bouhid",33,121,"00:00:56.708",62.59]
[10,"Felipe Bouhid",33,121,"00:00:56.712",62.59]
[10,"Felipe Bouhid",33,121,"00:00:56.749",62.55]
[10,"Felipe Bouhid",33,121,"00:00:56.608",62.7]
[10,"Felipe Bouhid",33,121,"00:00:56.461",62.87]
[10,"Felipe Bouhid",33,121,"00:00:56.800",62.49]
[10,"Felipe Bouhid",33,121,"00:00:57.689",61.53]
[10,"Felipe Bouhid",33,121,"00:00:58.500",60.68]
[10,"Felipe Bouhid",33,121,"00:00:57.326",61.92]
[10,"Felipe Bouhid",33,121,"00:00:56.971",62.31]
[10,"Felipe Bouhid",33,121,"00:00:57.357",61.89]
[10,"Felipe Bouhid",33,121,"00:00:57.122",62.14]
[10,"Jucimar Vieira",33,130,"00:01:03.944",55.51]
[10,"Jucimar Vieira",33,130,"00:00:58.900",60.26]
[10,"Jucimar Vieira",33,130,"00:00:57.509",61.72]
[10,"Jucimar Vieira",33,130,"00:00:57.215",62.04]
[10,"Jucimar Vieira",33,130,"00:00:57.133",62.13]
[10,"Jucimar Vieira",33,130,"00:00:57.040",62.23]
[10,"Jucimar Vieira",33,130,"00:00:57.275",61.97]
[10,"Jucimar Vieira",33,130,"00:00:57.530",61.7]
[10,"Jucimar Vieira",33,130,"00:00:57.490",61.74]
[10,"Jucimar Vieira",33,130,"00:00:58.056",61.14]
[10,"Jucimar Vieira",33,130,"00:00:56.886",62.4]
[10,"Jucimar Vieira",33,130,"00:00:56.792",62.5]
[10,"Jucimar Vieira",33,130,"00:00:57.232",62.02]
[10,"Jucimar Vieira",33,130,"00:00:58.818",60.35]
[10,"Jucimar Vieira",33,130,"00:00:57.186",62.07]
[10,"Jucimar Vieira",33,130,"00:00:57.098",62.17]
[10,"Jucimar Vieira",33,130,"00:00:56.731",62.57]
[10,"Jucimar Vieira",33,130,"00:00:58.318",60.87]
[10,"Jucimar Vieira",33,130,"00:00:56.694",62.61]
[10,"Jucimar Vieira",33,130,"00:00:56.862",62.42]
[10,"Jucimar Vieira",33,130,"00:00:56.693",62.61]
[10,"Jucimar Vieira",33,130,"00:00:56.510",62.81]
[10,"Jucimar Vieira",33,130,"00:00:56.549",62.77]
[10,"Jucimar Vieira",33,130,"00:00:56.738",62.56]
[10,"Jucimar Vieira",33,130,"00:00:56.720",62.58]
[10,"Jucimar Vieira",33,130,"00:00:56.550",62.77]
[10,"Jucimar Vieira",33,130,"00:00:56.963",62.31]
[10,"Jucimar Vieira",33,130,"00:00:57.438",61.8]
[10,"Jucimar Vieira",33,130,"00:00:58.434",60.75]
[10,"Jucimar Vieira",33,130,"00:00:58.821",60.35]
[10,"Jucimar Vieira",33,130,"00:00:56.935",62.34]
[10,"Jucimar Vieira",33,130,"00:00:56.795",62.5]
[10,"Jucimar Vieira",33,130,"00:00:56.544",62.78]
[10,"Hélio Chagas",31,155,"00:01:04.870",54.72]
[10,"Hélio Chagas",31,155,"00:00:58.016",61.18]
[10,"Hélio Chagas",31,155,"00:00:57.637",61.59]
[10,"Hélio Chagas",31,155,"00:00:57.411",61.83]
[10,"Hélio Chagas",31,155,"00:00:57.246",62.01]
[10,"Hélio Chagas",31,155,"00:00:57.564",61.66]
[10,"Hélio Chagas",31,155,"00:00:57.343",61.9]
[10,"Hélio Chagas",31,155,"00:00:57.431",61.81]
[10,"Hélio Chagas",31,155,"00:00:57.784",61.43]
[10,"Hélio Chagas",31,155,"00:00:57.071",62.2]
[10,"Hélio Chagas",31,155,"00:00:56.962",62.32]
[10,"Hélio Chagas",31,155,"00:00:56.839",62.45]
[10,"Hélio Chagas",31,155,"00:00:56.988",62.29]
[10,"Hélio Chagas",31,155,"00:00:56.450",62.88]
[10,"Hélio Chagas",31,155,"00:00:56.760",62.54]
[10,"Hélio Chagas",31,155,"00:00:56.701",62.6]
[10,"Hélio Chagas",31,155,"00:00:57.202",62.05]
[10,"Hélio Chagas",31,155,"00:00:56.893",62.39]
[10,"Hélio Chagas",31,155,"00:00:57.067",62.2]
[10,"Hélio Chagas",31,155,"00:00:56.945",62.33]
[10,"Hélio Chagas",31,155,"00:00:57.119",62.14]
[10,"Hélio Chagas",31,155,"00:00:57.112",62.15]
[10,"Hélio Chagas",31,155,"00:00:57.230",62.02]
[10,"Hélio Chagas",31,155,"00:00:56.969",62.31]
[10,"Hélio Chagas",31,155,"00:00:57.430",61.81]
[10,"Hélio Chagas",31,155,"00:00:57.321",61.92]
[10,"Hélio Chagas",31,155,"00:00:56.894",62.39]
[10,"Hélio Chagas",31,155,"00:00:57.851",61.36]
[10,"Hélio Chagas",31,155,"00:00:58.207",60.98]
[10,"Hélio Chagas",31,155,"00:01:55.258",30.8]
[10,"Hélio Chagas",31,155,"00:01:01.853",57.39]
[10,"Marcelo Chagas",28,122,"00:01:04.607",54.94]
[10,"Marcelo Chagas",28,122,"00:00:58.294",60.89]
[10,"Marcelo Chagas",28,122,"00:00:57.434",61.8]
[10,"Marcelo Chagas",28,122,"00:00:57.084",62.18]
[10,"Marcelo Chagas",28,122,"00:00:58.026",61.17]
[10,"Marcelo Chagas",28,122,"00:00:56.786",62.51]
[10,"Marcelo Chagas",28,122,"00:00:57.707",61.51]
[10,"Marcelo Chagas",28,122,"00:00:57.561",61.67]
[10,"Marcelo Chagas",28,122,"00:00:57.739",61.48]
[10,"Marcelo Chagas",28,122,"00:00:56.787",62.51]
[10,"Marcelo Chagas",28,122,"00:00:56.660",62.65]
[10,"Marcelo Chagas",28,122,"00:00:56.872",62.41]
[10,"Marcelo Chagas",28,122,"00:00:57.162",62.1]
[10,"Marcelo Chagas",28,122,"00:00:56.834",62.46]
[10,"Marcelo Chagas",28,122,"00:00:56.842",62.45]
[10,"Marcelo Chagas",28,122,"00:00:56.600",62.71]
[10,"Marcelo Chagas",28,122,"00:00:56.930",62.35]
[10,"Marcelo Chagas",28,122,"00:00:56.858",62.43]
[10,"Marcelo Chagas",28,122,"00:00:56.808",62.48]
[10,"Marcelo Chagas",28,122,"00:00:56.810",62.48]
[10,"Marcelo Chagas",28,122,"00:00:56.709",62.59]
[10,"Marcelo Chagas",28,122,"00:00:56.754",62.54]
[10,"Marcelo Chagas",28,122,"00:00:56.787",62.51]
[10,"Marcelo Chagas",28,122,"00:00:57.029",62.24]
[10,"Marcelo Chagas",28,122,"00:00:56.666",62.64]
[10,"Marcelo Chagas",28,122,"00:00:56.977",62.3]
[10,"Marcelo Chagas",28,122,"00:00:56.918",62.36]
[10,"Marcelo Chagas",28,122,"00:00:57.302",61.95]

{"sheet":"ETAPA 9","index":3,"n_rows":610,"n_cols":12,"rows_kept":610,"cut":false,"hidden":false,"merged":[[0,0,0,6]]}
["Obs.: Selecione até 3 pilotos colocando na frente do seu nome os números 1, 2 e 3.",null,null,null,null,null,null,"PILOTO",{"$f":"J52","v":"Marcelo Pereira"},{"$f":"K52","v":"Eduardo Henrique"},{"$f":"L52","v":"Lucca Veloso"}]
[1,"Marcelo Pereira",null,null,null,null,null,"MÉDIA",{"$f":"AVERAGE(J53:J97)","v":"00:01:01.405"},{"$f":"AVERAGE(K53:K97)","v":"00:01:01.422"},{"$f":"AVERAGE(L53:L97)","v":"00:01:01.786"}]
[2,"Eduardo Henrique",null,null,null,null,null,"MAXIMA",{"$f":"LARGE(J53:J97,1)","v":"00:01:04.556"},{"$f":"LARGE(K53:K97,1)","v":"00:01:04.234"},{"$f":"LARGE(L53:L97,1)","v":"00:01:05.283"}]
[3,"Lucca Veloso",null,null,null,null,null,"MÍNIMA",{"$f":"SMALL(J53:J97,1)","v":"00:01:00.917"},{"$f":"SMALL(K53:K97,1)","v":"00:01:00.814"},{"$f":"SMALL(L53:L97,1)","v":"00:01:00.911"}]
[null,"Marcelo Campos",null,null,null,null,null,"Desvio Padrão",{"$f":"_xlfn.STDEV.S(J53:J97)","v":"00:00:00.637"},{"$f":"_xlfn.STDEV.S(K53:K97)","v":"00:00:00.594"},{"$f":"_xlfn.STDEV.S(L53:L97)","v":"00:00:00.878"}]
[null,"Daniel Nahum",null,null,null,null,null,"TEMPO TOTAL",{"$f":"SUM(J53:J97,1)","v":1.0213211342592592},{"$f":"SUM(K53:K97,1)","v":1.0213269907407407},{"$f":"SUM(L53:L97,1)","v":1.0214535763888888}]
[null,"Renato Amaral"]
[null,"Alexandre Melillo"]
[null,"Bernardo Gatti"]
[null,"Marcelo Clemente"]
[null,"Jarbas Reis"]
[null,"Vitor Gatti"]
[null,"Rodrigo Ricardo",null,null,null,null,null,null,null,null,{"$f":"SMALL(I4:K4,1)-L13","v":"00:01:00.814"}]
[null,"Guilherme Alves",null,null,null,null,null,null,null,null,{"$f":"LARGE(I3:K3,1)+L13","v":"00:01:05.283"}]
[null,"Felipe Bouhid"]
[null,"Tati Marcondes"]
[null,"Wesley Bambirra"]
[null,"Reila Ricardo"]
[null,"Wesley Canuto"]
[null,"Maurício Júnior"]
[null,"Marcelo Marcondes"]
[]
[]
[]
[]
[]
[]
[]
[]
[]
[]
[1]
[]
[]
[]
[]
[]
[]
[]
[]
[]
[]
[]
[]
[]
[]
[]
[]
[]
["ETAPA","PILOTO","NÚMERO VOLTAS","KART","Volta Tm","velocidade Media",null,null,null,{"$f":"MATCH(J52,$B$51:$B$1500,0)","v":1},{"$f":"MATCH(K52,$B$51:$B$1500,0)","v":31},61]
[9,"Marcelo Pereira",30,112,"00:01:04.556",58.55,null,null,null,{"$f":"VLOOKUP(J$52,$B$50:$F$1500,2,FALSE)","v":30},{"$f":"VLOOKUP(K$52,$B$50:$F$1500,2,FALSE)","v":30},{"$f":"VLOOKUP(L$52,$B$50:$F$1500,2,FALSE)","v":30}]
[9,"Marcelo Pereira",30,112,"00:01:01.648",61.32,null,null,"VOLTA",{"$f":"VLOOKUP(1,$A$2:$B$36,2,FALSE)","v":"Marcelo Pereira"},{"$f":"VLOOKUP(2,$A$2:$B$36,2,FALSE)","v":"Eduardo Henrique"},{"$f":"VLOOKUP(3,$A$2:$B$36,2,FALSE)","v":"Lucca Veloso"}]
[9,"Marcelo Pereira",30,112,"00:01:01.554",61.41,null,null,1,{"$f":"OFFSET($E$51:$E$1500,J50-1,,J51)","v":"00:01:04.556"},{"$f":"OFFSET($E$51:$E$1500,K50-1,,K51)","v":"00:01:04.234"},{"$f":"OFFSET($E$51:$E$1500,L50-1,,L51)","v":"00:01:05.283"}]
[9,"Marcelo Pereira",30,112,"00:01:01.438",61.53,null,null,2,"00:01:01.648","00:01:01.672","00:01:02.642"]
[9,"Marcelo Pereira",30,112,"00:01:01.275",61.69,null,null,3,"00:01:01.554","00:01:01.804","00:01:02.015"]
[9,"Marcelo Pereira",30,112,"00:01:01.224",61.74,null,null,4,"00:01:01.438","00:01:01.619","00:01:01.553"]
[9,"Marcelo Pereira",30,112,"00:01:01.264",61.7,null,null,5,"00:01:01.275","00:01:01.331","00:01:01.491"]
[9,"Marcelo Pereira",30,112,"00:01:00.982",61.99,null,null,6,"00:01:01.224","00:01:01.124","00:01:01.767"]
[9,"Marcelo Pereira",30,112,"00:01:01.296",61.67,null,null,7,"00:01:01.264","00:01:01.242","00:01:03.062"]
[9,"Marcelo Pereira",30,112,"00:01:01.351",61.61,null,null,8,"00:01:00.982","00:01:01.106","00:01:03.204"]
[9,"Marcelo Pereira",30,112,"00:01:01.220",61.74,null,null,9,"00:01:01.296","00:01:01.565","00:01:02.225"]
[9,"Marcelo Pereira",30,112,"00:01:01.413",61.55,null,null,10,"00:01:01.351","00:01:01.535","00:01:01.277"]
[9,"Marcelo Pereira",30,112,"00:01:01.344",61.62,null,null,11,"00:01:01.220","00:01:01.097","00:01:01.602"]
[9,"Marcelo Pereira",30,112,"00:01:01.344",61.62,null,null,12,"00:01:01.413","00:01:01.442","00:01:01.533"]
[9,"Marcelo Pereira",30,112,"00:01:01.598",61.37,null,null,13,"00:01:01.344","00:01:01.237","00:01:02.555"]
[9,"Marcelo Pereira",30,112,"00:01:01.104",61.86,null,null,14,"00:01:01.344","00:01:01.496","00:01:01.346"]
[9,"Marcelo Pereira",30,112,"00:01:00.917",62.05,null,null,15,"00:01:01.598","00:01:01.184","00:01:01.426"]
[9,"Marcelo Pereira",30,112,"00:01:01.145",61.82,null,null,16,"00:01:01.104","00:01:00.814","00:01:00.911"]
[9,"Marcelo Pereira",30,112,"00:01:00.947",62.02,null,null,17,"00:01:00.917","00:01:01.163","00:01:01.076"]
[9,"Marcelo Pereira",30,112,"00:01:01.060",61.91,null,null,18,"00:01:01.145","00:01:01.102","00:01:01.355"]
[9,"Marcelo Pereira",30,112,"00:01:01.053",61.91,null,null,19,"00:01:00.947","00:01:00.949","00:01:01.956"]
[9,"Marcelo Pereira",30,112,"00:01:01.222",61.74,null,null,20,"00:01:01.060","00:01:01.415","00:01:01.472"]
[9,"Marcelo Pereira",30,112,"00:01:01.613",61.35,null,null,21,"00:01:01.053","00:01:01.041","00:01:00.970"]
[9,"Marcelo Pereira",30,112,"00:01:01.735",61.23,null,null,22,"00:01:01.222","00:01:01.229","00:01:01.049"]
[9,"Marcelo Pereira",30,112,"00:01:01.414",61.55,null,null,23,"00:01:01.613","00:01:01.346","00:01:01.450"]
[9,"Marcelo Pereira",30,112,"00:01:01.048",61.92,null,null,24,"00:01:01.735","00:01:01.791","00:01:01.843"]
[9,"Marcelo Pereira",30,112,"00:01:01.081",61.89,null,null,25,"00:01:01.414","00:01:01.654","00:01:01.513"]
[9,"Marcelo Pereira",30,112,"00:01:01.249",61.72,null,null,26,"00:01:01.048","00:01:01.061","00:01:01.436"]
[9,"Marcelo Pereira",30,112,"00:01:01.312",61.65,null,null,27,"00:01:01.081","00:01:01.034","00:01:01.940"]
[9,"Marcelo Pereira",30,112,"00:01:01.739",61.23,null,null,28,"00:01:01.249","00:01:01.283","00:01:01.237"]
[9,"Eduardo Henrique",30,149,"00:01:04.234",58.85,null,null,29,"00:01:01.312","00:01:01.264","00:01:01.175"]
[9,"Eduardo Henrique",30,149,"00:01:01.672",61.29,null,null,30,"00:01:01.739","00:01:01.818","00:01:01.225"]
[9,"Eduardo Henrique",30,149,"00:01:01.804",61.16,null,null,31]
[9,"Eduardo Henrique",30,149,"00:01:01.619",61.34,null,null,32]
[9,"Eduardo Henrique",30,149,"00:01:01.331",61.63,null,null,33]
[9,"Eduardo Henrique",30,149,"00:01:01.124",61.84,null,null,34]
[9,"Eduardo Henrique",30,149,"00:01:01.242",61.72,null,null,35]
[9,"Eduardo Henrique",30,149,"00:01:01.106",61.86,null,null,36]
[9,"Eduardo Henrique",30,149,"00:01:01.565",61.4,null,null,37]
[9,"Eduardo Henrique",30,149,"00:01:01.535",61.43,null,null,38]
[9,"Eduardo Henrique",30,149,"00:01:01.097",61.87,null,null,39]
[9,"Eduardo Henrique",30,149,"00:01:01.442",61.52,null,null,40]
[9,"Eduardo Henrique",30,149,"00:01:01.237",61.73,null,null,41]
[9,"Eduardo Henrique",30,149,"00:01:01.496",61.47,null,null,42]
[9,"Eduardo Henrique",30,149,"00:01:01.184",61.78,null,null,43]
[9,"Eduardo Henrique",30,149,"00:01:00.814",62.16,null,null,44]
[9,"Eduardo Henrique",30,149,"00:01:01.163",61.8,null,null,45]
[9,"Eduardo Henrique",30,149,"00:01:01.102",61.86]
[9,"Eduardo Henrique",30,149,"00:01:00.949",62.02]
[9,"Eduardo Henrique",30,149,"00:01:01.415",61.55]
[9,"Eduardo Henrique",30,149,"00:01:01.041",61.93]
[9,"Eduardo Henrique",30,149,"00:01:01.229",61.74]
[9,"Eduardo Henrique",30,149,"00:01:01.346",61.62]
[9,"Eduardo Henrique",30,149,"00:01:01.791",61.17]
[9,"Eduardo Henrique",30,149,"00:01:01.654",61.31]
[9,"Eduardo Henrique",30,149,"00:01:01.061",61.91]
[9,"Eduardo Henrique",30,149,"00:01:01.034",61.93]
[9,"Eduardo Henrique",30,149,"00:01:01.283",61.68]
[9,"Eduardo Henrique",30,149,"00:01:01.264",61.7]
[9,"Eduardo Henrique",30,149,"00:01:01.818",61.15]
[9,"Lucca Veloso",30,103,"00:01:05.283",57.9]
[9,"Lucca Veloso",30,103,"00:01:02.642",60.34]
[9,"Lucca Veloso",30,103,"00:01:02.015",60.95]
[9,"Lucca Veloso",30,103,"00:01:01.553",61.41]
[9,"Lucca Veloso",30,103,"00:01:01.491",61.47]
[9,"Lucca Veloso",30,103,"00:01:01.767",61.2]
[9,"Lucca Veloso",30,103,"00:01:03.062",59.94]
[9,"Lucca Veloso",30,103,"00:01:03.204",59.81]
[9,"Lucca Veloso",30,103,"00:01:02.225",60.75]
[9,"Lucca Veloso",30,103,"00:01:01.277",61.69]
[9,"Lucca Veloso",30,103,"00:01:01.602",61.36]
[9,"Lucca Veloso",30,103,"00:01:01.533",61.43]
[9,"Lucca Veloso",30,103,"00:01:02.555",60.43]
[9,"Lucca Veloso",30,103,"00:01:01.346",61.62]
[9,"Lucca Veloso",30,103,"00:01:01.426",61.54]
[9,"Lucca Veloso",30,103,"00:01:00.911",62.06]
[9,"Lucca Veloso",30,103,"00:01:01.076",61.89]
[9,"Lucca Veloso",30,103,"00:01:01.355",61.61]
[9,"Lucca Veloso",30,103,"00:01:01.956",61.01]
[9,"Lucca Veloso",30,103,"00:01:01.472",61.49]
[9,"Lucca Veloso",30,103,"00:01:00.970",62]
[9,"Lucca Veloso",30,103,"00:01:01.049",61.92]
[9,"Lucca Veloso",30,103,"00:01:01.450",61.51]
[9,"Lucca Veloso",30,103,"00:01:01.843",61.12]
[9,"Lucca Veloso",30,103,"00:01:01.513",61.45]
[9,"Lucca Veloso",30,103,"00:01:01.436",61.53]
[9,"Lucca Veloso",30,103,"00:01:01.940",61.03]
[9,"Lucca Veloso",30,103,"00:01:01.237",61.73]
[9,"Lucca Veloso",30,103,"00:01:01.175",61.79]
[9,"Lucca Veloso",30,103,"00:01:01.225",61.74]
[9,"Marcelo Campos",30,125,"00:01:05.688",57.54]
[9,"Marcelo Campos",30,125,"00:01:02.660",60.33]
[9,"Marcelo Campos",30,125,"00:01:01.960",61.01]
[9,"Marcelo Campos",30,125,"00:01:01.702",61.26]
[9,"Marcelo Campos",30,125,"00:01:01.542",61.42]
[9,"Marcelo Campos",30,125,"00:01:01.839",61.13]
[9,"Marcelo Campos",30,125,"00:01:03.067",59.94]
[9,"Marcelo Campos",30,125,"00:01:02.577",60.41]
[9,"Marcelo Campos",30,125,"00:01:02.430",60.55]
[9,"Marcelo Campos",30,125,"00:01:01.516",61.45]
[9,"Marcelo Campos",30,125,"00:01:01.576",61.39]
[9,"Marcelo Campos",30,125,"00:01:01.435",61.53]
[9,"Marcelo Campos",30,125,"00:01:01.541",61.42]
[9,"Marcelo Campos",30,125,"00:01:01.536",61.43]
[9,"Marcelo Campos",30,125,"00:01:01.431",61.53]
[9,"Marcelo Campos",30,125,"00:01:01.299",61.66]
[9,"Marcelo Campos",30,125,"00:01:01.517",61.45]
[9,"Marcelo Campos",30,125,"00:01:01.424",61.54]
[9,"Marcelo Campos",30,125,"00:01:01.572",61.39]
[9,"Marcelo Campos",30,125,"00:01:01.387",61.58]
[9,"Marcelo Campos",30,125,"00:01:01.166",61.8]
[9,"Marcelo Campos",30,125,"00:01:01.309",61.65]
[9,"Marcelo Campos",30,125,"00:01:01.702",61.26]
[9,"Marcelo Campos",30,125,"00:01:01.659",61.3]
[9,"Marcelo Campos",30,125,"00:01:01.604",61.36]
[9,"Marcelo Campos",30,125,"00:01:01.522",61.44]
[9,"Marcelo Campos",30,125,"00:01:02.208",60.76]
[9,"Marcelo Campos",30,125,"00:01:01.169",61.8]
[9,"Marcelo Campos",30,125,"00:01:01.197",61.77]
[9,"Marcelo Campos",30,125,"00:01:01.221",61.74]
[9,"Daniel Nahum",30,148,"00:01:06.317",57]
[9,"Daniel Nahum",30,148,"00:01:03.040",59.96]
[9,"Daniel Nahum",30,148,"00:01:01.940",61.03]
[9,"Daniel Nahum",30,148,"00:01:01.672",61.29]
[9,"Daniel Nahum",30,148,"00:01:01.924",61.04]
[9,"Daniel Nahum",30,148,"00:01:01.468",61.5]
[9,"Daniel Nahum",30,148,"00:01:02.790",60.2]
[9,"Daniel Nahum",30,148,"00:01:02.905",60.09]
[9,"Daniel Nahum",30,148,"00:01:02.594",60.39]
[9,"Daniel Nahum",30,148,"00:01:01.567",61.4]
[9,"Daniel Nahum",30,148,"00:01:01.379",61.58]
[9,"Daniel Nahum",30,148,"00:01:01.460",61.5]
[9,"Daniel Nahum",30,148,"00:01:01.739",61.23]
[9,"Daniel Nahum",30,148,"00:01:01.484",61.48]
[9,"Daniel Nahum",30,148,"00:01:01.280",61.68]
[9,"Daniel Nahum",30,148,"00:01:01.071",61.9]
[9,"Daniel Nahum",30,148,"00:01:01.308",61.66]
[9,"Daniel Nahum",30,148,"00:01:01.427",61.54]
[9,"Daniel Nahum",30,148,"00:01:01.938",61.03]
[9,"Daniel Nahum",30,148,"00:01:01.785",61.18]
[9,"Daniel Nahum",30,148,"00:01:01.036",61.93]
[9,"Daniel Nahum",30,148,"00:01:01.134",61.83]
[9,"Daniel Nahum",30,148,"00:01:01.426",61.54]
[9,"Daniel Nahum",30,148,"00:01:01.788",61.18]
[9,"Daniel Nahum",30,148,"00:01:01.621",61.34]
[9,"Daniel Nahum",30,148,"00:01:02.230",60.74]
[9,"Daniel Nahum",30,148,"00:01:01.610",61.35]
[9,"Daniel Nahum",30,148,"00:01:01.218",61.75]
[9,"Daniel Nahum",30,148,"00:01:01.164",61.8]
[9,"Daniel Nahum",30,148,"00:01:01.239",61.73]
[9,"Renato Amaral",30,147,"00:01:06.639",56.72]
[9,"Renato Amaral",30,147,"00:01:02.697",60.29]
[9,"Renato Amaral",30,147,"00:01:02.694",60.29]
[9,"Renato Amaral",30,147,"00:01:01.387",61.58]
[9,"Renato Amaral",30,147,"00:01:01.350",61.61]
[9,"Renato Amaral",30,147,"00:01:01.624",61.34]
[9,"Renato Amaral",30,147,"00:01:01.326",61.64]
[9,"Renato Amaral",30,147,"00:01:03.465",59.56]
[9,"Renato Amaral",30,147,"00:01:02.637",60.35]
[9,"Renato Amaral",30,147,"00:01:01.151",61.81]
[9,"Renato Amaral",30,147,"00:01:02.127",60.84]
[9,"Renato Amaral",30,147,"00:01:01.380",61.58]
[9,"Renato Amaral",30,147,"00:01:01.562",61.4]
[9,"Renato Amaral",30,147,"00:01:01.601",61.36]
[9,"Renato Amaral",30,147,"00:01:01.994",60.97]
[9,"Renato Amaral",30,147,"00:01:01.698",61.27]
[9,"Renato Amaral",30,147,"00:01:02.013",60.95]
[9,"Renato Amaral",30,147,"00:01:01.023",61.94]
[9,"Renato Amaral",30,147,"00:01:00.992",61.98]
[9,"Renato Amaral",30,147,"00:01:01.452",61.51]
[9,"Renato Amaral",30,147,"00:01:01.064",61.9]
[9,"Renato Amaral",30,147,"00:01:01.206",61.76]
[9,"Renato Amaral",30,147,"00:01:01.177",61.79]
[9,"Renato Amaral",30,147,"00:01:01.687",61.28]
[9,"Renato Amaral",30,147,"00:01:02.313",60.66]
[9,"Renato Amaral",30,147,"00:01:01.657",61.31]
[9,"Renato Amaral",30,147,"00:01:01.411",61.55]
[9,"Renato Amaral",30,147,"00:01:01.101",61.86]
[9,"Renato Amaral",30,147,"00:01:01.230",61.73]
[9,"Renato Amaral",30,147,"00:01:01.123",61.84]
[9,"Alexandre Melillo",30,150,"00:01:05.856",57.4]
[9,"Alexandre Melillo",30,150,"00:01:02.675",60.31]
[9,"Alexandre Melillo",30,150,"00:01:01.979",60.99]
[9,"Alexandre Melillo",30,150,"00:01:01.518",61.45]
[9,"Alexandre Melillo",30,150,"00:01:02.165",60.81]
[9,"Alexandre Melillo",30,150,"00:01:01.720",61.24]
[9,"Alexandre Melillo",30,150,"00:01:03.013",59.99]
[9,"Alexandre Melillo",30,150,"00:01:03.722",59.32]
[9,"Alexandre Melillo",30,150,"00:01:02.527",60.45]
[9,"Alexandre Melillo",30,150,"00:01:01.563",61.4]
[9,"Alexandre Melillo",30,150,"00:01:01.804",61.16]
[9,"Alexandre Melillo",30,150,"00:01:01.675",61.29]
[9,"Alexandre Melillo",30,150,"00:01:01.585",61.38]
[9,"Alexandre Melillo",30,150,"00:01:01.372",61.59]
[9,"Alexandre Melillo",30,150,"00:01:01.179",61.79]
[9,"Alexandre Melillo",30,150,"00:01:05.639",57.59]
[9,"Alexandre Melillo",30,150,"00:01:01.433",61.53]
[9,"Alexandre Melillo",30,150,"00:01:01.962",61.01]
[9,"Alexandre Melillo",30,150,"00:01:01.248",61.72]
[9,"Alexandre Melillo",30,150,"00:01:01.214",61.75]
[9,"Alexandre Melillo",30,150,"00:01:01.341",61.62]
[9,"Alexandre Melillo",30,150,"00:01:01.385",61.58]
[9,"Alexandre Melillo",30,150,"00:01:02.042",60.93]
[9,"Alexandre Melillo",30,150,"00:01:01.075",61.89]
[9,"Alexandre Melillo",30,150,"00:01:01.547",61.42]
[9,"Alexandre Melillo",30,150,"00:01:01.503",61.46]
[9,"Alexandre Melillo",30,150,"00:01:02.430",60.55]
[9,"Alexandre Melillo",30,150,"00:01:01.813",61.15]
[9,"Alexandre Melillo",30,150,"00:01:01.306",61.66]
[9,"Alexandre Melillo",30,150,"00:01:01.658",61.31]
[9,"Bernardo Gatti",30,139,"00:01:07.205",56.25]
[9,"Bernardo Gatti",30,139,"00:01:02.626",60.36]
[9,"Bernardo Gatti",30,139,"00:01:04.098",58.97]
[9,"Bernardo Gatti",30,139,"00:01:01.903",61.06]
[9,"Bernardo Gatti",30,139,"00:01:01.886",61.08]
[9,"Bernardo Gatti",30,139,"00:01:01.271",61.69]
[9,"Bernardo Gatti",30,139,"00:01:01.388",61.58]
[9,"Bernardo Gatti",30,139,"00:01:01.628",61.34]
[9,"Bernardo Gatti",30,139,"00:01:02.855",60.14]
[9,"Bernardo Gatti",30,139,"00:01:01.637",61.33]
[9,"Bernardo Gatti",30,139,"00:01:01.968",61]
[9,"Bernardo Gatti",30,139,"00:01:01.488",61.48]
[9,"Bernardo Gatti",30,139,"00:01:01.368",61.6]
[9,"Bernardo Gatti",30,139,"00:01:01.655",61.31]
[9,"Bernardo Gatti",30,139,"00:01:01.831",61.13]
[9,"Bernardo Gatti",30,139,"00:01:01.572",61.39]
[9,"Bernardo Gatti",30,139,"00:01:01.461",61.5]
[9,"Bernardo Gatti",30,139,"00:01:02.152",60.82]
[9,"Bernardo Gatti",30,139,"00:01:01.302",61.66]
[9,"Bernardo Gatti",30,139,"00:01:01.376",61.59]
[9,"Bernardo Gatti",30,139,"00:01:01.207",61.76]
[9,"Bernardo Gatti",30,139,"00:01:02.061",60.91]
[9,"Bernardo Gatti",30,139,"00:01:01.732",61.23]
[9,"Bernardo Gatti",30,139,"00:01:01.551",61.41]
[9,"Bernardo Gatti",30,139,"00:01:01.611",61.35]
[9,"Bernardo Gatti",30,139,"00:01:01.580",61.38]
[9,"Bernardo Gatti",30,139,"00:01:02.384",60.59]
[9,"Bernardo Gatti",30,139,"00:01:02.422",60.56]
[9,"Bernardo Gatti",30,139,"00:01:01.610",61.35]
[9,"Bernardo Gatti",30,139,"00:01:01.178",61.79]
[9,"Marcelo Clemente",30,122,"00:01:07.854",55.71]
[9,"Marcelo Clemente",30,122,"00:01:11.946",52.54]
[9,"Marcelo Clemente",30,122,"00:01:02.047",60.92]
[9,"Marcelo Clemente",30,122,"00:01:01.203",61.76]
[9,"Marcelo Clemente",30,122,"00:01:01.433",61.53]
[9,"Marcelo Clemente",30,122,"00:01:01.282",61.68]
[9,"Marcelo Clemente",30,122,"00:01:01.001",61.97]
[9,"Marcelo Clemente",30,122,"00:01:01.841",61.12]
[9,"Marcelo Clemente",30,122,"00:01:01.933",61.03]
[9,"Marcelo Clemente",30,122,"00:01:00.927",62.04]
[9,"Marcelo Clemente",30,122,"00:01:01.094",61.87]
[9,"Marcelo Clemente",30,122,"00:01:01.341",61.62]
[9,"Marcelo Clemente",30,122,"00:01:00.914",62.05]
[9,"Marcelo Clemente",30,122,"00:01:01.238",61.73]
[9,"Marcelo Clemente",30,122,"00:01:00.995",61.97]
[9,"Marcelo Clemente",30,122,"00:01:01.123",61.84]
[9,"Marcelo Clemente",30,122,"00:01:01.404",61.56]
[9,"Marcelo Clemente",30,122,"00:01:01.807",61.16]
[9,"Marcelo Clemente",30,122,"00:01:00.934",62.03]
[9,"Marcelo Clemente",30,122,"00:01:01.587",61.38]
[9,"Marcelo Clemente",30,122,"00:01:01.172",61.79]
[9,"Marcelo Clemente",30,122,"00:01:01.229",61.74]
[9,"Marcelo Clemente",30,122,"00:01:02.286",60.69]
[9,"Marcelo Clemente",30,122,"00:01:03.225",59.79]
[9,"Marcelo Clemente",30,122,"00:01:02.183",60.79]
[9,"Marcelo Clemente",30,122,"00:01:01.729",61.24]
[9,"Marcelo Clemente",30,122,"00:01:01.656",61.31]
[9,"Marcelo Clemente",30,122,"00:01:00.918",62.05]
[9,"Marcelo Clemente",30,122,"00:01:00.732",62.24]
[9,"Marcelo Clemente",30,122,"00:01:01.193",61.77]
[9,"Jarbas Reis",30,118,"00:01:05.485",57.72]
[9,"Jarbas Reis",30,118,"00:01:02.876",60.12]
[9,"Jarbas Reis",30,118,"00:01:01.949",61.02]
[9,"Jarbas Reis",30,118,"00:01:01.877",61.09]
[9,"Jarbas Reis",30,118,"00:01:01.724",61.24]
[9,"Jarbas Reis",30,118,"00:01:01.886",61.08]
[9,"Jarbas Reis",30,118,"00:01:03.084",59.92]
[9,"Jarbas Reis",30,118,"00:01:02.760",60.23]
[9,"Jarbas Reis",30,118,"00:01:02.655",60.33]
[9,"Jarbas Reis",30,118,"00:01:02.298",60.68]
[9,"Jarbas Reis",30,118,"00:01:01.485",61.48]
[9,"Jarbas Reis",30,118,"00:01:01.398",61.57]
[9,"Jarbas Reis",30,118,"00:01:02.305",60.67]
[9,"Jarbas Reis",30,118,"00:01:01.926",61.04]
[9,"Jarbas Reis",30,118,"00:01:02.713",60.27]
[9,"Jarbas Reis",30,118,"00:01:01.855",61.11]
[9,"Jarbas Reis",30,118,"00:01:01.745",61.22]
[9,"Jarbas Reis",30,118,"00:01:01.957",61.01]
[9,"Jarbas Reis",30,118,"00:01:01.525",61.44]
[9,"Jarbas Reis",30,118,"00:01:01.893",61.07]
[9,"Jarbas Reis",30,118,"00:01:01.402",61.56]
[9,"Jarbas Reis",30,118,"00:01:01.971",61]
[9,"Jarbas Reis",30,118,"00:01:02.406",60.57]
[9,"Jarbas Reis",30,118,"00:01:03.191",59.82]
[9,"Jarbas Reis",30,118,"00:01:02.075",60.89]
[9,"Jarbas Reis",30,118,"00:01:01.894",61.07]
[9,"Jarbas Reis",30,118,"00:01:02.463",60.52]
[9,"Jarbas Reis",30,118,"00:01:01.529",61.43]
[9,"Jarbas Reis",30,118,"00:01:01.630",61.33]
[9,"Jarbas Reis",30,118,"00:01:01.753",61.21]
[9,"Vitor Gatti",30,144,"00:01:07.419",56.07]
[9,"Vitor Gatti",30,144,"00:01:04.137",58.94]
[9,"Vitor Gatti",30,144,"00:01:02.974",60.02]
[9,"Vitor Gatti",30,144,"00:01:01.903",61.06]
[9,"Vitor Gatti",30,144,"00:01:02.161",60.81]
[9,"Vitor Gatti",30,144,"00:01:01.796",61.17]
[9,"Vitor Gatti",30,144,"00:01:01.568",61.4]
[9,"Vitor Gatti",30,144,"00:01:01.680",61.28]
[9,"Vitor Gatti",30,144,"00:01:02.669",60.32]
[9,"Vitor Gatti",30,144,"00:01:02.082",60.89]
[9,"Vitor Gatti",30,144,"00:01:02.242",60.73]
[9,"Vitor Gatti",30,144,"00:01:01.764",61.2]
[9,"Vitor Gatti",30,144,"00:01:02.105",60.86]
[9,"Vitor Gatti",30,144,"00:01:02.638",60.35]
[9,"Vitor Gatti",30,144,"00:01:02.340",60.64]
[9,"Vitor Gatti",30,144,"00:01:01.642",61.32]
[9,"Vitor Gatti",30,144,"00:01:02.052",60.92]
[9,"Vitor Gatti",30,144,"00:01:02.031",60.94]
[9,"Vitor Gatti",30,144,"00:01:01.915",61.05]
[9,"Vitor Gatti",30,144,"00:01:02.472",60.51]
[9,"Vitor Gatti",30,144,"00:01:01.760",61.2]
[9,"Vitor Gatti",30,144,"00:01:02.032",60.94]
[9,"Vitor Gatti",30,144,"00:01:02.134",60.84]
[9,"Vitor Gatti",30,144,"00:01:01.862",61.1]
[9,"Vitor Gatti",30,144,"00:01:02.179",60.79]
[9,"Vitor Gatti",30,144,"00:01:02.424",60.55]
[9,"Vitor Gatti",30,144,"00:01:02.164",60.81]
[9,"Vitor Gatti",30,144,"00:01:02.319",60.66]
[9,"Vitor Gatti",30,144,"00:01:02.150",60.82]
[9,"Vitor Gatti",30,144,"00:01:02.033",60.94]
[9,"Rodrigo Ricardo",30,136,"00:01:08.506",55.18]
[9,"Rodrigo Ricardo",30,136,"00:01:04.031",59.03]
[9,"Rodrigo Ricardo",30,136,"00:01:04.034",59.03]
[9,"Rodrigo Ricardo",30,136,"00:01:03.114",59.89]
[9,"Rodrigo Ricardo",30,136,"00:01:02.693",60.29]
[9,"Rodrigo Ricardo",30,136,"00:01:03.305",59.71]
[9,"Rodrigo Ricardo",30,136,"00:01:02.214",60.76]
[9,"Rodrigo Ricardo",30,136,"00:01:02.892",60.1]
[9,"Rodrigo Ricardo",30,136,"00:01:02.495",60.48]
[9,"Rodrigo Ricardo",30,136,"00:01:01.645",61.32]
[9,"Rodrigo Ricardo",30,136,"00:01:02.273",60.7]
[9,"Rodrigo Ricardo",30,136,"00:01:02.284",60.69]
[9,"Rodrigo Ricardo",30,136,"00:01:02.006",60.96]
[9,"Rodrigo Ricardo",30,136,"00:01:02.597",60.39]
[9,"Rodrigo Ricardo",30,136,"00:01:01.738",61.23]
[9,"Rodrigo Ricardo",30,136,"00:01:02.148",60.82]
[9,"Rodrigo Ricardo",30,136,"00:01:01.909",61.06]
[9,"Rodrigo Ricardo",30,136,"00:01:01.933",61.03]
[9,"Rodrigo Ricardo",30,136,"00:01:01.893",61.07]
[9,"Rodrigo Ricardo",30,136,"00:01:02.102",60.87]
[9,"Rodrigo Ricardo",30,136,"00:01:01.530",61.43]
[9,"Rodrigo Ricardo",30,136,"00:01:01.656",61.31]
[9,"Rodrigo Ricardo",30,136,"00:01:02.145",60.83]
[9,"Rodrigo Ricardo",30,136,"00:01:02.293",60.68]
[9,"Rodrigo Ricardo",30,136,"00:01:01.367",61.6]
[9,"Rodrigo Ricardo",30,136,"00:01:02.021",60.95]
[9,"Rodrigo Ricardo",30,136,"00:01:01.541",61.42]
[9,"Rodrigo Ricardo",30,136,"00:01:01.934",61.03]
[9,"Rodrigo Ricardo",30,136,"00:01:01.634",61.33]
[9,"Rodrigo Ricardo",30,136,"00:01:02.369",60.61]
[9,"Guilherme Alves",30,127,"00:01:05.393",57.8]
[9,"Guilherme Alves",30,127,"00:01:02.207",60.76]
[9,"Guilherme Alves",30,127,"00:01:02.133",60.84]
[9,"Guilherme Alves",30,127,"00:01:02.175",60.8]
[9,"Guilherme Alves",30,127,"00:01:01.763",61.2]
[9,"Guilherme Alves",30,127,"00:01:02.044",60.92]
[9,"Guilherme Alves",30,127,"00:01:02.930",60.07]
[9,"Guilherme Alves",30,127,"00:01:01.837",61.13]
[9,"Guilherme Alves",30,127,"00:01:01.925",61.04]
[9,"Guilherme Alves",30,127,"00:01:02.214",60.76]
[9,"Guilherme Alves",30,127,"00:01:02.327",60.65]
[9,"Guilherme Alves",30,127,"00:01:02.229",60.74]
[9,"Guilherme Alves",30,127,"00:01:02.433",60.54]
[9,"Guilherme Alves",30,127,"00:01:01.467",61.5]
[9,"Guilherme Alves",30,127,"00:01:01.757",61.21]
[9,"Guilherme Alves",30,127,"00:01:05.517",57.69]
[9,"Guilherme Alves",30,127,"00:01:01.888",61.08]
[9,"Guilherme Alves",30,127,"00:01:02.071",60.9]
[9,"Guilherme Alves",30,127,"00:01:02.499",60.48]
[9,"Guilherme Alves",30,127,"00:01:08.443",55.23]
[9,"Guilherme Alves",30,127,"00:01:01.907",61.06]
[9,"Guilherme Alves",30,127,"00:01:02.090",60.88]
[9,"Guilherme Alves",30,127,"00:01:02.196",60.78]
[9,"Guilherme Alves",30,127,"00:01:02.133",60.84]
[9,"Guilherme Alves",30,127,"00:01:01.887",61.08]
[9,"Guilherme Alves",30,127,"00:01:01.762",61.2]
[9,"Guilherme Alves",30,127,"00:01:01.670",61.29]
[9,"Guilherme Alves",30,127,"00:01:01.814",61.15]
[9,"Guilherme Alves",30,127,"00:01:02.374",60.6]
[9,"Guilherme Alves",30,127,"00:01:03.382",59.64]
[9,"Felipe Bouhid",30,142,"00:01:07.679",55.85]
[9,"Felipe Bouhid",30,142,"00:01:03.912",59.14]
[9,"Felipe Bouhid",30,142,"00:01:03.734",59.31]
[9,"Felipe Bouhid",30,142,"00:01:03.029",59.97]
[9,"Felipe Bouhid",30,142,"00:01:02.805",60.19]
[9,"Felipe Bouhid",30,142,"00:01:02.631",60.35]
[9,"Felipe Bouhid",30,142,"00:01:02.526",60.45]
[9,"Felipe Bouhid",30,142,"00:01:02.232",60.74]
[9,"Felipe Bouhid",30,142,"00:01:03.284",59.73]
[9,"Felipe Bouhid",30,142,"00:01:01.638",61.33]
[9,"Felipe Bouhid",30,142,"00:01:02.446",60.53]
[9,"Felipe Bouhid",30,142,"00:01:02.086",60.88]
[9,"Felipe Bouhid",30,142,"00:01:02.150",60.82]
[9,"Felipe Bouhid",30,142,"00:01:02.413",60.56]
[9,"Felipe Bouhid",30,142,"00:01:01.901",61.07]
[9,"Felipe Bouhid",30,142,"00:01:02.141",60.83]
[9,"Felipe Bouhid",30,142,"00:01:01.814",61.15]
[9,"Felipe Bouhid",30,142,"00:01:02.108",60.86]
[9,"Felipe Bouhid",30,142,"00:01:01.908",61.06]
[9,"Felipe Bouhid",30,142,"00:01:01.827",61.14]
[9,"Felipe Bouhid",30,142,"00:01:01.754",61.21]
[9,"Felipe Bouhid",30,142,"00:01:01.733",61.23]
[9,"Felipe Bouhid",30,142,"00:01:01.872",61.09]
[9,"Felipe Bouhid",30,142,"00:01:02.256",60.72]
[9,"Felipe Bouhid",30,142,"00:01:01.472",61.49]
[9,"Felipe Bouhid",30,142,"00:01:01.961",61.01]
[9,"Felipe Bouhid",30,142,"00:01:01.475",61.49]
[9,"Felipe Bouhid",30,142,"00:01:01.964",61]
[9,"Felipe Bouhid",30,142,"00:01:02.461",60.52]
[9,"Felipe Bouhid",30,142,"00:01:03.241",59.77]
[9,"Tati Marcondes",30,102,"00:01:07.104",56.33]
[9,"Tati Marcondes",30,102,"00:01:04.096",58.97]
[9,"Tati Marcondes",30,102,"00:01:04.536",58.57]
[9,"Tati Marcondes",30,102,"00:01:02.968",60.03]
[9,"Tati Marcondes",30,102,"00:01:02.915",60.08]
[9,"Tati Marcondes",30,102,"00:01:03.479",59.55]
[9,"Tati Marcondes",30,102,"00:01:02.200",60.77]
[9,"Tati Marcondes",30,102,"00:01:02.852",60.14]
[9,"Tati Marcondes",30,102,"00:01:03.264",59.75]
[9,"Tati Marcondes",30,102,"00:01:02.651",60.33]
[9,"Tati Marcondes",30,102,"00:01:02.495",60.48]
[9,"Tati Marcondes",30,102,"00:01:02.612",60.37]
[9,"Tati Marcondes",30,102,"00:01:02.553",60.43]
[9,"Tati Marcondes",30,102,"00:01:02.694",60.29]
[9,"Tati Marcondes",30,102,"00:01:02.798",60.19]
[9,"Tati Marcondes",30,102,"00:01:02.701",60.29]
[9,"Tati Marcondes",30,102,"00:01:02.305",60.67]
[9,"Tati Marcondes",30,102,"00:01:02.450",60.53]
[9,"Tati Marcondes",30,102,"00:01:02.365",60.61]
[9,"Tati Marcondes",30,102,"00:01:03.493",59.53]
[9,"Tati Marcondes",30,102,"00:01:02.398",60.58]
[9,"Tati Marcondes",30,102,"00:01:02.683",60.3]
[9,"Tati Marcondes",30,102,"00:01:02.768",60.22]
[9,"Tati Marcondes",30,102,"00:01:02.290",60.68]
[9,"Tati Marcondes",30,102,"00:01:02.558",60.42]
[9,"Tati Marcondes",30,102,"00:01:02.229",60.74]
[9,"Tati Marcondes",30,102,"00:01:02.590",60.39]
[9,"Tati Marcondes",30,102,"00:01:02.316",60.66]
[9,"Tati Marcondes",30,102,"00:01:02.946",60.05]
[9,"Tati Marcondes",30,102,"00:01:03.180",59.83]
[9,"Wesley Bambirra",29,109,"00:01:09.515",54.38]
[9,"Wesley Bambirra",29,109,"00:01:02.741",60.25]
[9,"Wesley Bambirra",29,109,"00:01:02.854",60.14]
[9,"Wesley Bambirra",29,109,"00:01:01.691",61.27]
[9,"Wesley Bambirra",29,109,"00:01:01.510",61.45]
[9,"Wesley Bambirra",29,109,"00:01:01.756",61.21]
[9,"Wesley Bambirra",29,109,"00:01:01.864",61.1]
[9,"Wesley Bambirra",29,109,"00:01:01.797",61.17]
[9,"Wesley Bambirra",29,109,"00:01:03.519",59.51]
[9,"Wesley Bambirra",29,109,"00:01:02.790",60.2]
[9,"Wesley Bambirra",29,109,"00:01:03.611",59.42]
[9,"Wesley Bambirra",29,109,"00:01:42.173",37]
[9,"Wesley Bambirra",29,109,"00:01:02.548",60.43]
[9,"Wesley Bambirra",29,109,"00:01:01.463",61.5]
[9,"Wesley Bambirra",29,109,"00:01:01.410",61.55]
[9,"Wesley Bambirra",29,109,"00:01:01.556",61.41]
[9,"Wesley Bambirra",29,109,"00:01:01.233",61.73]
[9,"Wesley Bambirra",29,109,"00:01:02.826",60.17]
[9,"Wesley Bambirra",29,109,"00:01:01.188",61.78]
[9,"Wesley Bambirra",29,109,"00:01:01.102",61.86]
[9,"Wesley Bambirra",29,109,"00:01:01.194",61.77]
[9,"Wesley Bambirra",29,109,"00:01:01.395",61.57]
[9,"Wesley Bambirra",29,109,"00:01:01.778",61.19]
[9,"Wesley Bambirra",29,109,"00:01:01.601",61.36]
[9,"Wesley Bambirra",29,109,"00:01:01.137",61.83]
[9,"Wesley Bambirra",29,109,"00:01:01.034",61.93]
[9,"Wesley Bambirra",29,109,"00:01:01.292",61.67]
[9,"Wesley Bambirra",29,109,"00:01:01.154",61.81]
[9,"Wesley Bambirra",29,109,"00:01:01.830",61.14]
[9,"Reila Ricardo",29,114,"00:01:09.399",54.47]
[9,"Reila Ricardo",29,114,"00:01:12.823",51.91]
[9,"Reila Ricardo",29,114,"00:01:03.545",59.49]
[9,"Reila Ricardo",29,114,"00:01:02.960",60.04]
[9,"Reila Ricardo",29,114,"00:01:03.311",59.71]
[9,"Reila Ricardo",29,114,"00:01:03.254",59.76]
[9,"Reila Ricardo",29,114,"00:01:03.134",59.87]
[9,"Reila Ricardo",29,114,"00:01:02.968",60.03]
[9,"Reila Ricardo",29,114,"00:01:03.657",59.38]
[9,"Reila Ricardo",29,114,"00:01:03.098",59.91]
[9,"Reila Ricardo",29,114,"00:01:03.732",59.31]
[9,"Reila Ricardo",29,114,"00:01:03.270",59.74]
[9,"Reila Ricardo",29,114,"00:01:03.866",59.19]
[9,"Reila Ricardo",29,114,"00:01:03.293",59.72]
[9,"Reila Ricardo",29,114,"00:01:03.309",59.71]
[9,"Reila Ricardo",29,114,"00:01:03.083",59.92]
[9,"Reila Ricardo",29,114,"00:01:03.038",59.96]
[9,"Reila Ricardo",29,114,"00:01:03.215",59.8]
[9,"Reila Ricardo",29,114,"00:01:03.198",59.81]
[9,"Reila Ricardo",29,114,"00:01:02.700",60.29]
[9,"Reila Ricardo",29,114,"00:01:04.730",58.4]
[9,"Reila Ricardo",29,114,"00:01:04.417",58.68]
[9,"Reila Ricardo",29,114,"00:01:05.327",57.86]
[9,"Reila Ricardo",29,114,"00:01:03.269",59.74]
[9,"Reila Ricardo",29,114,"00:01:02.992",60.01]
[9,"Reila Ricardo",29,114,"00:01:03.006",59.99]
[9,"Reila Ricardo",29,114,"00:01:02.641",60.34]
[9,"Reila Ricardo",29,114,"00:01:02.991",60.01]
[9,"Reila Ricardo",29,114,"00:01:02.925",60.07]
[9,"Wesley Canuto",25,137,"00:01:05.715",57.52]
[9,"Wesley Canuto",25,137,"00:01:02.461",60.52]
[9,"Wesley Canuto",25,137,"00:01:02.035",60.93]
[9,"Wesley Canuto",25,137,"00:01:01.847",61.12]
[9,"Wesley Canuto",25,137,"00:01:01.697",61.27]
[9,"Wesley Canuto",25,137,"00:01:01.745",61.22]
[9,"Wesley Canuto",25,137,"00:01:02.143",60.83]
[9,"Wesley Canuto",25,137,"00:01:02.022",60.95]
[9,"Wesley Canuto",25,137,"00:06:06.012",10.33]
[9,"Wesley Canuto",25,137,"00:01:03.532",59.5]
[9,"Wesley Canuto",25,137,"00:01:02.537",60.44]
[9,"Wesley Canuto",25,137,"00:01:18.875",47.92]
[9,"Wesley Canuto",25,137,"00:01:02.933",60.06]
[9,"Wesley Canuto",25,137,"00:01:01.715",61.25]
[9,"Wesley Canuto",25,137,"00:01:01.661",61.3]
[9,"Wesley Canuto",25,137,"00:01:01.588",61.38]
[9,"Wesley Canuto",25,137,"00:01:01.654",61.31]
[9,"Wesley Canuto",25,137,"00:01:01.734",61.23]
[9,"Wesley Canuto",25,137,"00:01:01.687",61.28]
[9,"Wesley Canuto",25,137,"00:01:01.706",61.26]
[9,"Wesley Canuto",25,137,"00:01:01.763",61.2]
[9,"Wesley Canuto",25,137,"00:01:01.671",61.29]
[9,"Wesley Canuto",25,137,"00:01:01.813",61.15]
[9,"Wesley Canuto",25,137,"00:01:04.442",58.66]
[9,"Wesley Canuto",25,137,"00:01:01.984",60.98]
[9,"Maurício Júnior",24,124,"00:01:06.780",56.6]
[9,"Maurício Júnior",24,124,"00:01:02.491",60.49]
[9,"Maurício Júnior",24,124,"00:01:02.461",60.52]
[9,"Maurício Júnior",24,124,"00:01:01.784",61.18]
[9,"Maurício Júnior",24,124,"00:01:02.174",60.8]
[9,"Maurício Júnior",24,124,"00:01:01.748",61.22]
[9,"Maurício Júnior",24,124,"00:01:01.411",61.55]
[9,"Maurício Júnior",24,124,"00:01:02.083",60.89]
[9,"Maurício Júnior",24,124,"00:01:02.389",60.59]
[9,"Maurício Júnior",24,124,"00:01:01.786",61.18]
[9,"Maurício Júnior",24,124,"00:01:02.581",60.4]
[9,"Maurício Júnior",24,124,"00:01:01.481",61.48]
[9,"Maurício Júnior",24,124,"00:01:01.723",61.24]
[9,"Maurício Júnior",24,124,"00:01:01.404",61.56]
[9,"Maurício Júnior",24,124,"00:01:02.951",60.05]
[9,"Maurício Júnior",24,124,"00:01:03.568",59.46]
[9,"Maurício Júnior",24,124,"00:01:01.959",61.01]
[9,"Maurício Júnior",24,124,"00:01:01.810",61.16]
[9,"Maurício Júnior",24,124,"00:01:02.064",60.9]
[9,"Maurício Júnior",24,124,"00:01:01.544",61.42]
[9,"Maurício Júnior",24,124,"00:01:01.179",61.79]
[9,"Maurício Júnior",24,124,"00:01:01.659",61.3]
[9,"Maurício Júnior",24,124,"00:01:01.612",61.35]
[9,"Maurício Júnior",24,124,"00:01:01.896",61.07]
[9,"Marcelo Marcondes",3,119,"00:01:06.163",57.13]
[9,"Marcelo Marcondes",3,119,"00:01:05.740",57.5]
[9,"Marcelo Marcondes",3,119,"00:01:46.468",35.5]

{"sheet":"ETAPA 8","index":4,"n_rows":842,"n_cols":12,"rows_kept":842,"cut":false,"hidden":false,"merged":[[0,0,0,6]]}
["Obs.: Selecione até 3 pilotos colocando na frente do seu nome os números 1, 2 e 3.",null,null,null,null,null,null,"PILOTO",{"$f":"J52","v":"Marcelo Clemente"},{"$f":"K52","v":"Wesley Bambirra"},{"$f":"L52","v":"Wesley Canuto"}]
[1,"Marcelo Clemente",null,null,null,null,null,"MÉDIA",{"$f":"AVERAGE(J53:J97)","v":"00:01:00.248"},{"$f":"AVERAGE(K53:K97)","v":"00:01:00.524"},{"$f":"AVERAGE(L53:L97)","v":"00:01:00.583"}]
[2,"Wesley Bambirra",null,null,null,null,null,"MAXIMA",{"$f":"LARGE(J53:J97,1)","v":"00:01:06.171"},{"$f":"LARGE(K53:K97,1)","v":"00:01:06.261"},{"$f":"LARGE(L53:L97,1)","v":"00:01:06.402"}]
[3,"Wesley Canuto",null,null,null,null,null,"MÍNIMA",{"$f":"SMALL(J53:J97,1)","v":"00:00:59.776"},{"$f":"SMALL(K53:K97,1)","v":"00:00:59.734"},{"$f":"SMALL(L53:L97,1)","v":"00:00:59.908"}]
[null,"Guilherme Alves",null,null,null,null,null,"Desvio Padrão",{"$f":"_xlfn.STDEV.S(J53:J97)","v":"00:00:01.147"},{"$f":"_xlfn.STDEV.S(K53:K97)","v":"00:00:01.125"},{"$f":"_xlfn.STDEV.S(L53:L97)","v":"00:00:01.151"}]
[null,"LEO OLIVEIRA",null,null,null,null,null,"TEMPO TOTAL",{"$f":"SUM(J53:J97,1)","v":1.0209194097222223},{"$f":"SUM(K53:K97,1)","v":1.021015300925926},{"$f":"SUM(L53:L97,1)","v":1.0210357986111112}]
[null,"Marcelo Campos"]
[null,"Lucca Veloso"]
[null,"Daniel Nahum"]
[null,"Lucas Guimarães"]
[null,"Marcelo Pereira"]
[null,"Marcelo Marcondes"]
[null,"Alexandre Melillo",null,null,null,null,null,null,null,null,{"$f":"SMALL(I4:K4,1)-L13","v":"00:00:59.734"}]
[null,"Eduardo Henrique",null,null,null,null,null,null,null,null,{"$f":"LARGE(I3:K3,1)+L13","v":"00:01:06.402"}]
[null,"Jarbas Reis"]
[null,"DELCIO RAGAZZI"]
[null,"Vitor Gatti"]
[null,"Rodrigo Ricardo"]
[null,"Reila Ricardo"]
[null,"Hélio Chagas"]
[null,"Felipe Bouhid"]
[null,"Jucimar Vieira"]
[null,"FLAVIO MARQUES"]
[null,"Andre Resende"]
[null,"Tati Marcondes"]
[null,"Izabella Rodrigues"]
[null,"Roberta Epifânio"]
[null,"Marcelo Chagas"]
[]
[]
[]
[1]
[]
[]
[]
[]
[]
[]
[]
[]
[]
[]
[]
[]
[]
[]
[]
[]
[]
["ETAPA","PILOTO","NÚMERO VOLTAS","KART","Volta Tm","velocidade Media",null,null,null,{"$f":"MATCH(J52,$B$51:$B$1500,0)","v":1},{"$f":"MATCH(K52,$B$51:$B$1500,0)","v":31},61]
[8,"Marcelo Clemente",30,148,"00:01:06.171",58.87,null,null,null,{"$f":"VLOOKUP(J$52,$B$50:$F$1500,2,FALSE)","v":30},{"$f":"VLOOKUP(K$52,$B$50:$F$1500,2,FALSE)","v":30},{"$f":"VLOOKUP(L$52,$B$50:$F$1500,2,FALSE)","v":30}]
[8,"Marcelo Clemente",30,148,"00:01:00.609",64.27,null,null,"VOLTA",{"$f":"VLOOKUP(1,$A$2:$B$36,2,FALSE)","v":"Marcelo Clemente"},{"$f":"VLOOKUP(2,$A$2:$B$36,2,FALSE)","v":"Wesley Bambirra"},{"$f":"VLOOKUP(3,$A$2:$B$36,2,FALSE)","v":"Wesley Canuto"}]
[8,"Marcelo Clemente",30,148,"00:01:00.561",64.319999999999993,null,null,1,{"$f":"OFFSET($E$51:$E$1500,J50-1,,J51)","v":"00:01:06.171"},{"$f":"OFFSET($E$51:$E$1500,K50-1,,K51)","v":"00:01:06.261"},{"$f":"OFFSET($E$51:$E$1500,L50-1,,L51)","v":"00:01:06.402"}]
[8,"Marcelo Clemente",30,148,"00:01:00.620",64.260000000000005,null,null,2,"00:01:00.609","00:01:00.536","00:01:01.256"]
[8,"Marcelo Clemente",30,148,"00:01:00.312",64.58,null,null,3,"00:01:00.561","00:01:00.788","00:01:00.610"]
[8,"Marcelo Clemente",30,148,"00:01:00.401",64.489999999999995,null,null,4,"00:01:00.620","00:01:00.651","00:01:00.333"]
[8,"Marcelo Clemente",30,148,"00:01:00.405",64.48,null,null,5,"00:01:00.312","00:01:00.136","00:01:00.249"]
[8,"Marcelo Clemente",30,148,"00:01:00.246",64.650000000000006,null,null,6,"00:01:00.401","00:01:00.209","00:01:00.110"]
[8,"Marcelo Clemente",30,148,"00:01:00.072",64.84,null,null,7,"00:01:00.405","00:00:59.913","00:01:00.903"]
[8,"Marcelo Clemente",30,148,"00:01:00.175",64.73,null,null,8,"00:01:00.246","00:01:00.535","00:01:00.813"]
[8,"Marcelo Clemente",30,148,"00:00:59.981",64.94,null,null,9,"00:01:00.072","00:01:00.132","00:01:00.392"]
[8,"Marcelo Clemente",30,148,"00:01:00.016",64.900000000000006,null,null,10,"00:01:00.175","00:01:00.216","00:01:00.398"]
[8,"Marcelo Clemente",30,148,"00:00:59.928",65,null,null,11,"00:00:59.981","00:01:00.331","00:01:00.265"]
[8,"Marcelo Clemente",30,148,"00:00:59.802",65.13,null,null,12,"00:01:00.016","00:01:00.376","00:01:00.289"]
[8,"Marcelo Clemente",30,148,"00:00:59.833",65.099999999999994,null,null,13,"00:00:59.928","00:01:00.161","00:01:00.102"]
[8,"Marcelo Clemente",30,148,"00:00:59.884",65.05,null,null,14,"00:00:59.802","00:01:00.049","00:00:59.908"]
[8,"Marcelo Clemente",30,148,"00:00:59.886",65.040000000000006,null,null,15,"00:00:59.833","00:01:00.718","00:01:00.139"]
[8,"Marcelo Clemente",30,148,"00:00:59.857",65.08,null,null,16,"00:00:59.884","00:01:00.184","00:01:00.065"]
[8,"Marcelo Clemente",30,148,"00:00:59.954",64.97,null,null,17,"00:00:59.886","00:00:59.734","00:01:00.076"]
[8,"Marcelo Clemente",30,148,"00:00:59.853",65.08,null,null,18,"00:00:59.857","00:01:00.239","00:01:00.069"]
[8,"Marcelo Clemente",30,148,"00:00:59.776",65.16,null,null,19,"00:00:59.954","00:01:00.461","00:01:01.026"]
[8,"Marcelo Clemente",30,148,"00:00:59.932",64.989999999999995,null,null,20,"00:00:59.853","00:01:00.149","00:01:00.228"]
[8,"Marcelo Clemente",30,148,"00:00:59.785",65.150000000000006,null,null,21,"00:00:59.776","00:01:00.016","00:00:59.987"]
[8,"Marcelo Clemente",30,148,"00:00:59.940",64.98,null,null,22,"00:00:59.932","00:01:00.205","00:01:00.228"]
[8,"Marcelo Clemente",30,148,"00:00:59.905",65.02,null,null,23,"00:00:59.785","00:01:00.537","00:01:00.517"]
[8,"Marcelo Clemente",30,148,"00:00:59.970",64.95,null,null,24,"00:00:59.940","00:01:00.391","00:01:00.374"]
[8,"Marcelo Clemente",30,148,"00:00:59.991",64.930000000000007,null,null,25,"00:00:59.905","00:01:01.300","00:01:00.639"]
[8,"Marcelo Clemente",30,148,"00:00:59.849",65.08,null,null,26,"00:00:59.970","00:01:00.052","00:01:00.174"]
[8,"Marcelo Clemente",30,148,"00:00:59.880",65.05,null,null,27,"00:00:59.991","00:01:00.075","00:01:00.039"]
[8,"Marcelo Clemente",30,148,"00:00:59.843",65.09,null,null,28,"00:00:59.849","00:01:00.457","00:01:01.057"]
[8,"Wesley Bambirra",30,114,"00:01:06.261",58.79,null,null,29,"00:00:59.880","00:01:00.418","00:01:00.354"]
[8,"Wesley Bambirra",30,114,"00:01:00.536",64.349999999999994,null,null,30,"00:00:59.843","00:01:00.492","00:01:00.491"]
[8,"Wesley Bambirra",30,114,"00:01:00.788",64.08,null,null,31]
[8,"Wesley Bambirra",30,114,"00:01:00.651",64.22,null,null,32]
[8,"Wesley Bambirra",30,114,"00:01:00.136",64.77,null,null,33]
[8,"Wesley Bambirra",30,114,"00:01:00.209",64.69,null,null,34]
[8,"Wesley Bambirra",30,114,"00:00:59.913",65.010000000000005,null,null,35]
[8,"Wesley Bambirra",30,114,"00:01:00.535",64.349999999999994,null,null,36]
[8,"Wesley Bambirra",30,114,"00:01:00.132",64.78,null,null,37]
[8,"Wesley Bambirra",30,114,"00:01:00.216",64.69,null,null,38]
[8,"Wesley Bambirra",30,114,"00:01:00.331",64.56,null,null,39]
[8,"Wesley Bambirra",30,114,"00:01:00.376",64.52,null,null,40]
[8,"Wesley Bambirra",30,114,"00:01:00.161",64.75,null,null,41]
[8,"Wesley Bambirra",30,114,"00:01:00.049",64.87,null,null,42]
[8,"Wesley Bambirra",30,114,"00:01:00.718",64.150000000000006,null,null,43]
[8,"Wesley Bambirra",30,114,"00:01:00.184",64.72,null,null,44]
[8,"Wesley Bambirra",30,114,"00:00:59.734",65.209999999999994,null,null,45]
[8,"Wesley Bambirra",30,114,"00:01:00.239",64.66]
[8,"Wesley Bambirra",30,114,"00:01:00.461",64.430000000000007]
[8,"Wesley Bambirra",30,114,"00:01:00.149",64.760000000000005]
[8,"Wesley Bambirra",30,114,"00:01:00.016",64.900000000000006]
[8,"Wesley Bambirra",30,114,"00:01:00.205",64.7]
[8,"Wesley Bambirra",30,114,"00:01:00.537",64.34]
[8,"Wesley Bambirra",30,114,"00:01:00.391",64.5]
[8,"Wesley Bambirra",30,114,"00:01:01.300",63.54]
[8,"Wesley Bambirra",30,114,"00:01:00.052",64.86]
[8,"Wesley Bambirra",30,114,"00:01:00.075",64.84]
[8,"Wesley Bambirra",30,114,"00:01:00.457",64.430000000000007]
[8,"Wesley Bambirra",30,114,"00:01:00.418",64.47]
[8,"Wesley Bambirra",30,114,"00:01:00.492",64.39]
[8,"Wesley Canuto",30,118,"00:01:06.402",58.66]
[8,"Wesley Canuto",30,118,"00:01:01.256",63.59]
[8,"Wesley Canuto",30,118,"00:01:00.610",64.27]
[8,"Wesley Canuto",30,118,"00:01:00.333",64.56]
[8,"Wesley Canuto",30,118,"00:01:00.249",64.650000000000006]
[8,"Wesley Canuto",30,118,"00:01:00.110",64.8]
[8,"Wesley Canuto",30,118,"00:01:00.903",63.96]
[8,"Wesley Canuto",30,118,"00:01:00.813",64.05]
[8,"Wesley Canuto",30,118,"00:01:00.392",64.5]
[8,"Wesley Canuto",30,118,"00:01:00.398",64.489999999999995]
[8,"Wesley Canuto",30,118,"00:01:00.265",64.63]
[8,"Wesley Canuto",30,118,"00:01:00.289",64.61]
[8,"Wesley Canuto",30,118,"00:01:00.102",64.81]
[8,"Wesley Canuto",30,118,"00:00:59.908",65.02]
[8,"Wesley Canuto",30,118,"00:01:00.139",64.77]
[8,"Wesley Canuto",30,118,"00:01:00.065",64.849999999999994]
[8,"Wesley Canuto",30,118,"00:01:00.076",64.84]
[8,"Wesley Canuto",30,118,"00:01:00.069",64.849999999999994]
[8,"Wesley Canuto",30,118,"00:01:01.026",63.83]
[8,"Wesley Canuto",30,118,"00:01:00.228",64.67]
[8,"Wesley Canuto",30,118,"00:00:59.987",64.930000000000007]
[8,"Wesley Canuto",30,118,"00:01:00.228",64.67]
[8,"Wesley Canuto",30,118,"00:01:00.517",64.37]
[8,"Wesley Canuto",30,118,"00:01:00.374",64.52]
[8,"Wesley Canuto",30,118,"00:01:00.639",64.239999999999995]
[8,"Wesley Canuto",30,118,"00:01:00.174",64.73]
[8,"Wesley Canuto",30,118,"00:01:00.039",64.88]
[8,"Wesley Canuto",30,118,"00:01:01.057",63.8]
[8,"Wesley Canuto",30,118,"00:01:00.354",64.540000000000006]
[8,"Wesley Canuto",30,118,"00:01:00.491",64.39]
[8,"Guilherme Alves",30,129,"00:01:06.614",58.47]
[8,"Guilherme Alves",30,129,"00:01:01.366",63.47]
[8,"Guilherme Alves",30,129,"00:01:00.638",64.239999999999995]
[8,"Guilherme Alves",30,129,"00:01:00.324",64.569999999999993]
[8,"Guilherme Alves",30,129,"00:01:00.249",64.650000000000006]
[8,"Guilherme Alves",30,129,"00:01:00.133",64.78]
[8,"Guilherme Alves",30,129,"00:01:00.881",63.98]
[8,"Guilherme Alves",30,129,"00:01:00.339",64.56]
[8,"Guilherme Alves",30,129,"00:01:00.799",64.069999999999993]
[8,"Guilherme Alves",30,129,"00:01:00.446",64.44]
[8,"Guilherme Alves",30,129,"00:01:00.262",64.64]
[8,"Guilherme Alves",30,129,"00:01:00.320",64.58]
[8,"Guilherme Alves",30,129,"00:01:00.088",64.819999999999993]
[8,"Guilherme Alves",30,129,"00:00:59.920",65.010000000000005]
[8,"Guilherme Alves",30,129,"00:01:00.143",64.77]
[8,"Guilherme Alves",30,129,"00:01:00.063",64.849999999999994]
[8,"Guilherme Alves",30,129,"00:01:00.072",64.84]
[8,"Guilherme Alves",30,129,"00:01:00.074",64.84]
[8,"Guilherme Alves",30,129,"00:01:01.015",63.84]
[8,"Guilherme Alves",30,129,"00:01:00.152",64.760000000000005]
[8,"Guilherme Alves",30,129,"00:01:00.050",64.87]
[8,"Guilherme Alves",30,129,"00:01:00.222",64.680000000000007]
[8,"Guilherme Alves",30,129,"00:01:00.509",64.37]
[8,"Guilherme Alves",30,129,"00:01:00.355",64.540000000000006]
[8,"Guilherme Alves",30,129,"00:01:00.694",64.180000000000007]
[8,"Guilherme Alves",30,129,"00:01:00.171",64.739999999999995]
[8,"Guilherme Alves",30,129,"00:01:00.042",64.87]
[8,"Guilherme Alves",30,129,"00:01:01.020",63.83]
[8,"Guilherme Alves",30,129,"00:01:00.392",64.5]
[8,"Guilherme Alves",30,129,"00:01:00.598",64.28]
[8,"LEO OLIVEIRA",30,149,"00:01:06.257",58.79]
[8,"LEO OLIVEIRA",30,149,"00:01:01.836",62.99]
[8,"LEO OLIVEIRA",30,149,"00:01:00.516",64.37]
[8,"LEO OLIVEIRA",30,149,"00:01:00.646",64.23]
[8,"LEO OLIVEIRA",30,149,"00:01:00.796",64.069999999999993]
[8,"LEO OLIVEIRA",30,149,"00:01:00.630",64.25]
[8,"LEO OLIVEIRA",30,149,"00:01:00.283",64.62]
[8,"LEO OLIVEIRA",30,149,"00:01:00.375",64.52]
[8,"LEO OLIVEIRA",30,149,"00:01:00.159",64.75]
[8,"LEO OLIVEIRA",30,149,"00:01:00.383",64.510000000000005]
[8,"LEO OLIVEIRA",30,149,"00:00:59.828",65.11]
[8,"LEO OLIVEIRA",30,149,"00:00:59.898",65.03]
[8,"LEO OLIVEIRA",30,149,"00:01:00.041",64.88]
[8,"LEO OLIVEIRA",30,149,"00:00:59.971",64.95]
[8,"LEO OLIVEIRA",30,149,"00:00:59.933",64.989999999999995]
[8,"LEO OLIVEIRA",30,149,"00:00:59.967",64.959999999999994]
[8,"LEO OLIVEIRA",30,149,"00:00:59.885",65.040000000000006]
[8,"LEO OLIVEIRA",30,149,"00:01:00.481",64.400000000000006]
[8,"LEO OLIVEIRA",30,149,"00:00:59.727",65.22]
[8,"LEO OLIVEIRA",30,149,"00:01:01.280",63.56]
[8,"LEO OLIVEIRA",30,149,"00:01:00.070",64.84]
[8,"LEO OLIVEIRA",30,149,"00:00:59.876",65.05]
[8,"LEO OLIVEIRA",30,149,"00:00:59.907",65.02]
[8,"LEO OLIVEIRA",30,149,"00:01:00.153",64.75]
[8,"LEO OLIVEIRA",30,149,"00:00:59.958",64.97]
[8,"LEO OLIVEIRA",30,149,"00:00:59.765",65.180000000000007]
[8,"LEO OLIVEIRA",30,149,"00:00:59.726",65.22]
[8,"LEO OLIVEIRA",30,149,"00:00:59.916",65.010000000000005]
[8,"LEO OLIVEIRA",30,149,"00:00:59.941",64.98]
[8,"LEO OLIVEIRA",30,149,"00:00:59.699",65.25]
[8,"Marcelo Campos",30,116,"00:01:10.166",55.51]
[8,"Marcelo Campos",30,116,"00:01:02.232",62.59]
[8,"Marcelo Campos",30,116,"00:01:00.766",64.099999999999994]
[8,"Marcelo Campos",30,116,"00:01:02.147",62.68]
[8,"Marcelo Campos",30,116,"00:01:00.435",64.45]
[8,"Marcelo Campos",30,116,"00:01:00.692",64.180000000000007]
[8,"Marcelo Campos",30,116,"00:01:00.588",64.290000000000006]
[8,"Marcelo Campos",30,116,"00:00:59.889",65.040000000000006]
[8,"Marcelo Campos",30,116,"00:00:59.904",65.02]
[8,"Marcelo Campos",30,116,"00:01:00.076",64.84]
[8,"Marcelo Campos",30,116,"00:00:59.821",65.11]
[8,"Marcelo Campos",30,116,"00:00:59.906",65.02]
[8,"Marcelo Campos",30,116,"00:01:00.039",64.88]
[8,"Marcelo Campos",30,116,"00:00:59.943",64.98]
[8,"Marcelo Campos",30,116,"00:00:59.958",64.97]
[8,"Marcelo Campos",30,116,"00:00:59.970",64.95]
[8,"Marcelo Campos",30,116,"00:00:59.888",65.040000000000006]
[8,"Marcelo Campos",30,116,"00:00:59.864",65.069999999999993]
[8,"Marcelo Campos",30,116,"00:01:00.124",64.790000000000006]
[8,"Marcelo Campos",30,116,"00:01:02.476",62.35]
[8,"Marcelo Campos",30,116,"00:01:00.254",64.650000000000006]
[8,"Marcelo Campos",30,116,"00:01:00.017",64.900000000000006]
[8,"Marcelo Campos",30,116,"00:01:00.339",64.56]
[8,"Marcelo Campos",30,116,"00:01:00.424",64.459999999999994]
[8,"Marcelo Campos",30,116,"00:01:00.303",64.59]
[8,"Marcelo Campos",30,116,"00:01:00.321",64.569999999999993]
[8,"Marcelo Campos",30,116,"00:01:00.346",64.55]
[8,"Marcelo Campos",30,116,"00:01:00.354",64.540000000000006]
[8,"Marcelo Campos",30,116,"00:01:00.453",64.430000000000007]
[8,"Marcelo Campos",30,116,"00:01:00.374",64.52]
[8,"Lucca Veloso",30,128,"00:01:05.951",59.06]
[8,"Lucca Veloso",30,128,"00:01:03.122",61.71]
[8,"Lucca Veloso",30,128,"00:01:00.885",63.98]
[8,"Lucca Veloso",30,128,"00:01:02.217",62.61]
[8,"Lucca Veloso",30,128,"00:01:01.205",63.64]
[8,"Lucca Veloso",30,128,"00:01:00.638",64.239999999999995]
[8,"Lucca Veloso",30,128,"00:01:01.595",63.24]
[8,"Lucca Veloso",30,128,"00:01:00.707",64.16]
[8,"Lucca Veloso",30,128,"00:01:00.288",64.61]
[8,"Lucca Veloso",30,128,"00:01:00.163",64.739999999999995]
[8,"Lucca Veloso",30,128,"00:01:00.732",64.14]
[8,"Lucca Veloso",30,128,"00:01:00.284",64.61]
[8,"Lucca Veloso",30,128,"00:01:00.153",64.75]
[8,"Lucca Veloso",30,128,"00:01:00.188",64.72]
[8,"Lucca Veloso",30,128,"00:01:00.555",64.319999999999993]
[8,"Lucca Veloso",30,128,"00:01:00.067",64.849999999999994]
[8,"Lucca Veloso",30,128,"00:00:59.906",65.02]
[8,"Lucca Veloso",30,128,"00:00:59.951",64.97]
[8,"Lucca Veloso",30,128,"00:00:59.695",65.25]
[8,"Lucca Veloso",30,128,"00:01:00.026",64.89]
[8,"Lucca Veloso",30,128,"00:01:00.235",64.67]
[8,"Lucca Veloso",30,128,"00:01:00.092",64.819999999999993]
[8,"Lucca Veloso",30,128,"00:01:00.161",64.75]
[8,"Lucca Veloso",30,128,"00:01:00.047",64.87]
[8,"Lucca Veloso",30,128,"00:01:00.044",64.87]
[8,"Lucca Veloso",30,128,"00:00:59.908",65.02]
[8,"Lucca Veloso",30,128,"00:00:59.830",65.099999999999994]
[8,"Lucca Veloso",30,128,"00:01:00.266",64.63]
[8,"Lucca Veloso",30,128,"00:00:59.979",64.94]
[8,"Lucca Veloso",30,128,"00:00:59.924",65]
[8,"Daniel Nahum",30,127,"00:01:05.894",59.11]
[8,"Daniel Nahum",30,127,"00:01:01.140",63.71]
[8,"Daniel Nahum",30,127,"00:01:00.826",64.040000000000006]
[8,"Daniel Nahum",30,127,"00:01:01.099",63.75]
[8,"Daniel Nahum",30,127,"00:01:00.511",64.37]
[8,"Daniel Nahum",30,127,"00:01:01.014",63.84]
[8,"Daniel Nahum",30,127,"00:01:00.285",64.61]
[8,"Daniel Nahum",30,127,"00:01:00.542",64.34]
[8,"Daniel Nahum",30,127,"00:01:00.683",64.19]
[8,"Daniel Nahum",30,127,"00:01:00.508",64.37]
[8,"Daniel Nahum",30,127,"00:01:00.328",64.569999999999993]
[8,"Daniel Nahum",30,127,"00:01:00.617",64.260000000000005]
[8,"Daniel Nahum",30,127,"00:01:00.715",64.16]
[8,"Daniel Nahum",30,127,"00:01:00.383",64.510000000000005]
[8,"Daniel Nahum",30,127,"00:01:00.148",64.760000000000005]
[8,"Daniel Nahum",30,127,"00:01:00.548",64.33]
[8,"Daniel Nahum",30,127,"00:01:00.405",64.48]
[8,"Daniel Nahum",30,127,"00:01:00.723",64.150000000000006]
[8,"Daniel Nahum",30,127,"00:00:59.914",65.010000000000005]
[8,"Daniel Nahum",30,127,"00:01:02.631",62.19]
[8,"Daniel Nahum",30,127,"00:01:00.536",64.349999999999994]
[8,"Daniel Nahum",30,127,"00:01:00.224",64.680000000000007]
[8,"Daniel Nahum",30,127,"00:01:00.417",64.47]
[8,"Daniel Nahum",30,127,"00:01:00.872",63.99]
[8,"Daniel Nahum",30,127,"00:01:00.345",64.55]
[8,"Daniel Nahum",30,127,"00:01:00.272",64.63]
[8,"Daniel Nahum",30,127,"00:01:00.162",64.75]
[8,"Daniel Nahum",30,127,"00:01:00.550",64.33]
[8,"Daniel Nahum",30,127,"00:01:00.354",64.540000000000006]
[8,"Daniel Nahum",30,127,"00:01:00.049",64.87]
[8,"Lucas Guimarães",30,145,"00:01:08.003",57.28]
[8,"Lucas Guimarães",30,145,"00:01:02.364",62.46]
[8,"Lucas Guimarães",30,145,"00:01:01.451",63.39]
[8,"Lucas Guimarães",30,145,"00:01:03.217",61.62]
[8,"Lucas Guimarães",30,145,"00:01:00.901",63.96]
[8,"Lucas Guimarães",30,145,"00:01:00.285",64.61]
[8,"Lucas Guimarães",30,145,"00:01:00.637",64.239999999999995]
[8,"Lucas Guimarães",30,145,"00:01:00.353",64.540000000000006]
[8,"Lucas Guimarães",30,145,"00:01:00.508",64.37]
[8,"Lucas Guimarães",30,145,"00:01:00.279",64.62]
[8,"Lucas Guimarães",30,145,"00:01:00.321",64.569999999999993]
[8,"Lucas Guimarães",30,145,"00:01:00.207",64.7]
[8,"Lucas Guimarães",30,145,"00:01:00.895",63.97]
[8,"Lucas Guimarães",30,145,"00:01:00.360",64.53]
[8,"Lucas Guimarães",30,145,"00:01:00.243",64.66]
[8,"Lucas Guimarães",30,145,"00:01:00.099",64.81]
[8,"Lucas Guimarães",30,145,"00:01:00.536",64.349999999999994]
[8,"Lucas Guimarães",30,145,"00:01:00.484",64.400000000000006]
[8,"Lucas Guimarães",30,145,"00:01:00.058",64.86]
[8,"Lucas Guimarães",30,145,"00:00:59.996",64.92]
[8,"Lucas Guimarães",30,145,"00:01:00.867",64]
[8,"Lucas Guimarães",30,145,"00:01:00.136",64.77]
[8,"Lucas Guimarães",30,145,"00:01:00.295",64.599999999999994]
[8,"Lucas Guimarães",30,145,"00:01:00.197",64.709999999999994]
[8,"Lucas Guimarães",30,145,"00:01:00.046",64.87]
[8,"Lucas Guimarães",30,145,"00:01:00.016",64.900000000000006]
[8,"Lucas Guimarães",30,145,"00:01:00.261",64.64]
[8,"Lucas Guimarães",30,145,"00:01:00.114",64.8]
[8,"Lucas Guimarães",30,145,"00:01:00.221",64.680000000000007]
[8,"Lucas Guimarães",30,145,"00:01:00.134",64.78]
[8,"Marcelo Pereira",30,112,"00:01:08.034",57.25]
[8,"Marcelo Pereira",30,112,"00:01:02.129",62.7]
[8,"Marcelo Pereira",30,112,"00:01:01.091",63.76]
[8,"Marcelo Pereira",30,112,"00:01:00.877",63.98]
[8,"Marcelo Pereira",30,112,"00:01:01.656",63.18]
[8,"Marcelo Pereira",30,112,"00:01:01.498",63.34]
[8,"Marcelo Pereira",30,112,"00:01:01.100",63.75]
[8,"Marcelo Pereira",30,112,"00:01:00.503",64.38]
[8,"Marcelo Pereira",30,112,"00:01:00.416",64.47]
[8,"Marcelo Pereira",30,112,"00:01:00.334",64.56]
[8,"Marcelo Pereira",30,112,"00:00:59.978",64.94]
[8,"Marcelo Pereira",30,112,"00:01:00.258",64.64]
[8,"Marcelo Pereira",30,112,"00:01:00.156",64.75]
[8,"Marcelo Pereira",30,112,"00:00:59.813",65.12]
[8,"Marcelo Pereira",30,112,"00:01:00.046",64.87]
[8,"Marcelo Pereira",30,112,"00:01:00.023",64.900000000000006]
[8,"Marcelo Pereira",30,112,"00:01:00.323",64.569999999999993]
[8,"Marcelo Pereira",30,112,"00:00:59.842",65.09]
[8,"Marcelo Pereira",30,112,"00:00:59.857",65.08]
[8,"Marcelo Pereira",30,112,"00:01:00.027",64.89]
[8,"Marcelo Pereira",30,112,"00:01:01.661",63.17]
[8,"Marcelo Pereira",30,112,"00:01:00.285",64.61]
[8,"Marcelo Pereira",30,112,"00:01:00.179",64.73]
[8,"Marcelo Pereira",30,112,"00:01:00.181",64.72]
[8,"Marcelo Pereira",30,112,"00:01:00.124",64.790000000000006]
[8,"Marcelo Pereira",30,112,"00:00:59.989",64.930000000000007]
[8,"Marcelo Pereira",30,112,"00:00:59.950",64.97]
[8,"Marcelo Pereira",30,112,"00:00:59.980",64.94]
[8,"Marcelo Pereira",30,112,"00:00:59.776",65.16]
[8,"Marcelo Pereira",30,112,"00:01:00.083",64.83]
[8,"Marcelo Marcondes",30,155,"00:01:06.761",58.35]
[8,"Marcelo Marcondes",30,155,"00:01:03.155",61.68]
[8,"Marcelo Marcondes",30,155,"00:01:01.520",63.32]
[8,"Marcelo Marcondes",30,155,"00:01:00.900",63.96]
[8,"Marcelo Marcondes",30,155,"00:01:01.286",63.56]
[8,"Marcelo Marcondes",30,155,"00:01:02.063",62.76]
[8,"Marcelo Marcondes",30,155,"00:01:00.898",63.96]
[8,"Marcelo Marcondes",30,155,"00:01:00.417",64.47]
[8,"Marcelo Marcondes",30,155,"00:01:00.412",64.48]
[8,"Marcelo Marcondes",30,155,"00:01:00.402",64.489999999999995]
[8,"Marcelo Marcondes",30,155,"00:01:00.174",64.73]
[8,"Marcelo Marcondes",30,155,"00:01:00.691",64.180000000000007]
[8,"Marcelo Marcondes",30,155,"00:01:00.418",64.47]
[8,"Marcelo Marcondes",30,155,"00:01:00.380",64.510000000000005]
[8,"Marcelo Marcondes",30,155,"00:01:00.226",64.680000000000007]
[8,"Marcelo Marcondes",30,155,"00:01:00.155",64.75]
[8,"Marcelo Marcondes",30,155,"00:01:00.300",64.599999999999994]
[8,"Marcelo Marcondes",30,155,"00:01:00.488",64.400000000000006]
[8,"Marcelo Marcondes",30,155,"00:01:00.331",64.56]
[8,"Marcelo Marcondes",30,155,"00:01:00.107",64.8]
[8,"Marcelo Marcondes",30,155,"00:01:00.233",64.67]
[8,"Marcelo Marcondes",30,155,"00:01:00.270",64.63]
[8,"Marcelo Marcondes",30,155,"00:00:59.758",65.180000000000007]
[8,"Marcelo Marcondes",30,155,"00:00:59.965",64.959999999999994]
[8,"Marcelo Marcondes",30,155,"00:01:00.755",64.11]
[8,"Marcelo Marcondes",30,155,"00:01:00.087",64.83]
[8,"Marcelo Marcondes",30,155,"00:01:00.184",64.72]
[8,"Marcelo Marcondes",30,155,"00:01:00.075",64.84]
[8,"Marcelo Marcondes",30,155,"00:01:00.028",64.89]
[8,"Marcelo Marcondes",30,155,"00:01:00.128",64.78]
[8,"Alexandre Melillo",30,130,"00:01:09.816",55.79]
[8,"Alexandre Melillo",30,130,"00:01:02.418",62.41]
[8,"Alexandre Melillo",30,130,"00:01:00.969",63.89]
[8,"Alexandre Melillo",30,130,"00:01:03.082",61.75]
[8,"Alexandre Melillo",30,130,"00:01:02.776",62.05]
[8,"Alexandre Melillo",30,130,"00:01:00.914",63.95]
[8,"Alexandre Melillo",30,130,"00:01:00.860",64]
[8,"Alexandre Melillo",30,130,"00:01:00.790",64.08]
[8,"Alexandre Melillo",30,130,"00:01:00.459",64.430000000000007]
[8,"Alexandre Melillo",30,130,"00:01:00.442",64.45]
[8,"Alexandre Melillo",30,130,"00:01:00.181",64.72]
[8,"Alexandre Melillo",30,130,"00:01:00.590",64.290000000000006]
[8,"Alexandre Melillo",30,130,"00:01:00.504",64.38]
[8,"Alexandre Melillo",30,130,"00:01:00.747",64.12]
[8,"Alexandre Melillo",30,130,"00:01:00.375",64.52]
[8,"Alexandre Melillo",30,130,"00:01:00.176",64.73]
[8,"Alexandre Melillo",30,130,"00:01:00.785",64.08]
[8,"Alexandre Melillo",30,130,"00:01:00.123",64.790000000000006]
[8,"Alexandre Melillo",30,130,"00:00:59.967",64.959999999999994]
[8,"Alexandre Melillo",30,130,"00:01:00.304",64.59]
[8,"Alexandre Melillo",30,130,"00:01:00.114",64.8]
[8,"Alexandre Melillo",30,130,"00:01:00.177",64.73]
[8,"Alexandre Melillo",30,130,"00:01:00.026",64.89]
[8,"Alexandre Melillo",30,130,"00:00:59.969",64.95]
[8,"Alexandre Melillo",30,130,"00:01:00.892",63.97]
[8,"Alexandre Melillo",30,130,"00:01:00.071",64.84]
[8,"Alexandre Melillo",30,130,"00:01:02.579",62.24]
[8,"Alexandre Melillo",30,130,"00:01:00.689",64.180000000000007]
[8,"Alexandre Melillo",30,130,"00:01:00.260",64.64]
[8,"Alexandre Melillo",30,130,"00:01:00.126",64.78]
[8,"Eduardo Henrique",30,104,"00:01:07.221",57.95]
[8,"Eduardo Henrique",30,104,"00:01:01.260",63.58]
[8,"Eduardo Henrique",30,104,"00:01:00.824",64.040000000000006]
[8,"Eduardo Henrique",30,104,"00:01:01.103",63.75]
[8,"Eduardo Henrique",30,104,"00:01:00.515",64.37]
[8,"Eduardo Henrique",30,104,"00:01:01.332",63.51]
[8,"Eduardo Henrique",30,104,"00:01:00.722",64.150000000000006]
[8,"Eduardo Henrique",30,104,"00:01:00.656",64.22]
[8,"Eduardo Henrique",30,104,"00:01:00.844",64.02]
[8,"Eduardo Henrique",30,104,"00:01:00.874",63.99]
[8,"Eduardo Henrique",30,104,"00:01:00.884",63.98]
[8,"Eduardo Henrique",30,104,"00:01:00.832",64.03]
[8,"Eduardo Henrique",30,104,"00:01:01.290",63.55]
[8,"Eduardo Henrique",30,104,"00:01:00.508",64.37]
[8,"Eduardo Henrique",30,104,"00:01:00.726",64.14]
[8,"Eduardo Henrique",30,104,"00:01:00.786",64.08]
[8,"Eduardo Henrique",30,104,"00:01:00.701",64.17]
[8,"Eduardo Henrique",30,104,"00:01:00.898",63.96]
[8,"Eduardo Henrique",30,104,"00:01:00.825",64.040000000000006]
[8,"Eduardo Henrique",30,104,"00:01:01.409",63.43]
[8,"Eduardo Henrique",30,104,"00:01:01.059",63.79]
[8,"Eduardo Henrique",30,104,"00:01:00.675",64.2]
[8,"Eduardo Henrique",30,104,"00:01:00.445",64.44]
[8,"Eduardo Henrique",30,104,"00:01:00.882",63.98]
[8,"Eduardo Henrique",30,104,"00:01:00.627",64.25]
[8,"Eduardo Henrique",30,104,"00:01:00.411",64.48]
[8,"Eduardo Henrique",30,104,"00:01:02.828",62]
[8,"Eduardo Henrique",30,104,"00:01:00.769",64.099999999999994]
[8,"Eduardo Henrique",30,104,"00:01:00.507",64.38]
[8,"Eduardo Henrique",30,104,"00:01:00.946",63.91]
[8,"Jarbas Reis",30,137,"00:01:12.234",53.92]
[8,"Jarbas Reis",30,137,"00:01:02.526",62.3]
[8,"Jarbas Reis",30,137,"00:01:01.109",63.74]
[8,"Jarbas Reis",30,137,"00:01:01.526",63.31]
[8,"Jarbas Reis",30,137,"00:01:02.232",62.59]
[8,"Jarbas Reis",30,137,"00:01:01.490",63.35]
[8,"Jarbas Reis",30,137,"00:01:00.601",64.28]
[8,"Jarbas Reis",30,137,"00:01:01.081",63.77]
[8,"Jarbas Reis",30,137,"00:01:00.836",64.03]
[8,"Jarbas Reis",30,137,"00:01:00.902",63.96]
[8,"Jarbas Reis",30,137,"00:01:00.650",64.22]
[8,"Jarbas Reis",30,137,"00:01:01.015",63.84]
[8,"Jarbas Reis",30,137,"00:01:00.940",63.92]
[8,"Jarbas Reis",30,137,"00:01:00.643",64.23]
[8,"Jarbas Reis",30,137,"00:01:00.757",64.11]
[8,"Jarbas Reis",30,137,"00:01:00.719",64.150000000000006]
[8,"Jarbas Reis",30,137,"00:01:00.822",64.040000000000006]
[8,"Jarbas Reis",30,137,"00:01:00.974",63.88]
[8,"Jarbas Reis",30,137,"00:01:00.909",63.95]
[8,"Jarbas Reis",30,137,"00:01:00.822",64.040000000000006]
[8,"Jarbas Reis",30,137,"00:01:00.866",64]
[8,"Jarbas Reis",30,137,"00:01:00.859",64]
[8,"Jarbas Reis",30,137,"00:01:00.834",64.03]
[8,"Jarbas Reis",30,137,"00:01:00.843",64.02]
[8,"Jarbas Reis",30,137,"00:01:00.857",64.010000000000005]
[8,"Jarbas Reis",30,137,"00:01:01.137",63.71]
[8,"Jarbas Reis",30,137,"00:01:00.657",64.22]
[8,"Jarbas Reis",30,137,"00:01:00.975",63.88]
[8,"Jarbas Reis",30,137,"00:01:00.794",64.069999999999993]
[8,"Jarbas Reis",30,137,"00:01:00.656",64.22]
[8,"DELCIO RAGAZZI",30,102,"00:01:07.605",57.62]
[8,"DELCIO RAGAZZI",30,102,"00:01:02.273",62.55]
[8,"DELCIO RAGAZZI",30,102,"00:01:01.186",63.66]
[8,"DELCIO RAGAZZI",30,102,"00:01:01.443",63.4]
[8,"DELCIO RAGAZZI",30,102,"00:01:02.377",62.45]
[8,"DELCIO RAGAZZI",30,102,"00:01:01.828",63]
[8,"DELCIO RAGAZZI",30,102,"00:01:01.353",63.49]
[8,"DELCIO RAGAZZI",30,102,"00:01:01.520",63.32]
[8,"DELCIO RAGAZZI",30,102,"00:01:00.774",64.09]
[8,"DELCIO RAGAZZI",30,102,"00:01:02.041",62.78]
[8,"DELCIO RAGAZZI",30,102,"00:01:00.545",64.34]
[8,"DELCIO RAGAZZI",30,102,"00:01:00.527",64.349999999999994]
[8,"DELCIO RAGAZZI",30,102,"00:01:00.769",64.099999999999994]
[8,"DELCIO RAGAZZI",30,102,"00:01:01.718",63.11]
[8,"DELCIO RAGAZZI",30,102,"00:01:01.060",63.79]
[8,"DELCIO RAGAZZI",30,102,"00:01:00.251",64.650000000000006]
[8,"DELCIO RAGAZZI",30,102,"00:01:00.304",64.59]
[8,"DELCIO RAGAZZI",30,102,"00:01:01.242",63.6]
[8,"DELCIO RAGAZZI",30,102,"00:01:00.945",63.91]
[8,"DELCIO RAGAZZI",30,102,"00:01:00.497",64.39]
[8,"DELCIO RAGAZZI",30,102,"00:01:00.636",64.239999999999995]
[8,"DELCIO RAGAZZI",30,102,"00:01:00.473",64.41]
[8,"DELCIO RAGAZZI",30,102,"00:01:00.430",64.459999999999994]
[8,"DELCIO RAGAZZI",30,102,"00:01:00.411",64.48]
[8,"DELCIO RAGAZZI",30,102,"00:01:00.232",64.67]
[8,"DELCIO RAGAZZI",30,102,"00:01:00.158",64.75]
[8,"DELCIO RAGAZZI",30,102,"00:01:00.306",64.59]
[8,"DELCIO RAGAZZI",30,102,"00:01:00.979",63.88]
[8,"DELCIO RAGAZZI",30,102,"00:01:00.865",64]
[8,"DELCIO RAGAZZI",30,102,"00:01:00.603",64.27]
[8,"Vitor Gatti",30,113,"00:01:09.080",56.39]
[8,"Vitor Gatti",30,113,"00:01:02.497",62.33]
[8,"Vitor Gatti",30,113,"00:01:01.989",62.84]
[8,"Vitor Gatti",30,113,"00:01:01.357",63.48]
[8,"Vitor Gatti",30,113,"00:01:01.671",63.16]
[8,"Vitor Gatti",30,113,"00:01:01.579",63.26]
[8,"Vitor Gatti",30,113,"00:01:01.367",63.47]
[8,"Vitor Gatti",30,113,"00:01:01.110",63.74]
[8,"Vitor Gatti",30,113,"00:01:00.931",63.93]
[8,"Vitor Gatti",30,113,"00:01:01.344",63.5]
[8,"Vitor Gatti",30,113,"00:01:01.404",63.44]
[8,"Vitor Gatti",30,113,"00:01:01.291",63.55]
[8,"Vitor Gatti",30,113,"00:01:01.426",63.41]
[8,"Vitor Gatti",30,113,"00:01:01.368",63.47]
[8,"Vitor Gatti",30,113,"00:01:01.104",63.75]
[8,"Vitor Gatti",30,113,"00:01:00.699",64.17]
[8,"Vitor Gatti",30,113,"00:01:00.799",64.069999999999993]
[8,"Vitor Gatti",30,113,"00:01:01.164",63.68]
[8,"Vitor Gatti",30,113,"00:01:00.614",64.260000000000005]
[8,"Vitor Gatti",30,113,"00:01:01.237",63.61]
[8,"Vitor Gatti",30,113,"00:01:00.667",64.209999999999994]
[8,"Vitor Gatti",30,113,"00:01:00.954",63.9]
[8,"Vitor Gatti",30,113,"00:01:00.965",63.89]
[8,"Vitor Gatti",30,113,"00:01:00.741",64.13]
[8,"Vitor Gatti",30,113,"00:01:01.246",63.6]
[8,"Vitor Gatti",30,113,"00:01:00.915",63.94]
[8,"Vitor Gatti",30,113,"00:01:01.057",63.8]
[8,"Vitor Gatti",30,113,"00:01:01.587",63.25]
[8,"Vitor Gatti",30,113,"00:01:00.835",64.03]
[8,"Vitor Gatti",30,113,"00:01:01.304",63.54]
[8,"Rodrigo Ricardo",30,135,"00:01:06.699",58.4]
[8,"Rodrigo Ricardo",30,135,"00:01:03.464",61.38]
[8,"Rodrigo Ricardo",30,135,"00:01:02.308",62.52]
[8,"Rodrigo Ricardo",30,135,"00:01:01.516",63.32]
[8,"Rodrigo Ricardo",30,135,"00:01:03.091",61.74]
[8,"Rodrigo Ricardo",30,135,"00:01:02.552",62.27]
[8,"Rodrigo Ricardo",30,135,"00:01:01.682",63.15]
[8,"Rodrigo Ricardo",30,135,"00:01:02.269",62.55]
[8,"Rodrigo Ricardo",30,135,"00:01:01.222",63.62]
[8,"Rodrigo Ricardo",30,135,"00:01:01.448",63.39]
[8,"Rodrigo Ricardo",30,135,"00:01:01.484",63.35]
[8,"Rodrigo Ricardo",30,135,"00:01:01.518",63.32]
[8,"Rodrigo Ricardo",30,135,"00:01:01.452",63.39]
[8,"Rodrigo Ricardo",30,135,"00:01:00.784",64.08]
[8,"Rodrigo Ricardo",30,135,"00:01:01.236",63.61]
[8,"Rodrigo Ricardo",30,135,"00:01:01.046",63.81]
[8,"Rodrigo Ricardo",30,135,"00:01:00.892",63.97]
[8,"Rodrigo Ricardo",30,135,"00:01:00.475",64.41]
[8,"Rodrigo Ricardo",30,135,"00:01:00.968",63.89]
[8,"Rodrigo Ricardo",30,135,"00:01:01.356",63.49]
[8,"Rodrigo Ricardo",30,135,"00:01:00.691",64.180000000000007]
[8,"Rodrigo Ricardo",30,135,"00:01:01.083",63.77]
[8,"Rodrigo Ricardo",30,135,"00:01:01.011",63.84]
[8,"Rodrigo Ricardo",30,135,"00:01:00.764",64.099999999999994]
[8,"Rodrigo Ricardo",30,135,"00:01:00.832",64.03]
[8,"Rodrigo Ricardo",30,135,"00:01:00.662",64.209999999999994]
[8,"Rodrigo Ricardo",30,135,"00:01:00.820",64.040000000000006]
[8,"Rodrigo Ricardo",30,135,"00:01:01.231",63.61]
[8,"Rodrigo Ricardo",30,135,"00:01:00.598",64.28]
[8,"Rodrigo Ricardo",30,135,"00:01:00.706",64.16]
[8,"Reila Ricardo",30,147,"00:01:06.694",58.4]
[8,"Reila Ricardo",30,147,"00:01:02.018",62.81]
[8,"Reila Ricardo",30,147,"00:01:01.300",63.54]
[8,"Reila Ricardo",30,147,"00:01:02.665",62.16]
[8,"Reila Ricardo",30,147,"00:01:01.525",63.31]
[8,"Reila Ricardo",30,147,"00:01:00.587",64.290000000000006]
[8,"Reila Ricardo",30,147,"00:01:01.272",63.57]
[8,"Reila Ricardo",30,147,"00:01:01.991",62.83]
[8,"Reila Ricardo",30,147,"00:01:02.344",62.48]
[8,"Reila Ricardo",30,147,"00:01:02.691",62.13]
[8,"Reila Ricardo",30,147,"00:01:01.207",63.64]
[8,"Reila Ricardo",30,147,"00:01:01.209",63.64]
[8,"Reila Ricardo",30,147,"00:01:01.261",63.58]
[8,"Reila Ricardo",30,147,"00:01:02.327",62.5]
[8,"Reila Ricardo",30,147,"00:01:02.202",62.62]
[8,"Reila Ricardo",30,147,"00:01:00.974",63.88]
[8,"Reila Ricardo",30,147,"00:01:00.887",63.97]
[8,"Reila Ricardo",30,147,"00:01:01.099",63.75]
[8,"Reila Ricardo",30,147,"00:01:01.248",63.6]
[8,"Reila Ricardo",30,147,"00:01:01.148",63.7]
[8,"Reila Ricardo",30,147,"00:01:00.869",63.99]
[8,"Reila Ricardo",30,147,"00:01:01.393",63.45]
[8,"Reila Ricardo",30,147,"00:01:00.975",63.88]
[8,"Reila Ricardo",30,147,"00:01:00.999",63.86]
[8,"Reila Ricardo",30,147,"00:01:00.746",64.12]
[8,"Reila Ricardo",30,147,"00:01:00.550",64.33]
[8,"Reila Ricardo",30,147,"00:01:01.025",63.83]
[8,"Reila Ricardo",30,147,"00:01:01.035",63.82]
[8,"Reila Ricardo",30,147,"00:01:00.883",63.98]
[8,"Reila Ricardo",30,147,"00:01:01.035",63.82]
[8,"Hélio Chagas",30,153,"00:01:08.597",56.78]
[8,"Hélio Chagas",30,153,"00:01:04.038",60.83]
[8,"Hélio Chagas",30,153,"00:01:02.364",62.46]
[8,"Hélio Chagas",30,153,"00:01:01.907",62.92]
[8,"Hélio Chagas",30,153,"00:01:01.796",63.03]
[8,"Hélio Chagas",30,153,"00:01:01.383",63.46]
[8,"Hélio Chagas",30,153,"00:01:01.647",63.19]
[8,"Hélio Chagas",30,153,"00:01:01.213",63.63]
[8,"Hélio Chagas",30,153,"00:01:01.063",63.79]
[8,"Hélio Chagas",30,153,"00:01:01.041",63.81]
[8,"Hélio Chagas",30,153,"00:01:00.799",64.069999999999993]
[8,"Hélio Chagas",30,153,"00:01:01.883",62.94]
[8,"Hélio Chagas",30,153,"00:01:01.147",63.7]
[8,"Hélio Chagas",30,153,"00:01:00.862",64]
[8,"Hélio Chagas",30,153,"00:01:01.056",63.8]
[8,"Hélio Chagas",30,153,"00:01:01.307",63.54]
[8,"Hélio Chagas",30,153,"00:01:00.786",64.08]
[8,"Hélio Chagas",30,153,"00:01:00.749",64.12]
[8,"Hélio Chagas",30,153,"00:01:01.711",63.12]
[8,"Hélio Chagas",30,153,"00:01:01.168",63.68]
[8,"Hélio Chagas",30,153,"00:01:00.836",64.03]
[8,"Hélio Chagas",30,153,"00:01:01.328",63.51]
[8,"Hélio Chagas",30,153,"00:01:01.025",63.83]
[8,"Hélio Chagas",30,153,"00:01:00.796",64.069999999999993]
[8,"Hélio Chagas",30,153,"00:01:00.929",63.93]
[8,"Hélio Chagas",30,153,"00:01:01.128",63.72]
[8,"Hélio Chagas",30,153,"00:01:00.783",64.08]
[8,"Hélio Chagas",30,153,"00:01:01.662",63.17]
[8,"Hélio Chagas",30,153,"00:01:01.763",63.07]
[8,"Hélio Chagas",30,153,"00:01:01.437",63.4]
[8,"Felipe Bouhid",30,154,"00:01:08.402",56.95]
[8,"Felipe Bouhid",30,154,"00:01:02.985",61.84]
[8,"Felipe Bouhid",30,154,"00:01:02.547",62.28]
[8,"Felipe Bouhid",30,154,"00:01:02.213",62.61]
[8,"Felipe Bouhid",30,154,"00:01:01.639",63.19]
[8,"Felipe Bouhid",30,154,"00:01:01.809",63.02]
[8,"Felipe Bouhid",30,154,"00:01:01.307",63.54]
[8,"Felipe Bouhid",30,154,"00:01:00.965",63.89]
[8,"Felipe Bouhid",30,154,"00:01:01.251",63.59]
[8,"Felipe Bouhid",30,154,"00:01:04.172",60.7]
[8,"Felipe Bouhid",30,154,"00:01:01.083",63.77]
[8,"Felipe Bouhid",30,154,"00:01:01.502",63.33]
[8,"Felipe Bouhid",30,154,"00:01:02.235",62.59]
[8,"Felipe Bouhid",30,154,"00:01:00.833",64.03]
[8,"Felipe Bouhid",30,154,"00:01:01.268",63.58]
[8,"Felipe Bouhid",30,154,"00:01:01.233",63.61]
[8,"Felipe Bouhid",30,154,"00:01:01.241",63.6]
[8,"Felipe Bouhid",30,154,"00:01:01.255",63.59]
[8,"Felipe Bouhid",30,154,"00:01:01.369",63.47]
[8,"Felipe Bouhid",30,154,"00:01:01.086",63.77]
[8,"Felipe Bouhid",30,154,"00:01:00.969",63.89]
[8,"Felipe Bouhid",30,154,"00:01:01.052",63.8]
[8,"Felipe Bouhid",30,154,"00:01:01.657",63.18]
[8,"Felipe Bouhid",30,154,"00:01:01.454",63.38]
[8,"Felipe Bouhid",30,154,"00:01:00.911",63.95]
[8,"Felipe Bouhid",30,154,"00:01:00.942",63.92]
[8,"Felipe Bouhid",30,154,"00:01:01.079",63.77]
[8,"Felipe Bouhid",30,154,"00:01:00.775",64.09]
[8,"Felipe Bouhid",30,154,"00:01:01.275",63.57]
[8,"Felipe Bouhid",30,154,"00:01:01.004",63.85]
[8,"Jucimar Vieira",30,111,"00:01:07.185",57.98]
[8,"Jucimar Vieira",30,111,"00:01:01.764",63.07]
[8,"Jucimar Vieira",30,111,"00:01:01.753",63.08]
[8,"Jucimar Vieira",30,111,"00:01:02.128",62.7]
[8,"Jucimar Vieira",30,111,"00:01:01.225",63.62]
[8,"Jucimar Vieira",30,111,"00:01:01.058",63.8]
[8,"Jucimar Vieira",30,111,"00:01:15.620",51.51]
[8,"Jucimar Vieira",30,111,"00:01:01.280",63.56]
[8,"Jucimar Vieira",30,111,"00:01:00.859",64]
[8,"Jucimar Vieira",30,111,"00:01:00.697",64.17]
[8,"Jucimar Vieira",30,111,"00:01:01.147",63.7]
[8,"Jucimar Vieira",30,111,"00:01:00.764",64.099999999999994]
[8,"Jucimar Vieira",30,111,"00:01:00.525",64.36]
[8,"Jucimar Vieira",30,111,"00:01:00.806",64.06]
[8,"Jucimar Vieira",30,111,"00:01:00.714",64.16]
[8,"Jucimar Vieira",30,111,"00:01:00.868",63.99]
[8,"Jucimar Vieira",30,111,"00:01:01.386",63.45]
[8,"Jucimar Vieira",30,111,"00:01:00.576",64.3]
[8,"Jucimar Vieira",30,111,"00:01:00.724",64.150000000000006]
[8,"Jucimar Vieira",30,111,"00:01:00.222",64.680000000000007]
[8,"Jucimar Vieira",30,111,"00:01:01.164",63.68]
[8,"Jucimar Vieira",30,111,"00:01:00.398",64.489999999999995]
[8,"Jucimar Vieira",30,111,"00:01:00.811",64.05]
[8,"Jucimar Vieira",30,111,"00:01:00.852",64.010000000000005]
[8,"Jucimar Vieira",30,111,"00:01:01.430",63.41]
[8,"Jucimar Vieira",30,111,"00:01:00.450",64.44]
[8,"Jucimar Vieira",30,111,"00:01:00.852",64.010000000000005]
[8,"Jucimar Vieira",30,111,"00:01:00.968",63.89]
[8,"Jucimar Vieira",30,111,"00:01:00.929",63.93]
[8,"Jucimar Vieira",30,111,"00:01:09.197",56.29]
[8,"FLAVIO MARQUES",30,143,"00:01:17.356",50.35]
[8,"FLAVIO MARQUES",30,143,"00:01:02.182",62.64]
[8,"FLAVIO MARQUES",30,143,"00:01:01.998",62.83]
[8,"FLAVIO MARQUES",30,143,"00:01:03.127",61.7]
[8,"FLAVIO MARQUES",30,143,"00:01:01.689",63.14]
[8,"FLAVIO MARQUES",30,143,"00:01:01.458",63.38]
[8,"FLAVIO MARQUES",30,143,"00:01:01.267",63.58]
[8,"FLAVIO MARQUES",30,143,"00:01:01.230",63.62]
[8,"FLAVIO MARQUES",30,143,"00:01:01.524",63.31]
[8,"FLAVIO MARQUES",30,143,"00:01:01.634",63.2]
[8,"FLAVIO MARQUES",30,143,"00:01:01.252",63.59]
[8,"FLAVIO MARQUES",30,143,"00:01:01.436",63.4]
[8,"FLAVIO MARQUES",30,143,"00:01:01.049",63.8]
[8,"FLAVIO MARQUES",30,143,"00:01:01.483",63.35]
[8,"FLAVIO MARQUES",30,143,"00:01:01.134",63.72]
[8,"FLAVIO MARQUES",30,143,"00:01:01.227",63.62]
[8,"FLAVIO MARQUES",30,143,"00:01:01.587",63.25]
[8,"FLAVIO MARQUES",30,143,"00:01:01.175",63.67]
[8,"FLAVIO MARQUES",30,143,"00:01:00.719",64.150000000000006]
[8,"FLAVIO MARQUES",30,143,"00:01:00.994",63.86]
[8,"FLAVIO MARQUES",30,143,"00:01:01.056",63.8]
[8,"FLAVIO MARQUES",30,143,"00:01:00.693",64.180000000000007]
[8,"FLAVIO MARQUES",30,143,"00:01:01.447",63.39]
[8,"FLAVIO MARQUES",30,143,"00:01:01.367",63.47]
[8,"FLAVIO MARQUES",30,143,"00:01:01.679",63.15]
[8,"FLAVIO MARQUES",30,143,"00:01:01.007",63.85]
[8,"FLAVIO MARQUES",30,143,"00:01:01.245",63.6]
[8,"FLAVIO MARQUES",30,143,"00:01:01.035",63.82]
[8,"FLAVIO MARQUES",30,143,"00:01:01.006",63.85]
[8,"FLAVIO MARQUES",30,143,"00:01:01.324",63.52]
[8,"Andre Resende",30,136,"00:01:09.142",56.34]
[8,"Andre Resende",30,136,"00:01:03.473",61.37]
[8,"Andre Resende",30,136,"00:01:02.278",62.55]
[8,"Andre Resende",30,136,"00:01:01.321",63.52]
[8,"Andre Resende",30,136,"00:01:01.462",63.38]
[8,"Andre Resende",30,136,"00:01:01.746",63.08]
[8,"Andre Resende",30,136,"00:01:01.318",63.52]
[8,"Andre Resende",30,136,"00:01:02.212",62.61]
[8,"Andre Resende",30,136,"00:01:01.389",63.45]
[8,"Andre Resende",30,136,"00:01:01.492",63.34]
[8,"Andre Resende",30,136,"00:01:02.602",62.22]
[8,"Andre Resende",30,136,"00:01:01.915",62.91]
[8,"Andre Resende",30,136,"00:01:01.427",63.41]
[8,"Andre Resende",30,136,"00:01:00.979",63.88]
[8,"Andre Resende",30,136,"00:01:03.073",61.76]
[8,"Andre Resende",30,136,"00:01:02.427",62.4]
[8,"Andre Resende",30,136,"00:01:01.793",63.04]
[8,"Andre Resende",30,136,"00:01:01.719",63.11]
[8,"Andre Resende",30,136,"00:01:01.679",63.15]
[8,"Andre Resende",30,136,"00:01:01.409",63.43]
[8,"Andre Resende",30,136,"00:01:01.612",63.22]
[8,"Andre Resende",30,136,"00:01:02.010",62.82]
[8,"Andre Resende",30,136,"00:01:01.634",63.2]
[8,"Andre Resende",30,136,"00:01:02.040",62.79]
[8,"Andre Resende",30,136,"00:01:01.661",63.17]
[8,"Andre Resende",30,136,"00:01:01.932",62.89]
[8,"Andre Resende",30,136,"00:01:01.604",63.23]
[8,"Andre Resende",30,136,"00:01:01.707",63.12]
[8,"Andre Resende",30,136,"00:01:01.964",62.86]
[8,"Andre Resende",30,136,"00:01:02.081",62.74]
[8,"Tati Marcondes",29,108,"00:01:08.531",56.84]
[8,"Tati Marcondes",29,108,"00:01:02.777",62.05]
[8,"Tati Marcondes",29,108,"00:01:01.945",62.88]
[8,"Tati Marcondes",29,108,"00:01:02.246",62.58]
[8,"Tati Marcondes",29,108,"00:01:02.239",62.58]
[8,"Tati Marcondes",29,108,"00:01:01.693",63.14]
[8,"Tati Marcondes",29,108,"00:01:01.846",62.98]
[8,"Tati Marcondes",29,108,"00:01:01.779",63.05]
[8,"Tati Marcondes",29,108,"00:01:01.385",63.46]
[8,"Tati Marcondes",29,108,"00:01:02.026",62.8]
[8,"Tati Marcondes",29,108,"00:01:01.507",63.33]
[8,"Tati Marcondes",29,108,"00:01:02.279",62.54]
[8,"Tati Marcondes",29,108,"00:01:01.991",62.83]
[8,"Tati Marcondes",29,108,"00:01:01.170",63.68]
[8,"Tati Marcondes",29,108,"00:01:13.196",53.22]
[8,"Tati Marcondes",29,108,"00:01:02.569",62.25]
[8,"Tati Marcondes",29,108,"00:01:01.647",63.19]
[8,"Tati Marcondes",29,108,"00:01:02.146",62.68]
[8,"Tati Marcondes",29,108,"00:01:01.749",63.08]
[8,"Tati Marcondes",29,108,"00:01:01.267",63.58]
[8,"Tati Marcondes",29,108,"00:01:01.430",63.41]
[8,"Tati Marcondes",29,108,"00:01:01.715",63.12]
[8,"Tati Marcondes",29,108,"00:01:25.795",45.4]
[8,"Tati Marcondes",29,108,"00:01:03.826",61.03]
[8,"Tati Marcondes",29,108,"00:01:02.519",62.3]
[8,"Tati Marcondes",29,108,"00:01:01.533",63.3]
[8,"Tati Marcondes",29,108,"00:01:01.827",63]
[8,"Tati Marcondes",29,108,"00:01:01.565",63.27]
[8,"Tati Marcondes",29,108,"00:01:01.407",63.43]
[8,"Izabella Rodrigues",29,125,"00:01:07.873",57.39]
[8,"Izabella Rodrigues",29,125,"00:01:03.798",61.06]
[8,"Izabella Rodrigues",29,125,"00:01:02.513",62.31]
[8,"Izabella Rodrigues",29,125,"00:01:01.790",63.04]
[8,"Izabella Rodrigues",29,125,"00:01:01.604",63.23]
[8,"Izabella Rodrigues",29,125,"00:01:01.607",63.23]
[8,"Izabella Rodrigues",29,125,"00:01:02.192",62.63]
[8,"Izabella Rodrigues",29,125,"00:01:01.599",63.23]
[8,"Izabella Rodrigues",29,125,"00:01:01.782",63.05]
[8,"Izabella Rodrigues",29,125,"00:01:01.492",63.34]
[8,"Izabella Rodrigues",29,125,"00:01:01.518",63.32]
[8,"Izabella Rodrigues",29,125,"00:01:01.289",63.55]
[8,"Izabella Rodrigues",29,125,"00:01:01.052",63.8]
[8,"Izabella Rodrigues",29,125,"00:01:01.014",63.84]
[8,"Izabella Rodrigues",29,125,"00:01:54.818",33.92]
[8,"Izabella Rodrigues",29,125,"00:01:01.715",63.12]
[8,"Izabella Rodrigues",29,125,"00:01:01.402",63.44]
[8,"Izabella Rodrigues",29,125,"00:01:01.728",63.1]
[8,"Izabella Rodrigues",29,125,"00:01:01.969",62.86]
[8,"Izabella Rodrigues",29,125,"00:01:01.347",63.49]
[8,"Izabella Rodrigues",29,125,"00:01:01.600",63.23]
[8,"Izabella Rodrigues",29,125,"00:01:02.301",62.52]
[8,"Izabella Rodrigues",29,125,"00:01:01.269",63.58]
[8,"Izabella Rodrigues",29,125,"00:01:01.151",63.7]
[8,"Izabella Rodrigues",29,125,"00:01:01.732",63.1]
[8,"Izabella Rodrigues",29,125,"00:01:01.495",63.34]
[8,"Izabella Rodrigues",29,125,"00:01:01.684",63.15]
[8,"Izabella Rodrigues",29,125,"00:01:01.228",63.62]
[8,"Izabella Rodrigues",29,125,"00:01:01.757",63.07]
[8,"Roberta Epifânio",28,126,"00:01:11.219",54.69]
[8,"Roberta Epifânio",28,126,"00:01:04.135",60.73]
[8,"Roberta Epifânio",28,126,"00:01:04.471",60.42]
[8,"Roberta Epifânio",28,126,"00:01:05.513",59.46]
[8,"Roberta Epifânio",28,126,"00:01:05.528",59.44]
[8,"Roberta Epifânio",28,126,"00:01:04.945",59.98]
[8,"Roberta Epifânio",28,126,"00:01:05.090",59.84]
[8,"Roberta Epifânio",28,126,"00:01:07.209",57.96]
[8,"Roberta Epifânio",28,126,"00:01:06.278",58.77]
[8,"Roberta Epifânio",28,126,"00:01:05.156",59.78]
[8,"Roberta Epifânio",28,126,"00:01:07.818",57.44]
[8,"Roberta Epifânio",28,126,"00:01:09.185",56.3]
[8,"Roberta Epifânio",28,126,"00:01:12.549",53.69]
[8,"Roberta Epifânio",28,126,"00:01:08.665",56.73]
[8,"Roberta Epifânio",28,126,"00:01:03.927",60.93]
[8,"Roberta Epifânio",28,126,"00:01:04.394",60.49]
[8,"Roberta Epifânio",28,126,"00:01:05.695",59.29]
[8,"Roberta Epifânio",28,126,"00:01:04.387",60.5]
[8,"Roberta Epifânio",28,126,"00:01:04.841",60.07]
[8,"Roberta Epifânio",28,126,"00:01:05.114",59.82]
[8,"Roberta Epifânio",28,126,"00:01:05.147",59.79]
[8,"Roberta Epifânio",28,126,"00:01:09.719",55.87]
[8,"Roberta Epifânio",28,126,"00:01:07.568",57.65]
[8,"Roberta Epifânio",28,126,"00:01:06.728",58.37]
[8,"Roberta Epifânio",28,126,"00:01:04.079",60.79]
[8,"Roberta Epifânio",28,126,"00:01:06.405",58.66]
[8,"Roberta Epifânio",28,126,"00:01:05.360",59.6]
[8,"Roberta Epifânio",28,126,"00:01:05.896",59.11]
[8,"Marcelo Chagas",16,105,"00:01:07.701",57.54]
[8,"Marcelo Chagas",16,105,"00:01:01.828",63]
[8,"Marcelo Chagas",16,105,"00:01:01.571",63.26]
[8,"Marcelo Chagas",16,105,"00:01:01.619",63.21]
[8,"Marcelo Chagas",16,105,"00:01:01.595",63.24]
[8,"Marcelo Chagas",16,105,"00:01:01.397",63.44]
[8,"Marcelo Chagas",16,105,"00:01:01.039",63.81]
[8,"Marcelo Chagas",16,105,"00:01:00.331",64.56]
[8,"Marcelo Chagas",16,105,"00:01:01.145",63.7]
[8,"Marcelo Chagas",16,105,"00:01:01.446",63.39]
[8,"Marcelo Chagas",16,105,"00:01:01.437",63.4]
[8,"Marcelo Chagas",16,105,"00:01:03.380",61.46]
[8,"Marcelo Chagas",16,105,"00:01:01.637",63.2]
[8,"Marcelo Chagas",16,105,"00:01:00.704",64.17]
[8,"Marcelo Chagas",16,105,"00:01:01.014",63.84]
[8,"Marcelo Chagas",16,105,"00:01:01.292",63.55]

{"sheet":"ETAPA 7","index":5,"n_rows":586,"n_cols":12,"rows_kept":586,"cut":false,"hidden":false,"merged":[[0,0,0,6]]}
["Obs.: Selecione até 3 pilotos colocando na frente do seu nome os números 1, 2 e 3.",null,null,null,null,null,null,"PILOTO",{"$f":"J52","v":"Marcelo Clemente"},{"$f":"K52","v":"Marcelo Campos"},{"$f":"L52","v":"Daniel Nahum"}]
[1,"Marcelo Clemente",null,null,null,null,null,"MÉDIA",{"$f":"AVERAGE(J53:J97)","v":"00:01:10.203"},{"$f":"AVERAGE(K53:K97)","v":"00:01:10.178"},{"$f":"AVERAGE(L53:L97)","v":"00:01:10.492"}]
[2,"Marcelo Campos",null,null,null,null,null,"MAXIMA",{"$f":"LARGE(J53:J97,1)","v":"00:01:15.591"},{"$f":"LARGE(K53:K97,1)","v":"00:01:16.604"},{"$f":"LARGE(L53:L97,1)","v":"00:01:19.783"}]
[3,"Daniel Nahum",null,null,null,null,null,"MÍNIMA",{"$f":"SMALL(J53:J97,1)","v":"00:01:09.457"},{"$f":"SMALL(K53:K97,1)","v":"00:01:09.308"},{"$f":"SMALL(L53:L97,1)","v":"00:01:09.400"}]
[null,"Marcelo Pereira",null,null,null,null,null,"Desvio Padrão",{"$f":"_xlfn.STDEV.S(J53:J97)","v":"00:00:01.210"},{"$f":"_xlfn.STDEV.S(K53:K97)","v":"00:00:01.404"},{"$f":"_xlfn.STDEV.S(L53:L97)","v":"00:00:02.001"}]
[null,"Alexandre Melillo",null,null,null,null,null,"TEMPO TOTAL",{"$f":"SUM(J53:J97,1)","v":1.0211259143518518},{"$f":"SUM(K53:K97,1)","v":1.0211183101851853},{"$f":"SUM(L53:L97,1)","v":1.0212127662037036}]
[null,"Guilherme Alves"]
[null,"Maurício Júnior"]
[null,"Rodrigo Mercadante"]
[null,"Wesley Canuto"]
[null,"Eduardo Henrique"]
[null,"Lucas Guimarães"]
[null,"Jarbas Reis",null,null,null,null,null,null,null,null,{"$f":"SMALL(I4:K4,1)-L13","v":"00:01:09.308"}]
[null,"Wesley Bambirra",null,null,null,null,null,null,null,null,{"$f":"LARGE(I3:K3,1)+L13","v":"00:01:19.783"}]
[null,"Marcelo Chagas"]
[null,"Cláudio Naves"]
[null,"Hélio Chagas"]
[null,"Izabella Rodrigues"]
[null,"Jucimar Vieira"]
[null,"Wesley Camargos"]
[null,"Roberta Epifânio"]
[null,"Leandro Malias"]
[]
[]
[]
[]
[]
[]
[]
[]
[]
[1]
[]
[]
[]
[]
[]
[]
[]
[]
[]
[]
[]
[]
[]
[]
[]
[]
[]
["ETAPA","PILOTO","NÚMERO VOLTAS","KART","Volta Tm","velocidade Media",null,null,null,{"$f":"MATCH(J52,$B$51:$B$1500,0)","v":1},{"$f":"MATCH(K52,$B$51:$B$1500,0)","v":27},53]
[7,"Marcelo Clemente",26,106,"00:01:15.591",57.15,null,null,null,{"$f":"VLOOKUP(J$52,$B$50:$F$1500,2,FALSE)","v":26},{"$f":"VLOOKUP(K$52,$B$50:$F$1500,2,FALSE)","v":26},{"$f":"VLOOKUP(L$52,$B$50:$F$1500,2,FALSE)","v":26}]
[7,"Marcelo Clemente",26,106,"00:01:11.712",60.24,null,null,"VOLTA",{"$f":"VLOOKUP(1,$A$2:$B$36,2,FALSE)","v":"Marcelo Clemente"},{"$f":"VLOOKUP(2,$A$2:$B$36,2,FALSE)","v":"Marcelo Campos"},{"$f":"VLOOKUP(3,$A$2:$B$36,2,FALSE)","v":"Daniel Nahum"}]
[7,"Marcelo Clemente",26,106,"00:01:11.099",60.76,null,null,1,{"$f":"OFFSET($E$51:$E$1500,J50-1,,J51)","v":"00:01:15.591"},{"$f":"OFFSET($E$51:$E$1500,K50-1,,K51)","v":"00:01:16.604"},{"$f":"OFFSET($E$51:$E$1500,L50-1,,L51)","v":"00:01:19.783"}]
[7,"Marcelo Clemente",26,106,"00:01:10.442",61.33,null,null,2,"00:01:11.712","00:01:10.765","00:01:11.181"]
[7,"Marcelo Clemente",26,106,"00:01:10.265",61.48,null,null,3,"00:01:11.099","00:01:11.018","00:01:10.252"]
[7,"Marcelo Clemente",26,106,"00:01:10.214",61.53,null,null,4,"00:01:10.442","00:01:10.765","00:01:11.047"]
[7,"Marcelo Clemente",26,106,"00:01:09.992",61.72,null,null,5,"00:01:10.265","00:01:10.877","00:01:11.186"]
[7,"Marcelo Clemente",26,106,"00:01:09.950",61.76,null,null,6,"00:01:10.214","00:01:10.802","00:01:10.855"]
[7,"Marcelo Clemente",26,106,"00:01:10.059",61.66,null,null,7,"00:01:09.992","00:01:09.891","00:01:11.281"]
[7,"Marcelo Clemente",26,106,"00:01:09.662",62.01,null,null,8,"00:01:09.950","00:01:09.710","00:01:09.839"]
[7,"Marcelo Clemente",26,106,"00:01:09.769",61.92,null,null,9,"00:01:10.059","00:01:09.876","00:01:09.410"]
[7,"Marcelo Clemente",26,106,"00:01:10.090",61.64,null,null,10,"00:01:09.662","00:01:09.869","00:01:09.900"]
[7,"Marcelo Clemente",26,106,"00:01:09.646",62.03,null,null,11,"00:01:09.769","00:01:09.649","00:01:09.937"]
[7,"Marcelo Clemente",26,106,"00:01:09.680",62,null,null,12,"00:01:10.090","00:01:09.617","00:01:09.400"]
[7,"Marcelo Clemente",26,106,"00:01:09.844",61.85,null,null,13,"00:01:09.646","00:01:09.310","00:01:09.454"]
[7,"Marcelo Clemente",26,106,"00:01:10.516",61.26,null,null,14,"00:01:09.680","00:01:09.308","00:01:10.386"]
[7,"Marcelo Clemente",26,106,"00:01:09.883",61.82,null,null,15,"00:01:09.844","00:01:09.422","00:01:11.267"]
[7,"Marcelo Clemente",26,106,"00:01:09.650",62.02,null,null,16,"00:01:10.516","00:01:10.138","00:01:09.793"]
[7,"Marcelo Clemente",26,106,"00:01:09.457",62.2,null,null,17,"00:01:09.883","00:01:09.594","00:01:10.463"]
[7,"Marcelo Clemente",26,106,"00:01:09.797",61.89,null,null,18,"00:01:09.650","00:01:09.608","00:01:10.099"]
[7,"Marcelo Clemente",26,106,"00:01:09.723",61.96,null,null,19,"00:01:09.457","00:01:09.534","00:01:10.169"]
[7,"Marcelo Clemente",26,106,"00:01:09.482",62.17,null,null,20,"00:01:09.797","00:01:09.560","00:01:09.729"]
[7,"Marcelo Clemente",26,106,"00:01:09.838",61.86,null,null,21,"00:01:09.723","00:01:09.741","00:01:09.452"]
[7,"Marcelo Clemente",26,106,"00:01:09.766",61.92,null,null,22,"00:01:09.482","00:01:09.819","00:01:09.457"]
[7,"Marcelo Clemente",26,106,"00:01:09.609",62.06,null,null,23,"00:01:09.838","00:01:10.008","00:01:09.553"]
[7,"Marcelo Clemente",26,106,"00:01:09.543",62.12,null,null,24,"00:01:09.766","00:01:09.954","00:01:09.539"]
[7,"Marcelo Campos",26,130,"00:01:16.604",56.39,null,null,25,"00:01:09.609","00:01:09.615","00:01:09.685"]
[7,"Marcelo Campos",26,130,"00:01:10.765",61.05,null,null,26,"00:01:09.543","00:01:09.568","00:01:09.666"]
[7,"Marcelo Campos",26,130,"00:01:11.018",60.83,null,null,27]
[7,"Marcelo Campos",26,130,"00:01:10.765",61.05,null,null,28]
[7,"Marcelo Campos",26,130,"00:01:10.877",60.95,null,null,29]
[7,"Marcelo Campos",26,130,"00:01:10.802",61.02,null,null,30]
[7,"Marcelo Campos",26,130,"00:01:09.891",61.81,null,null,31]
[7,"Marcelo Campos",26,130,"00:01:09.710",61.97,null,null,32]
[7,"Marcelo Campos",26,130,"00:01:09.876",61.82,null,null,33]
[7,"Marcelo Campos",26,130,"00:01:09.869",61.83,null,null,34]
[7,"Marcelo Campos",26,130,"00:01:09.649",62.03,null,null,35]
[7,"Marcelo Campos",26,130,"00:01:09.617",62.05,null,null,36]
[7,"Marcelo Campos",26,130,"00:01:09.310",62.33,null,null,37]
[7,"Marcelo Campos",26,130,"00:01:09.308",62.33,null,null,38]
[7,"Marcelo Campos",26,130,"00:01:09.422",62.23,null,null,39]
[7,"Marcelo Campos",26,130,"00:01:10.138",61.59,null,null,40]
[7,"Marcelo Campos",26,130,"00:01:09.594",62.07,null,null,41]
[7,"Marcelo Campos",26,130,"00:01:09.608",62.06,null,null,42]
[7,"Marcelo Campos",26,130,"00:01:09.534",62.13,null,null,43]
[7,"Marcelo Campos",26,130,"00:01:09.560",62.1,null,null,44]
[7,"Marcelo Campos",26,130,"00:01:09.741",61.94,null,null,45]
[7,"Marcelo Campos",26,130,"00:01:09.819",61.87]
[7,"Marcelo Campos",26,130,"00:01:10.008",61.71]
[7,"Marcelo Campos",26,130,"00:01:09.954",61.75]
[7,"Marcelo Campos",26,130,"00:01:09.615",62.06]
[7,"Marcelo Campos",26,130,"00:01:09.568",62.1]
[7,"Daniel Nahum",26,134,"00:01:19.783",54.15]
[7,"Daniel Nahum",26,134,"00:01:11.181",60.69]
[7,"Daniel Nahum",26,134,"00:01:10.252",61.49]
[7,"Daniel Nahum",26,134,"00:01:11.047",60.8]
[7,"Daniel Nahum",26,134,"00:01:11.186",60.69]
[7,"Daniel Nahum",26,134,"00:01:10.855",60.97]
[7,"Daniel Nahum",26,134,"00:01:11.281",60.61]
[7,"Daniel Nahum",26,134,"00:01:09.839",61.86]
[7,"Daniel Nahum",26,134,"00:01:09.410",62.24]
[7,"Daniel Nahum",26,134,"00:01:09.900",61.8]
[7,"Daniel Nahum",26,134,"00:01:09.937",61.77]
[7,"Daniel Nahum",26,134,"00:01:09.400",62.25]
[7,"Daniel Nahum",26,134,"00:01:09.454",62.2]
[7,"Daniel Nahum",26,134,"00:01:10.386",61.38]
[7,"Daniel Nahum",26,134,"00:01:11.267",60.62]
[7,"Daniel Nahum",26,134,"00:01:09.793",61.9]
[7,"Daniel Nahum",26,134,"00:01:10.463",61.31]
[7,"Daniel Nahum",26,134,"00:01:10.099",61.63]
[7,"Daniel Nahum",26,134,"00:01:10.169",61.57]
[7,"Daniel Nahum",26,134,"00:01:09.729",61.95]
[7,"Daniel Nahum",26,134,"00:01:09.452",62.2]
[7,"Daniel Nahum",26,134,"00:01:09.457",62.2]
[7,"Daniel Nahum",26,134,"00:01:09.553",62.11]
[7,"Daniel Nahum",26,134,"00:01:09.539",62.12]
[7,"Daniel Nahum",26,134,"00:01:09.685",61.99]
[7,"Daniel Nahum",26,134,"00:01:09.666",62.01]
[7,"Marcelo Pereira",26,132,"00:01:16.890",56.18]
[7,"Marcelo Pereira",26,132,"00:01:11.373",60.53]
[7,"Marcelo Pereira",26,132,"00:01:10.330",61.42]
[7,"Marcelo Pereira",26,132,"00:01:10.682",61.12]
[7,"Marcelo Pereira",26,132,"00:01:10.557",61.23]
[7,"Marcelo Pereira",26,132,"00:01:10.183",61.55]
[7,"Marcelo Pereira",26,132,"00:01:10.485",61.29]
[7,"Marcelo Pereira",26,132,"00:01:10.414",61.35]
[7,"Marcelo Pereira",26,132,"00:01:10.348",61.41]
[7,"Marcelo Pereira",26,132,"00:01:09.958",61.75]
[7,"Marcelo Pereira",26,132,"00:01:10.048",61.67]
[7,"Marcelo Pereira",26,132,"00:01:10.677",61.12]
[7,"Marcelo Pereira",26,132,"00:01:09.458",62.2]
[7,"Marcelo Pereira",26,132,"00:01:10.154",61.58]
[7,"Marcelo Pereira",26,132,"00:01:10.757",61.05]
[7,"Marcelo Pereira",26,132,"00:01:09.737",61.95]
[7,"Marcelo Pereira",26,132,"00:01:09.901",61.8]
[7,"Marcelo Pereira",26,132,"00:01:10.687",61.11]
[7,"Marcelo Pereira",26,132,"00:01:10.219",61.52]
[7,"Marcelo Pereira",26,132,"00:01:10.339",61.42]
[7,"Marcelo Pereira",26,132,"00:01:09.439",62.21]
[7,"Marcelo Pereira",26,132,"00:01:09.690",61.99]
[7,"Marcelo Pereira",26,132,"00:01:09.451",62.2]
[7,"Marcelo Pereira",26,132,"00:01:09.597",62.07]
[7,"Marcelo Pereira",26,132,"00:01:09.922",61.78]
[7,"Marcelo Pereira",26,132,"00:01:09.938",61.77]
[7,"Alexandre Melillo",26,125,"00:01:15.849",56.96]
[7,"Alexandre Melillo",26,125,"00:01:11.732",60.22]
[7,"Alexandre Melillo",26,125,"00:01:11.048",60.8]
[7,"Alexandre Melillo",26,125,"00:01:10.550",61.23]
[7,"Alexandre Melillo",26,125,"00:01:10.908",60.92]
[7,"Alexandre Melillo",26,125,"00:01:11.299",60.59]
[7,"Alexandre Melillo",26,125,"00:01:10.185",61.55]
[7,"Alexandre Melillo",26,125,"00:01:09.922",61.78]
[7,"Alexandre Melillo",26,125,"00:01:10.197",61.54]
[7,"Alexandre Melillo",26,125,"00:01:10.244",61.5]
[7,"Alexandre Melillo",26,125,"00:01:10.017",61.7]
[7,"Alexandre Melillo",26,125,"00:01:09.943",61.76]
[7,"Alexandre Melillo",26,125,"00:01:11.241",60.64]
[7,"Alexandre Melillo",26,125,"00:01:10.492",61.28]
[7,"Alexandre Melillo",26,125,"00:01:10.332",61.42]
[7,"Alexandre Melillo",26,125,"00:01:09.980",61.73]
[7,"Alexandre Melillo",26,125,"00:01:10.435",61.33]
[7,"Alexandre Melillo",26,125,"00:01:11.070",60.79]
[7,"Alexandre Melillo",26,125,"00:01:10.331",61.42]
[7,"Alexandre Melillo",26,125,"00:01:10.410",61.35]
[7,"Alexandre Melillo",26,125,"00:01:09.990",61.72]
[7,"Alexandre Melillo",26,125,"00:01:10.013",61.7]
[7,"Alexandre Melillo",26,125,"00:01:11.139",60.73]
[7,"Alexandre Melillo",26,125,"00:01:10.895",60.94]
[7,"Alexandre Melillo",26,125,"00:01:10.478",61.3]
[7,"Alexandre Melillo",26,125,"00:01:11.545",60.38]
[7,"Guilherme Alves",26,108,"00:01:17.543",55.71]
[7,"Guilherme Alves",26,108,"00:01:11.688",60.26]
[7,"Guilherme Alves",26,108,"00:01:10.495",61.28]
[7,"Guilherme Alves",26,108,"00:01:10.432",61.34]
[7,"Guilherme Alves",26,108,"00:01:11.277",60.61]
[7,"Guilherme Alves",26,108,"00:01:10.685",61.12]
[7,"Guilherme Alves",26,108,"00:01:11.471",60.44]
[7,"Guilherme Alves",26,108,"00:01:09.727",61.96]
[7,"Guilherme Alves",26,108,"00:01:09.424",62.23]
[7,"Guilherme Alves",26,108,"00:01:09.944",61.76]
[7,"Guilherme Alves",26,108,"00:01:10.118",61.61]
[7,"Guilherme Alves",26,108,"00:01:10.131",61.6]
[7,"Guilherme Alves",26,108,"00:01:09.736",61.95]
[7,"Guilherme Alves",26,108,"00:01:09.904",61.8]
[7,"Guilherme Alves",26,108,"00:01:10.592",61.2]
[7,"Guilherme Alves",26,108,"00:01:09.555",62.11]
[7,"Guilherme Alves",26,108,"00:01:10.518",61.26]
[7,"Guilherme Alves",26,108,"00:01:10.704",61.1]
[7,"Guilherme Alves",26,108,"00:01:09.849",61.85]
[7,"Guilherme Alves",26,108,"00:01:10.396",61.37]
[7,"Guilherme Alves",26,108,"00:01:09.616",62.05]
[7,"Guilherme Alves",26,108,"00:01:10.099",61.63]
[7,"Guilherme Alves",26,108,"00:01:11.144",60.72]
[7,"Guilherme Alves",26,108,"00:01:11.158",60.71]
[7,"Guilherme Alves",26,108,"00:01:09.973",61.74]
[7,"Guilherme Alves",26,108,"00:01:11.674",60.27]
[7,"Maurício Júnior",26,131,"00:01:16.161",56.72]
[7,"Maurício Júnior",26,131,"00:01:10.965",60.88]
[7,"Maurício Júnior",26,131,"00:01:12.103",59.91]
[7,"Maurício Júnior",26,131,"00:01:11.625",60.31]
[7,"Maurício Júnior",26,131,"00:01:11.267",60.62]
[7,"Maurício Júnior",26,131,"00:01:11.059",60.79]
[7,"Maurício Júnior",26,131,"00:01:11.541",60.38]
[7,"Maurício Júnior",26,131,"00:01:09.988",61.72]
[7,"Maurício Júnior",26,131,"00:01:09.634",62.04]
[7,"Maurício Júnior",26,131,"00:01:09.746",61.94]
[7,"Maurício Júnior",26,131,"00:01:10.004",61.71]
[7,"Maurício Júnior",26,131,"00:01:09.782",61.91]
[7,"Maurício Júnior",26,131,"00:01:10.324",61.43]
[7,"Maurício Júnior",26,131,"00:01:10.117",61.61]
[7,"Maurício Júnior",26,131,"00:01:10.025",61.69]
[7,"Maurício Júnior",26,131,"00:01:09.592",62.08]
[7,"Maurício Júnior",26,131,"00:01:10.503",61.27]
[7,"Maurício Júnior",26,131,"00:01:10.555",61.23]
[7,"Maurício Júnior",26,131,"00:01:10.090",61.64]
[7,"Maurício Júnior",26,131,"00:01:10.637",61.16]
[7,"Maurício Júnior",26,131,"00:01:10.934",60.9]
[7,"Maurício Júnior",26,131,"00:01:11.847",60.13]
[7,"Maurício Júnior",26,131,"00:01:09.935",61.77]
[7,"Maurício Júnior",26,131,"00:01:10.520",61.26]
[7,"Maurício Júnior",26,131,"00:01:09.965",61.75]
[7,"Maurício Júnior",26,131,"00:01:09.844",61.85]
[7,"Rodrigo Mercadante",26,129,"00:01:15.407",57.29]
[7,"Rodrigo Mercadante",26,129,"00:01:11.922",60.07]
[7,"Rodrigo Mercadante",26,129,"00:01:11.626",60.31]
[7,"Rodrigo Mercadante",26,129,"00:01:11.034",60.82]
[7,"Rodrigo Mercadante",26,129,"00:01:11.496",60.42]
[7,"Rodrigo Mercadante",26,129,"00:01:10.797",61.02]
[7,"Rodrigo Mercadante",26,129,"00:01:10.282",61.47]
[7,"Rodrigo Mercadante",26,129,"00:01:10.008",61.71]
[7,"Rodrigo Mercadante",26,129,"00:01:10.885",60.94]
[7,"Rodrigo Mercadante",26,129,"00:01:09.954",61.75]
[7,"Rodrigo Mercadante",26,129,"00:01:10",61.71]
[7,"Rodrigo Mercadante",26,129,"00:01:09.920",61.78]
[7,"Rodrigo Mercadante",26,129,"00:01:10.590",61.2]
[7,"Rodrigo Mercadante",26,129,"00:01:10.496",61.28]
[7,"Rodrigo Mercadante",26,129,"00:01:10.688",61.11]
[7,"Rodrigo Mercadante",26,129,"00:01:09.943",61.76]
[7,"Rodrigo Mercadante",26,129,"00:01:11.100",60.76]
[7,"Rodrigo Mercadante",26,129,"00:01:10.875",60.95]
[7,"Rodrigo Mercadante",26,129,"00:01:09.896",61.81]
[7,"Rodrigo Mercadante",26,129,"00:01:10.225",61.52]
[7,"Rodrigo Mercadante",26,129,"00:01:10.316",61.44]
[7,"Rodrigo Mercadante",26,129,"00:01:10.400",61.36]
[7,"Rodrigo Mercadante",26,129,"00:01:10.241",61.5]
[7,"Rodrigo Mercadante",26,129,"00:01:11.862",60.12]
[7,"Rodrigo Mercadante",26,129,"00:01:09.812",61.88]
[7,"Rodrigo Mercadante",26,129,"00:01:11.851",60.12]
[7,"Wesley Canuto",26,115,"00:01:15.876",56.93]
[7,"Wesley Canuto",26,115,"00:01:12.472",59.61]
[7,"Wesley Canuto",26,115,"00:01:11.756",60.2]
[7,"Wesley Canuto",26,115,"00:01:10.315",61.44]
[7,"Wesley Canuto",26,115,"00:01:10.928",60.91]
[7,"Wesley Canuto",26,115,"00:01:11.005",60.84]
[7,"Wesley Canuto",26,115,"00:01:10.067",61.66]
[7,"Wesley Canuto",26,115,"00:01:09.922",61.78]
[7,"Wesley Canuto",26,115,"00:01:10.417",61.35]
[7,"Wesley Canuto",26,115,"00:01:09.920",61.78]
[7,"Wesley Canuto",26,115,"00:01:09.747",61.94]
[7,"Wesley Canuto",26,115,"00:01:09.907",61.8]
[7,"Wesley Canuto",26,115,"00:01:11.486",60.43]
[7,"Wesley Canuto",26,115,"00:01:10.352",61.41]
[7,"Wesley Canuto",26,115,"00:01:11.365",60.53]
[7,"Wesley Canuto",26,115,"00:01:09.849",61.85]
[7,"Wesley Canuto",26,115,"00:01:10.628",61.17]
[7,"Wesley Canuto",26,115,"00:01:11.762",60.2]
[7,"Wesley Canuto",26,115,"00:01:09.998",61.72]
[7,"Wesley Canuto",26,115,"00:01:10.317",61.44]
[7,"Wesley Canuto",26,115,"00:01:10.569",61.22]
[7,"Wesley Canuto",26,115,"00:01:11.226",60.65]
[7,"Wesley Canuto",26,115,"00:01:10.442",61.33]
[7,"Wesley Canuto",26,115,"00:01:10.917",60.92]
[7,"Wesley Canuto",26,115,"00:01:10.079",61.64]
[7,"Wesley Canuto",26,115,"00:01:10.153",61.58]
[7,"Eduardo Henrique",26,119,"00:01:15.846",56.96]
[7,"Eduardo Henrique",26,119,"00:01:12.349",59.71]
[7,"Eduardo Henrique",26,119,"00:01:12.547",59.55]
[7,"Eduardo Henrique",26,119,"00:01:10.864",60.96]
[7,"Eduardo Henrique",26,119,"00:01:10.792",61.02]
[7,"Eduardo Henrique",26,119,"00:01:10.575",61.21]
[7,"Eduardo Henrique",26,119,"00:01:10.673",61.13]
[7,"Eduardo Henrique",26,119,"00:01:11.149",60.72]
[7,"Eduardo Henrique",26,119,"00:01:10.511",61.27]
[7,"Eduardo Henrique",26,119,"00:01:10.341",61.42]
[7,"Eduardo Henrique",26,119,"00:01:10.412",61.35]
[7,"Eduardo Henrique",26,119,"00:01:10.092",61.63]
[7,"Eduardo Henrique",26,119,"00:01:10.438",61.33]
[7,"Eduardo Henrique",26,119,"00:01:10.757",61.05]
[7,"Eduardo Henrique",26,119,"00:01:10.229",61.51]
[7,"Eduardo Henrique",26,119,"00:01:10.526",61.25]
[7,"Eduardo Henrique",26,119,"00:01:10.618",61.17]
[7,"Eduardo Henrique",26,119,"00:01:10.552",61.23]
[7,"Eduardo Henrique",26,119,"00:01:10.391",61.37]
[7,"Eduardo Henrique",26,119,"00:01:10.333",61.42]
[7,"Eduardo Henrique",26,119,"00:01:10.237",61.51]
[7,"Eduardo Henrique",26,119,"00:01:10.624",61.17]
[7,"Eduardo Henrique",26,119,"00:01:10.590",61.2]
[7,"Eduardo Henrique",26,119,"00:01:10.788",61.03]
[7,"Eduardo Henrique",26,119,"00:01:10.412",61.35]
[7,"Eduardo Henrique",26,119,"00:01:10.340",61.42]
[7,"Lucas Guimarães",26,140,"00:01:19.768",54.16]
[7,"Lucas Guimarães",26,140,"00:01:11.828",60.14]
[7,"Lucas Guimarães",26,140,"00:01:11.376",60.52]
[7,"Lucas Guimarães",26,140,"00:01:11.218",60.66]
[7,"Lucas Guimarães",26,140,"00:01:10.461",61.31]
[7,"Lucas Guimarães",26,140,"00:01:10.287",61.46]
[7,"Lucas Guimarães",26,140,"00:01:10.789",61.03]
[7,"Lucas Guimarães",26,140,"00:01:10.669",61.13]
[7,"Lucas Guimarães",26,140,"00:01:10.300",61.45]
[7,"Lucas Guimarães",26,140,"00:01:09.977",61.73]
[7,"Lucas Guimarães",26,140,"00:01:10.169",61.57]
[7,"Lucas Guimarães",26,140,"00:01:10.503",61.27]
[7,"Lucas Guimarães",26,140,"00:01:10.406",61.36]
[7,"Lucas Guimarães",26,140,"00:01:10.490",61.29]
[7,"Lucas Guimarães",26,140,"00:01:10.251",61.49]
[7,"Lucas Guimarães",26,140,"00:01:10.118",61.61]
[7,"Lucas Guimarães",26,140,"00:01:10.086",61.64]
[7,"Lucas Guimarães",26,140,"00:01:10.154",61.58]
[7,"Lucas Guimarães",26,140,"00:01:10.068",61.65]
[7,"Lucas Guimarães",26,140,"00:01:10.108",61.62]
[7,"Lucas Guimarães",26,140,"00:01:10.099",61.63]
[7,"Lucas Guimarães",26,140,"00:01:10.283",61.47]
[7,"Lucas Guimarães",26,140,"00:01:10.157",61.58]
[7,"Lucas Guimarães",26,140,"00:01:10.015",61.7]
[7,"Lucas Guimarães",26,140,"00:01:10.548",61.23]
[7,"Lucas Guimarães",26,140,"00:01:10.127",61.6]
[7,"Jarbas Reis",26,105,"00:01:17.343",55.86]
[7,"Jarbas Reis",26,105,"00:01:11.590",60.34]
[7,"Jarbas Reis",26,105,"00:01:11.638",60.3]
[7,"Jarbas Reis",26,105,"00:01:11.646",60.3]
[7,"Jarbas Reis",26,105,"00:01:11.417",60.49]
[7,"Jarbas Reis",26,105,"00:01:10.904",60.93]
[7,"Jarbas Reis",26,105,"00:01:12.857",59.29]
[7,"Jarbas Reis",26,105,"00:01:10.565",61.22]
[7,"Jarbas Reis",26,105,"00:01:10.501",61.28]
[7,"Jarbas Reis",26,105,"00:01:10.993",60.85]
[7,"Jarbas Reis",26,105,"00:01:10.729",61.08]
[7,"Jarbas Reis",26,105,"00:01:10.671",61.13]
[7,"Jarbas Reis",26,105,"00:01:10.464",61.31]
[7,"Jarbas Reis",26,105,"00:01:11.065",60.79]
[7,"Jarbas Reis",26,105,"00:01:10.129",61.6]
[7,"Jarbas Reis",26,105,"00:01:10.142",61.59]
[7,"Jarbas Reis",26,105,"00:01:10.016",61.7]
[7,"Jarbas Reis",26,105,"00:01:10.406",61.36]
[7,"Jarbas Reis",26,105,"00:01:10.286",61.46]
[7,"Jarbas Reis",26,105,"00:01:10.407",61.36]
[7,"Jarbas Reis",26,105,"00:01:10.382",61.38]
[7,"Jarbas Reis",26,105,"00:01:10.509",61.27]
[7,"Jarbas Reis",26,105,"00:01:10.293",61.46]
[7,"Jarbas Reis",26,105,"00:01:10.414",61.35]
[7,"Jarbas Reis",26,105,"00:01:10.398",61.37]
[7,"Jarbas Reis",26,105,"00:01:10.559",61.23]
[7,"Wesley Bambirra",26,120,"00:01:27.955",49.12]
[7,"Wesley Bambirra",26,120,"00:01:12.395",59.67]
[7,"Wesley Bambirra",26,120,"00:01:11.117",60.74]
[7,"Wesley Bambirra",26,120,"00:01:11.415",60.49]
[7,"Wesley Bambirra",26,120,"00:01:11.269",60.62]
[7,"Wesley Bambirra",26,120,"00:01:10.651",61.15]
[7,"Wesley Bambirra",26,120,"00:01:11.031",60.82]
[7,"Wesley Bambirra",26,120,"00:01:11.090",60.77]
[7,"Wesley Bambirra",26,120,"00:01:11.284",60.6]
[7,"Wesley Bambirra",26,120,"00:01:10.376",61.38]
[7,"Wesley Bambirra",26,120,"00:01:10.134",61.6]
[7,"Wesley Bambirra",26,120,"00:01:10.596",61.19]
[7,"Wesley Bambirra",26,120,"00:01:10.273",61.47]
[7,"Wesley Bambirra",26,120,"00:01:10.154",61.58]
[7,"Wesley Bambirra",26,120,"00:01:11.275",60.61]
[7,"Wesley Bambirra",26,120,"00:01:10.431",61.34]
[7,"Wesley Bambirra",26,120,"00:01:10.334",61.42]
[7,"Wesley Bambirra",26,120,"00:01:10.530",61.25]
[7,"Wesley Bambirra",26,120,"00:01:10.389",61.37]
[7,"Wesley Bambirra",26,120,"00:01:10.542",61.24]
[7,"Wesley Bambirra",26,120,"00:01:10.390",61.37]
[7,"Wesley Bambirra",26,120,"00:01:10.779",61.04]
[7,"Wesley Bambirra",26,120,"00:01:10.545",61.24]
[7,"Wesley Bambirra",26,120,"00:01:10.459",61.31]
[7,"Wesley Bambirra",26,120,"00:01:10.418",61.35]
[7,"Wesley Bambirra",26,120,"00:01:10.908",60.92]
[7,"Marcelo Chagas",26,148,"00:01:17.387",55.82]
[7,"Marcelo Chagas",26,148,"00:01:11.298",60.59]
[7,"Marcelo Chagas",26,148,"00:01:11.315",60.58]
[7,"Marcelo Chagas",26,148,"00:01:11.369",60.53]
[7,"Marcelo Chagas",26,148,"00:01:23.853",51.52]
[7,"Marcelo Chagas",26,148,"00:01:10.739",61.07]
[7,"Marcelo Chagas",26,148,"00:01:10.475",61.3]
[7,"Marcelo Chagas",26,148,"00:01:10.614",61.18]
[7,"Marcelo Chagas",26,148,"00:01:10.617",61.18]
[7,"Marcelo Chagas",26,148,"00:01:10.385",61.38]
[7,"Marcelo Chagas",26,148,"00:01:10.144",61.59]
[7,"Marcelo Chagas",26,148,"00:01:10.458",61.31]
[7,"Marcelo Chagas",26,148,"00:01:10.200",61.54]
[7,"Marcelo Chagas",26,148,"00:01:10.234",61.51]
[7,"Marcelo Chagas",26,148,"00:01:14.351",58.1]
[7,"Marcelo Chagas",26,148,"00:01:10.356",61.4]
[7,"Marcelo Chagas",26,148,"00:01:09.992",61.72]
[7,"Marcelo Chagas",26,148,"00:01:10.125",61.6]
[7,"Marcelo Chagas",26,148,"00:01:10.389",61.37]
[7,"Marcelo Chagas",26,148,"00:01:10.321",61.43]
[7,"Marcelo Chagas",26,148,"00:01:10.149",61.58]
[7,"Marcelo Chagas",26,148,"00:01:10.128",61.6]
[7,"Marcelo Chagas",26,148,"00:01:09.952",61.76]
[7,"Marcelo Chagas",26,148,"00:01:10.593",61.2]
[7,"Marcelo Chagas",26,148,"00:01:10.193",61.54]
[7,"Marcelo Chagas",26,148,"00:01:11.206",60.67]
[7,"Cláudio Naves",26,143,"00:01:26.836",49.75]
[7,"Cláudio Naves",26,143,"00:01:13.123",59.08]
[7,"Cláudio Naves",26,143,"00:01:10.968",60.87]
[7,"Cláudio Naves",26,143,"00:01:11.283",60.6]
[7,"Cláudio Naves",26,143,"00:01:12.749",59.38]
[7,"Cláudio Naves",26,143,"00:01:12.333",59.72]
[7,"Cláudio Naves",26,143,"00:01:11.574",60.36]
[7,"Cláudio Naves",26,143,"00:01:10.999",60.85]
[7,"Cláudio Naves",26,143,"00:01:11.218",60.66]
[7,"Cláudio Naves",26,143,"00:01:10.988",60.86]
[7,"Cláudio Naves",26,143,"00:01:10.860",60.97]
[7,"Cláudio Naves",26,143,"00:01:11.619",60.32]
[7,"Cláudio Naves",26,143,"00:01:10.734",61.07]
[7,"Cláudio Naves",26,143,"00:01:11.147",60.72]
[7,"Cláudio Naves",26,143,"00:01:10.902",60.93]
[7,"Cláudio Naves",26,143,"00:01:11.208",60.67]
[7,"Cláudio Naves",26,143,"00:01:10.986",60.86]
[7,"Cláudio Naves",26,143,"00:01:11.404",60.5]
[7,"Cláudio Naves",26,143,"00:01:11.375",60.53]
[7,"Cláudio Naves",26,143,"00:01:11.058",60.8]
[7,"Cláudio Naves",26,143,"00:01:11.452",60.46]
[7,"Cláudio Naves",26,143,"00:01:11.381",60.52]
[7,"Cláudio Naves",26,143,"00:01:11.491",60.43]
[7,"Cláudio Naves",26,143,"00:01:12.007",59.99]
[7,"Cláudio Naves",26,143,"00:01:11.005",60.84]
[7,"Cláudio Naves",26,143,"00:01:11.550",60.38]
[7,"Hélio Chagas",26,111,"00:01:18.970",54.7]
[7,"Hélio Chagas",26,111,"00:01:13.029",59.15]
[7,"Hélio Chagas",26,111,"00:01:12.119",59.9]
[7,"Hélio Chagas",26,111,"00:01:13.433",58.83]
[7,"Hélio Chagas",26,111,"00:01:12.300",59.75]
[7,"Hélio Chagas",26,111,"00:01:12.504",59.58]
[7,"Hélio Chagas",26,111,"00:01:12.428",59.65]
[7,"Hélio Chagas",26,111,"00:01:12.253",59.79]
[7,"Hélio Chagas",26,111,"00:01:11.648",60.29]
[7,"Hélio Chagas",26,111,"00:01:12.396",59.67]
[7,"Hélio Chagas",26,111,"00:01:11.809",60.16]
[7,"Hélio Chagas",26,111,"00:01:12.274",59.77]
[7,"Hélio Chagas",26,111,"00:01:11.044",60.81]
[7,"Hélio Chagas",26,111,"00:01:12.079",59.93]
[7,"Hélio Chagas",26,111,"00:01:12.187",59.84]
[7,"Hélio Chagas",26,111,"00:01:11.838",60.14]
[7,"Hélio Chagas",26,111,"00:01:12.003",60]
[7,"Hélio Chagas",26,111,"00:01:12.151",59.87]
[7,"Hélio Chagas",26,111,"00:01:11.791",60.17]
[7,"Hélio Chagas",26,111,"00:01:12.138",59.89]
[7,"Hélio Chagas",26,111,"00:01:11.956",60.04]
[7,"Hélio Chagas",26,111,"00:01:11.913",60.07]
[7,"Hélio Chagas",26,111,"00:01:12.088",59.93]
[7,"Hélio Chagas",26,111,"00:01:12.043",59.96]
[7,"Hélio Chagas",26,111,"00:01:12.089",59.93]
[7,"Hélio Chagas",26,111,"00:01:11.558",60.37]
[7,"Izabella Rodrigues",26,102,"00:01:20.542",53.64]
[7,"Izabella Rodrigues",26,102,"00:01:13.471",58.8]
[7,"Izabella Rodrigues",26,102,"00:01:13.003",59.18]
[7,"Izabella Rodrigues",26,102,"00:01:13.043",59.14]
[7,"Izabella Rodrigues",26,102,"00:01:12.577",59.52]
[7,"Izabella Rodrigues",26,102,"00:01:12.829",59.32]
[7,"Izabella Rodrigues",26,102,"00:01:13.246",58.98]
[7,"Izabella Rodrigues",26,102,"00:01:12.667",59.45]
[7,"Izabella Rodrigues",26,102,"00:01:12.372",59.69]
[7,"Izabella Rodrigues",26,102,"00:01:11.970",60.03]
[7,"Izabella Rodrigues",26,102,"00:01:11.952",60.04]
[7,"Izabella Rodrigues",26,102,"00:01:11.763",60.2]
[7,"Izabella Rodrigues",26,102,"00:01:11.696",60.25]
[7,"Izabella Rodrigues",26,102,"00:01:11.687",60.26]
[7,"Izabella Rodrigues",26,102,"00:01:11.841",60.13]
[7,"Izabella Rodrigues",26,102,"00:01:11.938",60.05]
[7,"Izabella Rodrigues",26,102,"00:01:11.812",60.16]
[7,"Izabella Rodrigues",26,102,"00:01:11.749",60.21]
[7,"Izabella Rodrigues",26,102,"00:01:12.127",59.89]
[7,"Izabella Rodrigues",26,102,"00:01:11.847",60.13]
[7,"Izabella Rodrigues",26,102,"00:01:12.022",59.98]
[7,"Izabella Rodrigues",26,102,"00:01:12.069",59.94]
[7,"Izabella Rodrigues",26,102,"00:01:11.886",60.1]
[7,"Izabella Rodrigues",26,102,"00:01:11.907",60.08]
[7,"Izabella Rodrigues",26,102,"00:01:11.706",60.25]
[7,"Izabella Rodrigues",26,102,"00:01:11.881",60.1]
[7,"Jucimar Vieira",26,117,"00:01:18.355",55.13]
[7,"Jucimar Vieira",26,117,"00:01:13.877",58.48]
[7,"Jucimar Vieira",26,117,"00:01:12.114",59.91]
[7,"Jucimar Vieira",26,117,"00:01:13.619",58.68]
[7,"Jucimar Vieira",26,117,"00:01:12.667",59.45]
[7,"Jucimar Vieira",26,117,"00:01:11.912",60.07]
[7,"Jucimar Vieira",26,117,"00:01:12.162",59.87]
[7,"Jucimar Vieira",26,117,"00:01:11.607",60.33]
[7,"Jucimar Vieira",26,117,"00:01:13.258",58.97]
[7,"Jucimar Vieira",26,117,"00:01:17.905",55.45]
[7,"Jucimar Vieira",26,117,"00:01:11.943",60.05]
[7,"Jucimar Vieira",26,117,"00:01:11.610",60.33]
[7,"Jucimar Vieira",26,117,"00:01:11.889",60.09]
[7,"Jucimar Vieira",26,117,"00:01:11.686",60.26]
[7,"Jucimar Vieira",26,117,"00:01:12.173",59.86]
[7,"Jucimar Vieira",26,117,"00:01:11.766",60.2]
[7,"Jucimar Vieira",26,117,"00:01:19.042",54.65]
[7,"Jucimar Vieira",26,117,"00:01:13.454",58.81]
[7,"Jucimar Vieira",26,117,"00:01:11.605",60.33]
[7,"Jucimar Vieira",26,117,"00:01:12.055",59.95]
[7,"Jucimar Vieira",26,117,"00:01:11.438",60.47]
[7,"Jucimar Vieira",26,117,"00:01:11.877",60.1]
[7,"Jucimar Vieira",26,117,"00:01:11.560",60.37]
[7,"Jucimar Vieira",26,117,"00:01:11.043",60.81]
[7,"Jucimar Vieira",26,117,"00:01:11.118",60.74]
[7,"Jucimar Vieira",26,117,"00:01:11.639",60.3]
[7,"Wesley Camargos",25,127,"00:01:19.963",54.02]
[7,"Wesley Camargos",25,127,"00:01:13.914",58.45]
[7,"Wesley Camargos",25,127,"00:01:13.625",58.68]
[7,"Wesley Camargos",25,127,"00:01:12.909",59.25]
[7,"Wesley Camargos",25,127,"00:01:13.957",58.41]
[7,"Wesley Camargos",25,127,"00:01:12.569",59.53]
[7,"Wesley Camargos",25,127,"00:01:12.970",59.2]
[7,"Wesley Camargos",25,127,"00:01:13.023",59.16]
[7,"Wesley Camargos",25,127,"00:01:12.643",59.47]
[7,"Wesley Camargos",25,127,"00:01:13.385",58.87]
[7,"Wesley Camargos",25,127,"00:01:13.060",59.13]
[7,"Wesley Camargos",25,127,"00:01:12.789",59.35]
[7,"Wesley Camargos",25,127,"00:01:12.700",59.42]
[7,"Wesley Camargos",25,127,"00:01:13.643",58.66]
[7,"Wesley Camargos",25,127,"00:01:13.120",59.08]
[7,"Wesley Camargos",25,127,"00:01:13.603",58.69]
[7,"Wesley Camargos",25,127,"00:01:13.044",59.14]
[7,"Wesley Camargos",25,127,"00:01:12.966",59.21]
[7,"Wesley Camargos",25,127,"00:01:13.379",58.87]
[7,"Wesley Camargos",25,127,"00:01:13.265",58.96]
[7,"Wesley Camargos",25,127,"00:01:13.516",58.76]
[7,"Wesley Camargos",25,127,"00:01:12.767",59.37]
[7,"Wesley Camargos",25,127,"00:01:13.925",58.44]
[7,"Wesley Camargos",25,127,"00:01:13.688",58.63]
[7,"Wesley Camargos",25,127,"00:01:15.172",57.47]
[7,"Roberta Epifânio",24,112,"00:01:25.319",50.63]
[7,"Roberta Epifânio",24,112,"00:01:14.913",57.67]
[7,"Roberta Epifânio",24,112,"00:01:15.297",57.37]
[7,"Roberta Epifânio",24,112,"00:01:14.923",57.66]
[7,"Roberta Epifânio",24,112,"00:01:15.819",56.98]
[7,"Roberta Epifânio",24,112,"00:01:15.891",56.92]
[7,"Roberta Epifânio",24,112,"00:01:15.424",57.28]
[7,"Roberta Epifânio",24,112,"00:01:13.798",58.54]
[7,"Roberta Epifânio",24,112,"00:01:14.302",58.14]
[7,"Roberta Epifânio",24,112,"00:01:14.594",57.91]
[7,"Roberta Epifânio",24,112,"00:01:14.437",58.04]
[7,"Roberta Epifânio",24,112,"00:01:13.538",58.75]
[7,"Roberta Epifânio",24,112,"00:01:12.995",59.18]
[7,"Roberta Epifânio",24,112,"00:01:13.656",58.65]
[7,"Roberta Epifânio",24,112,"00:01:15.360",57.32]
[7,"Roberta Epifânio",24,112,"00:01:54.335",37.78]
[7,"Roberta Epifânio",24,112,"00:01:18.797",54.82]
[7,"Roberta Epifânio",24,112,"00:01:15.872",56.94]
[7,"Roberta Epifânio",24,112,"00:01:15.489",57.23]
[7,"Roberta Epifânio",24,112,"00:01:40.542",42.97]
[7,"Roberta Epifânio",24,112,"00:01:17.404",55.81]
[7,"Roberta Epifânio",24,112,"00:01:16.481",56.48]
[7,"Roberta Epifânio",24,112,"00:01:16.233",56.67]
[7,"Roberta Epifânio",24,112,"00:01:15.097",57.53]
[7,"Leandro Malias",19,109,"00:01:26.104",50.17]
[7,"Leandro Malias",19,109,"00:01:15.157",57.48]
[7,"Leandro Malias",19,109,"00:01:14.088",58.31]
[7,"Leandro Malias",19,109,"00:01:13.088",59.11]
[7,"Leandro Malias",19,109,"00:01:22.106",52.61]
[7,"Leandro Malias",19,109,"00:01:12.674",59.44]
[7,"Leandro Malias",19,109,"00:01:13.764",58.57]
[7,"Leandro Malias",19,109,"00:01:12.443",59.63]
[7,"Leandro Malias",19,109,"00:01:12.980",59.19]
[7,"Leandro Malias",19,109,"00:01:12.956",59.21]
[7,"Leandro Malias",19,109,"00:01:12.537",59.56]
[7,"Leandro Malias",19,109,"00:01:12.383",59.68]
[7,"Leandro Malias",19,109,"00:01:12.729",59.4]
[7,"Leandro Malias",19,109,"00:01:12.299",59.75]
[7,"Leandro Malias",19,109,"00:01:13.062",59.13]
[7,"Leandro Malias",19,109,"00:01:11.943",60.05]
[7,"Leandro Malias",19,109,"00:01:12.781",59.36]
[7,"Leandro Malias",19,109,"00:01:15.164",57.47]
[7,"Leandro Malias",19,109,"00:01:12.567",59.53]

{"sheet":"ETAPA 6","index":6,"n_rows":925,"n_cols":12,"rows_kept":925,"cut":false,"hidden":false,"merged":[[0,0,0,6]]}
["Obs.: Selecione até 3 pilotos colocando na frente do seu nome os números 1, 2 e 3.",null,null,null,null,null,null,"PILOTO",{"$f":"J52","v":"Wesley Bambirra"},{"$f":"K52","v":"Alexandre Melillo"},{"$f":"L52","v":"Daniel Nahum"}]
[1,"Wesley Bambirra",null,null,null,null,null,"MÉDIA",{"$f":"AVERAGE(J53:J97)","v":"00:00:50.064"},{"$f":"AVERAGE(K53:K97)","v":"00:00:50.094"},{"$f":"AVERAGE(L53:L97)","v":"00:00:50.140"}]
[2,"Alexandre Melillo",null,null,null,null,null,"MAXIMA",{"$f":"LARGE(J53:J97,1)","v":"00:00:55.307"},{"$f":"LARGE(K53:K97,1)","v":"00:00:55.106"},{"$f":"LARGE(L53:L97,1)","v":"00:00:55.523"}]
[3,"Daniel Nahum",null,null,null,null,null,"MÍNIMA",{"$f":"SMALL(J53:J97,1)","v":"00:00:49.262"},{"$f":"SMALL(K53:K97,1)","v":"00:00:49.263"},{"$f":"SMALL(L53:L97,1)","v":"00:00:49.383"}]
[null,"Eduardo Henrique",null,null,null,null,null,"Desvio Padrão",{"$f":"_xlfn.STDEV.S(J53:J97)","v":"00:00:00.981"},{"$f":"_xlfn.STDEV.S(K53:K97)","v":"00:00:00.975"},{"$f":"_xlfn.STDEV.S(L53:L97)","v":"00:00:01.416"}]
[null,"Marcelo Surerus",null,null,null,null,null,"TEMPO TOTAL",{"$f":"SUM(J53:J97,1)","v":1.0208597916666666},{"$f":"SUM(K53:K97,1)","v":1.0208724305555557},{"$f":"SUM(L53:L97,1)","v":1.0208916898148148}]
[null,"Guilherme Alves"]
[null,"Marcelo Marcondes"]
[null,"Wesley Canuto"]
[null,"Marcelo Sant'anna"]
[null,"Rodrigo Mercadante"]
[null,"Jarbas Reis"]
[null,"Maurício Júnior",null,null,null,null,null,null,null,null,{"$f":"SMALL(I4:K4,1)-L13","v":"00:00:49.262"}]
[null,"Marcelo Clemente",null,null,null,null,null,null,null,null,{"$f":"LARGE(I3:K3,1)+L13","v":"00:00:55.523"}]
[null,"Marcelo Chagas"]
[null,"Reila Ricardo"]
[null,"JOSEPH SCHIOPPO"]
[null,"Bernardo Freitas"]
[null,"Rodrigo Ricardo"]
[null,"Cláudio Naves"]
[null,"Hélio Chagas"]
[null,"Pedro Mello"]
[null,"Jucimar Vieira"]
[null,"Roberta Epifânio"]
[null,"Tati Marcondes"]
[null,"Marcelo Campos"]
[null,"Leandro Malias"]
[]
[]
[]
[]
[1]
[]
[]
[]
[]
[]
[]
[]
[]
[]
[]
[]
[]
[]
[]
[]
[]
[]
["ETAPA","PILOTO","NÚMERO VOLTAS","KART","Volta Tm","velocidade Media",null,null,null,{"$f":"MATCH(J52,$B$51:$B$1500,0)","v":1},{"$f":"MATCH(K52,$B$51:$B$1500,0)","v":37},73]
[6,"Wesley Bambirra",36,104,"00:00:55.307",51.36,null,null,null,{"$f":"VLOOKUP(J$52,$B$50:$F$1500,2,FALSE)","v":36},{"$f":"VLOOKUP(K$52,$B$50:$F$1500,2,FALSE)","v":36},{"$f":"VLOOKUP(L$52,$B$50:$F$1500,2,FALSE)","v":36}]
[6,"Wesley Bambirra",36,104,"00:00:51.182",55.5,null,null,"VOLTA",{"$f":"VLOOKUP(1,$A$2:$B$36,2,FALSE)","v":"Wesley Bambirra"},{"$f":"VLOOKUP(2,$A$2:$B$36,2,FALSE)","v":"Alexandre Melillo"},{"$f":"VLOOKUP(3,$A$2:$B$36,2,FALSE)","v":"Daniel Nahum"}]
[6,"Wesley Bambirra",36,104,"00:00:50.613",56.12,null,null,1,{"$f":"OFFSET($E$51:$E$1500,J50-1,,J51)","v":"00:00:55.307"},{"$f":"OFFSET($E$51:$E$1500,K50-1,,K51)","v":"00:00:55.106"},{"$f":"OFFSET($E$51:$E$1500,L50-1,,L51)","v":"00:00:54.531"}]
[6,"Wesley Bambirra",36,104,"00:00:50.053",56.75,null,null,2,"00:00:51.182","00:00:50.854","00:00:50.769"]
[6,"Wesley Bambirra",36,104,"00:00:50.105",56.69,null,null,3,"00:00:50.613","00:00:51.032","00:00:50.057"]
[6,"Wesley Bambirra",36,104,"00:00:49.812",57.02,null,null,4,"00:00:50.053","00:00:50.465","00:00:49.976"]
[6,"Wesley Bambirra",36,104,"00:00:49.737",57.11,null,null,5,"00:00:50.105","00:00:49.995","00:00:50.075"]
[6,"Wesley Bambirra",36,104,"00:00:49.679",57.18,null,null,6,"00:00:49.812","00:00:49.910","00:00:49.852"]
[6,"Wesley Bambirra",36,104,"00:00:50.745",55.97,null,null,7,"00:00:49.737","00:00:50.022","00:00:49.625"]
[6,"Wesley Bambirra",36,104,"00:00:49.935",56.88,null,null,8,"00:00:49.679","00:00:49.758","00:00:49.612"]
[6,"Wesley Bambirra",36,104,"00:00:49.846",56.98,null,null,9,"00:00:50.745","00:00:50.555","00:00:49.390"]
[6,"Wesley Bambirra",36,104,"00:00:50.388",56.37,null,null,10,"00:00:49.935","00:00:50.061","00:00:49.743"]
[6,"Wesley Bambirra",36,104,"00:00:49.862",56.97,null,null,11,"00:00:49.846","00:00:50.443","00:00:49.945"]
[6,"Wesley Bambirra",36,104,"00:00:49.850",56.98,null,null,12,"00:00:50.388","00:00:51.008","00:00:49.513"]
[6,"Wesley Bambirra",36,104,"00:00:49.831",57,null,null,13,"00:00:49.862","00:00:49.630","00:00:49.445"]
[6,"Wesley Bambirra",36,104,"00:00:49.950",56.86,null,null,14,"00:00:49.850","00:00:50.354","00:00:49.436"]
[6,"Wesley Bambirra",36,104,"00:00:49.878",56.95,null,null,15,"00:00:49.831","00:00:49.627","00:00:49.638"]
[6,"Wesley Bambirra",36,104,"00:00:49.484",57.4,null,null,16,"00:00:49.950","00:00:49.658","00:00:49.817"]
[6,"Wesley Bambirra",36,104,"00:00:49.846",56.98,null,null,17,"00:00:49.878","00:00:49.795","00:00:49.874"]
[6,"Wesley Bambirra",36,104,"00:00:49.748",57.1,null,null,18,"00:00:49.484","00:00:49.540","00:00:49.484"]
[6,"Wesley Bambirra",36,104,"00:00:49.747",57.1,null,null,19,"00:00:49.846","00:00:49.689","00:00:49.685"]
[6,"Wesley Bambirra",36,104,"00:00:49.573",57.3,null,null,20,"00:00:49.748","00:00:49.684","00:00:49.621"]
[6,"Wesley Bambirra",36,104,"00:00:49.482",57.4,null,null,21,"00:00:49.747","00:00:49.692","00:00:49.383"]
[6,"Wesley Bambirra",36,104,"00:00:49.262",57.66,null,null,22,"00:00:49.573","00:00:49.445","00:00:49.778"]
[6,"Wesley Bambirra",36,104,"00:00:49.499",57.38,null,null,23,"00:00:49.482","00:00:49.548","00:00:55.523"]
[6,"Wesley Bambirra",36,104,"00:00:49.724",57.12,null,null,24,"00:00:49.262","00:00:49.263","00:00:49.746"]
[6,"Wesley Bambirra",36,104,"00:00:49.791",57.05,null,null,25,"00:00:49.499","00:00:49.592","00:00:50.258"]
[6,"Wesley Bambirra",36,104,"00:00:50.104",56.69,null,null,26,"00:00:49.724","00:00:49.874","00:00:49.851"]
[6,"Wesley Bambirra",36,104,"00:00:50.640",56.09,null,null,27,"00:00:49.791","00:00:49.574","00:00:49.540"]
[6,"Wesley Bambirra",36,104,"00:00:50.199",56.58,null,null,28,"00:00:50.104","00:00:49.724","00:00:53.848"]
[6,"Wesley Bambirra",36,104,"00:00:49.646",57.21,null,null,29,"00:00:50.640","00:00:50.680","00:00:49.814"]
[6,"Wesley Bambirra",36,104,"00:00:49.621",57.24,null,null,30,"00:00:50.199","00:00:50.395","00:00:49.931"]
[6,"Wesley Bambirra",36,104,"00:00:49.625",57.24,null,null,31,"00:00:49.646","00:00:49.733","00:00:49.610"]
[6,"Wesley Bambirra",36,104,"00:00:49.674",57.18,null,null,32,"00:00:49.621","00:00:49.820","00:00:49.446"]
[6,"Wesley Bambirra",36,104,"00:00:50.140",56.65,null,null,33,"00:00:49.625","00:00:49.505","00:00:49.417"]
[6,"Wesley Bambirra",36,104,"00:00:49.708",57.14,null,null,34,"00:00:49.674","00:00:49.556","00:00:49.599"]
[6,"Alexandre Melillo",36,126,"00:00:55.106",51.54,null,null,35,"00:00:50.140","00:00:50.181","00:00:49.529"]
[6,"Alexandre Melillo",36,126,"00:00:50.854",55.85,null,null,36,"00:00:49.708","00:00:49.610","00:00:49.681"]
[6,"Alexandre Melillo",36,126,"00:00:51.032",55.66,null,null,37]
[6,"Alexandre Melillo",36,126,"00:00:50.465",56.28,null,null,38]
[6,"Alexandre Melillo",36,126,"00:00:49.995",56.81,null,null,39]
[6,"Alexandre Melillo",36,126,"00:00:49.910",56.91,null,null,40]
[6,"Alexandre Melillo",36,126,"00:00:50.022",56.78,null,null,41]
[6,"Alexandre Melillo",36,126,"00:00:49.758",57.08,null,null,42]
[6,"Alexandre Melillo",36,126,"00:00:50.555",56.18,null,null,43]
[6,"Alexandre Melillo",36,126,"00:00:50.061",56.74,null,null,44]
[6,"Alexandre Melillo",36,126,"00:00:50.443",56.31,null,null,45]
[6,"Alexandre Melillo",36,126,"00:00:51.008",55.69]
[6,"Alexandre Melillo",36,126,"00:00:49.630",57.23]
[6,"Alexandre Melillo",36,126,"00:00:50.354",56.41]
[6,"Alexandre Melillo",36,126,"00:00:49.627",57.23]
[6,"Alexandre Melillo",36,126,"00:00:49.658",57.2]
[6,"Alexandre Melillo",36,126,"00:00:49.795",57.04]
[6,"Alexandre Melillo",36,126,"00:00:49.540",57.34]
[6,"Alexandre Melillo",36,126,"00:00:49.689",57.16]
[6,"Alexandre Melillo",36,126,"00:00:49.684",57.17]
[6,"Alexandre Melillo",36,126,"00:00:49.692",57.16]
[6,"Alexandre Melillo",36,126,"00:00:49.445",57.45]
[6,"Alexandre Melillo",36,126,"00:00:49.548",57.33]
[6,"Alexandre Melillo",36,126,"00:00:49.263",57.66]
[6,"Alexandre Melillo",36,126,"00:00:49.592",57.28]
[6,"Alexandre Melillo",36,126,"00:00:49.874",56.95]
[6,"Alexandre Melillo",36,126,"00:00:49.574",57.3]
[6,"Alexandre Melillo",36,126,"00:00:49.724",57.12]
[6,"Alexandre Melillo",36,126,"00:00:50.680",56.05]
[6,"Alexandre Melillo",36,126,"00:00:50.395",56.36]
[6,"Alexandre Melillo",36,126,"00:00:49.733",57.11]
[6,"Alexandre Melillo",36,126,"00:00:49.820",57.01]
[6,"Alexandre Melillo",36,126,"00:00:49.505",57.38]
[6,"Alexandre Melillo",36,126,"00:00:49.556",57.32]
[6,"Alexandre Melillo",36,126,"00:00:50.181",56.6]
[6,"Alexandre Melillo",36,126,"00:00:49.610",57.25]
[6,"Daniel Nahum",36,149,"00:00:54.531",52.09]
[6,"Daniel Nahum",36,149,"00:00:50.769",55.95]
[6,"Daniel Nahum",36,149,"00:00:50.057",56.74]
[6,"Daniel Nahum",36,149,"00:00:49.976",56.84]
[6,"Daniel Nahum",36,149,"00:00:50.075",56.72]
[6,"Daniel Nahum",36,149,"00:00:49.852",56.98]
[6,"Daniel Nahum",36,149,"00:00:49.625",57.24]
[6,"Daniel Nahum",36,149,"00:00:49.612",57.25]
[6,"Daniel Nahum",36,149,"00:00:49.390",57.51]
[6,"Daniel Nahum",36,149,"00:00:49.743",57.1]
[6,"Daniel Nahum",36,149,"00:00:49.945",56.87]
[6,"Daniel Nahum",36,149,"00:00:49.513",57.37]
[6,"Daniel Nahum",36,149,"00:00:49.445",57.45]
[6,"Daniel Nahum",36,149,"00:00:49.436",57.46]
[6,"Daniel Nahum",36,149,"00:00:49.638",57.22]
[6,"Daniel Nahum",36,149,"00:00:49.817",57.02]
[6,"Daniel Nahum",36,149,"00:00:49.874",56.95]
[6,"Daniel Nahum",36,149,"00:00:49.484",57.4]
[6,"Daniel Nahum",36,149,"00:00:49.685",57.17]
[6,"Daniel Nahum",36,149,"00:00:49.621",57.24]
[6,"Daniel Nahum",36,149,"00:00:49.383",57.52]
[6,"Daniel Nahum",36,149,"00:00:49.778",57.06]
[6,"Daniel Nahum",36,149,"00:00:55.523",51.16]
[6,"Daniel Nahum",36,149,"00:00:49.746",57.1]
[6,"Daniel Nahum",36,149,"00:00:50.258",56.52]
[6,"Daniel Nahum",36,149,"00:00:49.851",56.98]
[6,"Daniel Nahum",36,149,"00:00:49.540",57.34]
[6,"Daniel Nahum",36,149,"00:00:53.848",52.75]
[6,"Daniel Nahum",36,149,"00:00:49.814",57.02]
[6,"Daniel Nahum",36,149,"00:00:49.931",56.89]
[6,"Daniel Nahum",36,149,"00:00:49.610",57.25]
[6,"Daniel Nahum",36,149,"00:00:49.446",57.44]
[6,"Daniel Nahum",36,149,"00:00:49.417",57.48]
[6,"Daniel Nahum",36,149,"00:00:49.599",57.27]
[6,"Daniel Nahum",36,149,"00:00:49.529",57.35]
[6,"Daniel Nahum",36,149,"00:00:49.681",57.17]
[6,"Eduardo Henrique",36,113,"00:00:55.083",51.57]
[6,"Eduardo Henrique",36,113,"00:00:51.456",55.2]
[6,"Eduardo Henrique",36,113,"00:00:51.687",54.95]
[6,"Eduardo Henrique",36,113,"00:00:51.492",55.16]
[6,"Eduardo Henrique",36,113,"00:00:50.661",56.07]
[6,"Eduardo Henrique",36,113,"00:00:50.499",56.25]
[6,"Eduardo Henrique",36,113,"00:00:50.225",56.55]
[6,"Eduardo Henrique",36,113,"00:00:49.869",56.96]
[6,"Eduardo Henrique",36,113,"00:00:49.900",56.92]
[6,"Eduardo Henrique",36,113,"00:00:49.778",57.06]
[6,"Eduardo Henrique",36,113,"00:00:49.860",56.97]
[6,"Eduardo Henrique",36,113,"00:00:49.704",57.15]
[6,"Eduardo Henrique",36,113,"00:00:49.929",56.89]
[6,"Eduardo Henrique",36,113,"00:00:49.770",57.07]
[6,"Eduardo Henrique",36,113,"00:00:50.055",56.75]
[6,"Eduardo Henrique",36,113,"00:00:49.701",57.15]
[6,"Eduardo Henrique",36,113,"00:00:49.599",57.27]
[6,"Eduardo Henrique",36,113,"00:00:49.785",57.05]
[6,"Eduardo Henrique",36,113,"00:00:50.167",56.62]
[6,"Eduardo Henrique",36,113,"00:00:50.030",56.77]
[6,"Eduardo Henrique",36,113,"00:00:49.796",57.04]
[6,"Eduardo Henrique",36,113,"00:00:49.732",57.11]
[6,"Eduardo Henrique",36,113,"00:00:49.823",57.01]
[6,"Eduardo Henrique",36,113,"00:00:49.898",56.92]
[6,"Eduardo Henrique",36,113,"00:00:49.696",57.16]
[6,"Eduardo Henrique",36,113,"00:00:49.797",57.04]
[6,"Eduardo Henrique",36,113,"00:00:50.334",56.43]
[6,"Eduardo Henrique",36,113,"00:00:49.887",56.94]
[6,"Eduardo Henrique",36,113,"00:00:50.031",56.77]
[6,"Eduardo Henrique",36,113,"00:00:50.762",55.96]
[6,"Eduardo Henrique",36,113,"00:00:49.973",56.84]
[6,"Eduardo Henrique",36,113,"00:00:49.752",57.09]
[6,"Eduardo Henrique",36,113,"00:00:49.863",56.96]
[6,"Eduardo Henrique",36,113,"00:00:49.822",57.01]
[6,"Eduardo Henrique",36,113,"00:00:49.822",57.01]
[6,"Eduardo Henrique",36,113,"00:00:49.888",56.94]
[6,"Marcelo Surerus",36,102,"00:00:57.358",49.52]
[6,"Marcelo Surerus",36,102,"00:00:50.895",55.81]
[6,"Marcelo Surerus",36,102,"00:00:51.643",55]
[6,"Marcelo Surerus",36,102,"00:00:50.956",55.74]
[6,"Marcelo Surerus",36,102,"00:00:50.309",56.46]
[6,"Marcelo Surerus",36,102,"00:00:50.364",56.4]
[6,"Marcelo Surerus",36,102,"00:00:50.181",56.6]
[6,"Marcelo Surerus",36,102,"00:00:50.001",56.81]
[6,"Marcelo Surerus",36,102,"00:00:50.125",56.67]
[6,"Marcelo Surerus",36,102,"00:00:50.121",56.67]
[6,"Marcelo Surerus",36,102,"00:00:49.891",56.93]
[6,"Marcelo Surerus",36,102,"00:00:49.655",57.2]
[6,"Marcelo Surerus",36,102,"00:00:49.766",57.08]
[6,"Marcelo Surerus",36,102,"00:00:50.078",56.72]
[6,"Marcelo Surerus",36,102,"00:00:49.805",57.03]
[6,"Marcelo Surerus",36,102,"00:00:49.720",57.13]
[6,"Marcelo Surerus",36,102,"00:00:50.318",56.45]
[6,"Marcelo Surerus",36,102,"00:00:49.820",57.01]
[6,"Marcelo Surerus",36,102,"00:00:50.187",56.6]
[6,"Marcelo Surerus",36,102,"00:00:50.126",56.67]
[6,"Marcelo Surerus",36,102,"00:00:50.142",56.65]
[6,"Marcelo Surerus",36,102,"00:00:49.881",56.94]
[6,"Marcelo Surerus",36,102,"00:00:49.882",56.94]
[6,"Marcelo Surerus",36,102,"00:00:50.398",56.36]
[6,"Marcelo Surerus",36,102,"00:00:50.664",56.06]
[6,"Marcelo Surerus",36,102,"00:00:50.688",56.04]
[6,"Marcelo Surerus",36,102,"00:00:50.155",56.63]
[6,"Marcelo Surerus",36,102,"00:00:50.243",56.53]
[6,"Marcelo Surerus",36,102,"00:00:50.312",56.46]
[6,"Marcelo Surerus",36,102,"00:00:49.930",56.89]
[6,"Marcelo Surerus",36,102,"00:00:52.109",54.51]
[6,"Marcelo Surerus",36,102,"00:00:50.149",56.64]
[6,"Marcelo Surerus",36,102,"00:00:50.104",56.69]
[6,"Marcelo Surerus",36,102,"00:00:50.148",56.64]
[6,"Marcelo Surerus",36,102,"00:00:50.124",56.67]
[6,"Marcelo Surerus",36,102,"00:00:50.035",56.77]
[6,"Guilherme Alves",36,138,"00:00:56.339",50.42]
[6,"Guilherme Alves",36,138,"00:00:51.408",55.25]
[6,"Guilherme Alves",36,138,"00:00:50.654",56.07]
[6,"Guilherme Alves",36,138,"00:00:50.224",56.55]
[6,"Guilherme Alves",36,138,"00:00:50.562",56.18]
[6,"Guilherme Alves",36,138,"00:00:49.973",56.84]
[6,"Guilherme Alves",36,138,"00:00:49.955",56.86]
[6,"Guilherme Alves",36,138,"00:00:50.784",55.93]
[6,"Guilherme Alves",36,138,"00:00:50.589",56.15]
[6,"Guilherme Alves",36,138,"00:00:50.281",56.49]
[6,"Guilherme Alves",36,138,"00:00:49.902",56.92]
[6,"Guilherme Alves",36,138,"00:00:49.929",56.89]
[6,"Guilherme Alves",36,138,"00:00:50.335",56.43]
[6,"Guilherme Alves",36,138,"00:00:49.922",56.9]
[6,"Guilherme Alves",36,138,"00:00:49.825",57.01]
[6,"Guilherme Alves",36,138,"00:00:50.022",56.78]
[6,"Guilherme Alves",36,138,"00:00:50.296",56.47]
[6,"Guilherme Alves",36,138,"00:00:49.910",56.91]
[6,"Guilherme Alves",36,138,"00:00:50.526",56.22]
[6,"Guilherme Alves",36,138,"00:00:50.219",56.56]
[6,"Guilherme Alves",36,138,"00:00:50.157",56.63]
[6,"Guilherme Alves",36,138,"00:00:49.957",56.86]
[6,"Guilherme Alves",36,138,"00:00:49.844",56.99]
[6,"Guilherme Alves",36,138,"00:00:50.393",56.36]
[6,"Guilherme Alves",36,138,"00:00:51.072",55.62]
[6,"Guilherme Alves",36,138,"00:00:50.539",56.2]
[6,"Guilherme Alves",36,138,"00:00:50.309",56.46]
[6,"Guilherme Alves",36,138,"00:00:50.121",56.67]
[6,"Guilherme Alves",36,138,"00:00:50.285",56.49]
[6,"Guilherme Alves",36,138,"00:00:50.036",56.77]
[6,"Guilherme Alves",36,138,"00:00:52.211",54.4]
[6,"Guilherme Alves",36,138,"00:00:50.135",56.66]
[6,"Guilherme Alves",36,138,"00:00:50.356",56.41]
[6,"Guilherme Alves",36,138,"00:00:50.155",56.63]
[6,"Guilherme Alves",36,138,"00:00:49.997",56.81]
[6,"Guilherme Alves",36,138,"00:00:50.066",56.73]
[6,"Marcelo Marcondes",36,108,"00:00:55.870",50.84]
[6,"Marcelo Marcondes",36,108,"00:00:51.508",55.14]
[6,"Marcelo Marcondes",36,108,"00:00:51.678",54.96]
[6,"Marcelo Marcondes",36,108,"00:00:49.904",56.92]
[6,"Marcelo Marcondes",36,108,"00:00:49.808",57.03]
[6,"Marcelo Marcondes",36,108,"00:00:49.868",56.96]
[6,"Marcelo Marcondes",36,108,"00:00:49.744",57.1]
[6,"Marcelo Marcondes",36,108,"00:00:49.543",57.33]
[6,"Marcelo Marcondes",36,108,"00:00:50.153",56.63]
[6,"Marcelo Marcondes",36,108,"00:00:50.349",56.41]
[6,"Marcelo Marcondes",36,108,"00:00:49.949",56.87]
[6,"Marcelo Marcondes",36,108,"00:00:50.706",56.02]
[6,"Marcelo Marcondes",36,108,"00:00:49.759",57.08]
[6,"Marcelo Marcondes",36,108,"00:00:50.653",56.08]
[6,"Marcelo Marcondes",36,108,"00:00:49.625",57.24]
[6,"Marcelo Marcondes",36,108,"00:00:58.435",48.61]
[6,"Marcelo Marcondes",36,108,"00:00:53.004",53.59]
[6,"Marcelo Marcondes",36,108,"00:00:50.616",56.12]
[6,"Marcelo Marcondes",36,108,"00:00:50.123",56.67]
[6,"Marcelo Marcondes",36,108,"00:00:49.977",56.83]
[6,"Marcelo Marcondes",36,108,"00:00:49.474",57.41]
[6,"Marcelo Marcondes",36,108,"00:00:50.013",56.79]
[6,"Marcelo Marcondes",36,108,"00:00:50.067",56.73]
[6,"Marcelo Marcondes",36,108,"00:00:49.722",57.13]
[6,"Marcelo Marcondes",36,108,"00:00:49.947",56.87]
[6,"Marcelo Marcondes",36,108,"00:00:50.074",56.72]
[6,"Marcelo Marcondes",36,108,"00:00:49.985",56.83]
[6,"Marcelo Marcondes",36,108,"00:00:50.110",56.68]
[6,"Marcelo Marcondes",36,108,"00:00:49.879",56.95]
[6,"Marcelo Marcondes",36,108,"00:00:49.683",57.17]
[6,"Marcelo Marcondes",36,108,"00:00:49.730",57.12]
[6,"Marcelo Marcondes",36,108,"00:00:49.881",56.94]
[6,"Marcelo Marcondes",36,108,"00:00:50.243",56.53]
[6,"Marcelo Marcondes",36,108,"00:00:50.018",56.79]
[6,"Marcelo Marcondes",36,108,"00:00:49.860",56.97]
[6,"Marcelo Marcondes",36,108,"00:00:49.649",57.21]
[6,"Wesley Canuto",36,105,"00:00:54.035",52.57]
[6,"Wesley Canuto",36,105,"00:00:51.123",55.56]
[6,"Wesley Canuto",36,105,"00:00:50.762",55.96]
[6,"Wesley Canuto",36,105,"00:00:50.547",56.19]
[6,"Wesley Canuto",36,105,"00:00:50.701",56.02]
[6,"Wesley Canuto",36,105,"00:00:49.995",56.81]
[6,"Wesley Canuto",36,105,"00:00:50.446",56.31]
[6,"Wesley Canuto",36,105,"00:00:50.202",56.58]
[6,"Wesley Canuto",36,105,"00:00:50.670",56.06]
[6,"Wesley Canuto",36,105,"00:00:50.072",56.73]
[6,"Wesley Canuto",36,105,"00:00:50.189",56.59]
[6,"Wesley Canuto",36,105,"00:00:50.815",55.9]
[6,"Wesley Canuto",36,105,"00:00:50.021",56.78]
[6,"Wesley Canuto",36,105,"00:00:49.808",57.03]
[6,"Wesley Canuto",36,105,"00:00:49.627",57.23]
[6,"Wesley Canuto",36,105,"00:01:00.031",47.32]
[6,"Wesley Canuto",36,105,"00:00:50.885",55.82]
[6,"Wesley Canuto",36,105,"00:00:49.862",56.97]
[6,"Wesley Canuto",36,105,"00:00:50.187",56.6]
[6,"Wesley Canuto",36,105,"00:00:50.189",56.59]
[6,"Wesley Canuto",36,105,"00:00:50.022",56.78]
[6,"Wesley Canuto",36,105,"00:00:50.164",56.62]
[6,"Wesley Canuto",36,105,"00:00:50.319",56.45]
[6,"Wesley Canuto",36,105,"00:00:50.607",56.13]
[6,"Wesley Canuto",36,105,"00:00:50.120",56.67]
[6,"Wesley Canuto",36,105,"00:00:50.698",56.03]
[6,"Wesley Canuto",36,105,"00:00:50.308",56.46]
[6,"Wesley Canuto",36,105,"00:00:50.313",56.45]
[6,"Wesley Canuto",36,105,"00:00:50.076",56.72]
[6,"Wesley Canuto",36,105,"00:00:50.135",56.66]
[6,"Wesley Canuto",36,105,"00:00:50.160",56.63]
[6,"Wesley Canuto",36,105,"00:00:50.077",56.72]
[6,"Wesley Canuto",36,105,"00:00:49.921",56.9]
[6,"Wesley Canuto",36,105,"00:00:50.681",56.04]
[6,"Wesley Canuto",36,105,"00:00:50.299",56.47]
[6,"Wesley Canuto",36,105,"00:00:49.908",56.91]
[6,"Marcelo Sant'anna",36,140,"00:01:05.997",43.04]
[6,"Marcelo Sant'anna",36,140,"00:00:50.554",56.19]
[6,"Marcelo Sant'anna",36,140,"00:00:50.299",56.47]
[6,"Marcelo Sant'anna",36,140,"00:00:50.347",56.42]
[6,"Marcelo Sant'anna",36,140,"00:00:50.299",56.47]
[6,"Marcelo Sant'anna",36,140,"00:00:50.222",56.56]
[6,"Marcelo Sant'anna",36,140,"00:00:50.185",56.6]
[6,"Marcelo Sant'anna",36,140,"00:00:49.967",56.85]
[6,"Marcelo Sant'anna",36,140,"00:00:50.188",56.6]
[6,"Marcelo Sant'anna",36,140,"00:00:50.776",55.94]
[6,"Marcelo Sant'anna",36,140,"00:00:50.087",56.71]
[6,"Marcelo Sant'anna",36,140,"00:00:50.589",56.15]
[6,"Marcelo Sant'anna",36,140,"00:00:51.145",55.54]
[6,"Marcelo Sant'anna",36,140,"00:00:50.087",56.71]
[6,"Marcelo Sant'anna",36,140,"00:00:50.030",56.77]
[6,"Marcelo Sant'anna",36,140,"00:00:50.050",56.75]
[6,"Marcelo Sant'anna",36,140,"00:00:50.071",56.73]
[6,"Marcelo Sant'anna",36,140,"00:00:49.774",57.07]
[6,"Marcelo Sant'anna",36,140,"00:00:49.908",56.91]
[6,"Marcelo Sant'anna",36,140,"00:00:50.202",56.58]
[6,"Marcelo Sant'anna",36,140,"00:00:49.998",56.81]
[6,"Marcelo Sant'anna",36,140,"00:00:49.810",57.02]
[6,"Marcelo Sant'anna",36,140,"00:00:49.478",57.41]
[6,"Marcelo Sant'anna",36,140,"00:00:50.754",55.96]
[6,"Marcelo Sant'anna",36,140,"00:00:50.845",55.86]
[6,"Marcelo Sant'anna",36,140,"00:00:50.999",55.7]
[6,"Marcelo Sant'anna",36,140,"00:00:50.395",56.36]
[6,"Marcelo Sant'anna",36,140,"00:00:50.587",56.15]
[6,"Marcelo Sant'anna",36,140,"00:00:50.582",56.15]
[6,"Marcelo Sant'anna",36,140,"00:00:50.293",56.48]
[6,"Marcelo Sant'anna",36,140,"00:00:50.176",56.61]
[6,"Marcelo Sant'anna",36,140,"00:00:50.986",55.71]
[6,"Marcelo Sant'anna",36,140,"00:00:50.414",56.34]
[6,"Marcelo Sant'anna",36,140,"00:00:49.979",56.83]
[6,"Marcelo Sant'anna",36,140,"00:00:49.912",56.91]
[6,"Marcelo Sant'anna",36,140,"00:00:50.484",56.26]
[6,"Rodrigo Mercadante",36,117,"00:00:56.032",50.69]
[6,"Rodrigo Mercadante",36,117,"00:00:52.538",54.06]
[6,"Rodrigo Mercadante",36,117,"00:00:51.386",55.28]
[6,"Rodrigo Mercadante",36,117,"00:00:51.154",55.53]
[6,"Rodrigo Mercadante",36,117,"00:00:50.697",56.03]
[6,"Rodrigo Mercadante",36,117,"00:00:51.838",54.79]
[6,"Rodrigo Mercadante",36,117,"00:00:50.240",56.54]
[6,"Rodrigo Mercadante",36,117,"00:00:50.732",55.99]
[6,"Rodrigo Mercadante",36,117,"00:00:50.845",55.86]
[6,"Rodrigo Mercadante",36,117,"00:00:50.733",55.99]
[6,"Rodrigo Mercadante",36,117,"00:00:49.992",56.82]
[6,"Rodrigo Mercadante",36,117,"00:00:50.231",56.55]
[6,"Rodrigo Mercadante",36,117,"00:00:49.776",57.06]
[6,"Rodrigo Mercadante",36,117,"00:00:49.685",57.17]
[6,"Rodrigo Mercadante",36,117,"00:00:49.606",57.26]
[6,"Rodrigo Mercadante",36,117,"00:00:49.898",56.92]
[6,"Rodrigo Mercadante",36,117,"00:00:50.909",55.79]
[6,"Rodrigo Mercadante",36,117,"00:00:50.994",55.7]
[6,"Rodrigo Mercadante",36,117,"00:00:51.261",55.41]
[6,"Rodrigo Mercadante",36,117,"00:00:51.096",55.59]
[6,"Rodrigo Mercadante",36,117,"00:00:49.927",56.89]
[6,"Rodrigo Mercadante",36,117,"00:00:50.344",56.42]
[6,"Rodrigo Mercadante",36,117,"00:00:49.572",57.3]
[6,"Rodrigo Mercadante",36,117,"00:00:50.214",56.57]
[6,"Rodrigo Mercadante",36,117,"00:00:50.761",55.96]
[6,"Rodrigo Mercadante",36,117,"00:00:50.924",55.78]
[6,"Rodrigo Mercadante",36,117,"00:00:50.393",56.36]
[6,"Rodrigo Mercadante",36,117,"00:00:51.002",55.69]
[6,"Rodrigo Mercadante",36,117,"00:00:50.709",56.01]
[6,"Rodrigo Mercadante",36,117,"00:00:50.663",56.06]
[6,"Rodrigo Mercadante",36,117,"00:00:49.776",57.06]
[6,"Rodrigo Mercadante",36,117,"00:00:51.025",55.67]
[6,"Rodrigo Mercadante",36,117,"00:00:50.218",56.56]
[6,"Rodrigo Mercadante",36,117,"00:00:50.106",56.69]
[6,"Rodrigo Mercadante",36,117,"00:00:49.926",56.89]
[6,"Rodrigo Mercadante",36,117,"00:00:50.477",56.27]
[6,"Jarbas Reis",36,131,"00:00:55.241",51.42]
[6,"Jarbas Reis",36,131,"00:00:51.476",55.18]
[6,"Jarbas Reis",36,131,"00:00:51.399",55.26]
[6,"Jarbas Reis",36,131,"00:00:50.106",56.69]
[6,"Jarbas Reis",36,131,"00:00:50.361",56.4]
[6,"Jarbas Reis",36,131,"00:00:49.872",56.95]
[6,"Jarbas Reis",36,131,"00:00:49.754",57.09]
[6,"Jarbas Reis",36,131,"00:00:50.524",56.22]
[6,"Jarbas Reis",36,131,"00:00:50.627",56.1]
[6,"Jarbas Reis",36,131,"00:00:49.842",56.99]
[6,"Jarbas Reis",36,131,"00:00:49.776",57.06]
[6,"Jarbas Reis",36,131,"00:00:49.790",57.05]
[6,"Jarbas Reis",36,131,"00:00:49.909",56.91]
[6,"Jarbas Reis",36,131,"00:00:50.054",56.75]
[6,"Jarbas Reis",36,131,"00:00:50.284",56.49]
[6,"Jarbas Reis",36,131,"00:00:57.961",49.01]
[6,"Jarbas Reis",36,131,"00:00:52.838",53.76]
[6,"Jarbas Reis",36,131,"00:00:51.276",55.39]
[6,"Jarbas Reis",36,131,"00:00:50.746",55.97]
[6,"Jarbas Reis",36,131,"00:00:50.645",56.08]
[6,"Jarbas Reis",36,131,"00:00:50.104",56.69]
[6,"Jarbas Reis",36,131,"00:00:49.719",57.13]
[6,"Jarbas Reis",36,131,"00:00:49.573",57.3]
[6,"Jarbas Reis",36,131,"00:00:51.030",55.66]
[6,"Jarbas Reis",36,131,"00:00:50.462",56.29]
[6,"Jarbas Reis",36,131,"00:00:50.843",55.87]
[6,"Jarbas Reis",36,131,"00:00:54.283",52.33]
[6,"Jarbas Reis",36,131,"00:00:50.303",56.47]
[6,"Jarbas Reis",36,131,"00:00:49.798",57.04]
[6,"Jarbas Reis",36,131,"00:00:50.589",56.15]
[6,"Jarbas Reis",36,131,"00:00:50.287",56.48]
[6,"Jarbas Reis",36,131,"00:00:49.651",57.21]
[6,"Jarbas Reis",36,131,"00:00:49.749",57.09]
[6,"Jarbas Reis",36,131,"00:00:50.015",56.79]
[6,"Jarbas Reis",36,131,"00:00:49.839",56.99]
[6,"Jarbas Reis",36,131,"00:00:50.548",56.19]
[6,"Maurício Júnior",36,116,"00:00:55.093",51.56]
[6,"Maurício Júnior",36,116,"00:00:56.204",50.54]
[6,"Maurício Júnior",36,116,"00:00:50.719",56]
[6,"Maurício Júnior",36,116,"00:00:51",55.69]
[6,"Maurício Júnior",36,116,"00:00:50.594",56.14]
[6,"Maurício Júnior",36,116,"00:00:50.379",56.38]
[6,"Maurício Júnior",36,116,"00:00:50.208",56.57]
[6,"Maurício Júnior",36,116,"00:00:49.936",56.88]
[6,"Maurício Júnior",36,116,"00:00:50.822",55.89]
[6,"Maurício Júnior",36,116,"00:00:50.582",56.15]
[6,"Maurício Júnior",36,116,"00:00:50.224",56.55]
[6,"Maurício Júnior",36,116,"00:00:50.138",56.65]
[6,"Maurício Júnior",36,116,"00:00:49.998",56.81]
[6,"Maurício Júnior",36,116,"00:00:50.103",56.69]
[6,"Maurício Júnior",36,116,"00:00:50.392",56.37]
[6,"Maurício Júnior",36,116,"00:00:51.488",55.17]
[6,"Maurício Júnior",36,116,"00:00:51.112",55.57]
[6,"Maurício Júnior",36,116,"00:00:49.917",56.9]
[6,"Maurício Júnior",36,116,"00:00:50.603",56.13]
[6,"Maurício Júnior",36,116,"00:00:50.437",56.32]
[6,"Maurício Júnior",36,116,"00:00:49.975",56.84]
[6,"Maurício Júnior",36,116,"00:00:50.119",56.67]
[6,"Maurício Júnior",36,116,"00:00:50.159",56.63]
[6,"Maurício Júnior",36,116,"00:00:50.233",56.54]
[6,"Maurício Júnior",36,116,"00:00:50.218",56.56]
[6,"Maurício Júnior",36,116,"00:00:50.411",56.34]
[6,"Maurício Júnior",36,116,"00:00:50.290",56.48]
[6,"Maurício Júnior",36,116,"00:00:59.788",47.51]
[6,"Maurício Júnior",36,116,"00:00:49.732",57.11]
[6,"Maurício Júnior",36,116,"00:00:49.831",57]
[6,"Maurício Júnior",36,116,"00:00:50.686",56.04]
[6,"Maurício Júnior",36,116,"00:00:49.775",57.06]
[6,"Maurício Júnior",36,116,"00:00:49.705",57.15]
[6,"Maurício Júnior",36,116,"00:00:49.834",57]
[6,"Maurício Júnior",36,116,"00:00:49.484",57.4]
[6,"Maurício Júnior",36,116,"00:00:50.432",56.32]
[6,"Marcelo Clemente",36,110,"00:01:01.079",46.5]
[6,"Marcelo Clemente",36,110,"00:00:52.383",54.22]
[6,"Marcelo Clemente",36,110,"00:00:51.210",55.47]
[6,"Marcelo Clemente",36,110,"00:00:50.567",56.17]
[6,"Marcelo Clemente",36,110,"00:00:50.491",56.26]
[6,"Marcelo Clemente",36,110,"00:00:51.998",54.63]
[6,"Marcelo Clemente",36,110,"00:00:51.375",55.29]
[6,"Marcelo Clemente",36,110,"00:00:50.082",56.71]
[6,"Marcelo Clemente",36,110,"00:00:50.462",56.29]
[6,"Marcelo Clemente",36,110,"00:00:50.726",55.99]
[6,"Marcelo Clemente",36,110,"00:00:50.066",56.73]
[6,"Marcelo Clemente",36,110,"00:00:50.010",56.8]
[6,"Marcelo Clemente",36,110,"00:00:49.841",56.99]
[6,"Marcelo Clemente",36,110,"00:00:49.645",57.21]
[6,"Marcelo Clemente",36,110,"00:00:49.741",57.1]
[6,"Marcelo Clemente",36,110,"00:00:49.713",57.14]
[6,"Marcelo Clemente",36,110,"00:00:51.125",55.56]
[6,"Marcelo Clemente",36,110,"00:00:50.415",56.34]
[6,"Marcelo Clemente",36,110,"00:00:49.916",56.9]
[6,"Marcelo Clemente",36,110,"00:00:50.273",56.5]
[6,"Marcelo Clemente",36,110,"00:00:50.109",56.68]
[6,"Marcelo Clemente",36,110,"00:00:49.737",57.11]
[6,"Marcelo Clemente",36,110,"00:00:49.803",57.03]
[6,"Marcelo Clemente",36,110,"00:00:50.166",56.62]
[6,"Marcelo Clemente",36,110,"00:00:50.637",56.09]
[6,"Marcelo Clemente",36,110,"00:00:50.443",56.31]
[6,"Marcelo Clemente",36,110,"00:00:58.566",48.5]
[6,"Marcelo Clemente",36,110,"00:00:50.103",56.69]
[6,"Marcelo Clemente",36,110,"00:00:49.915",56.9]
[6,"Marcelo Clemente",36,110,"00:00:50.033",56.77]
[6,"Marcelo Clemente",36,110,"00:00:50.392",56.37]
[6,"Marcelo Clemente",36,110,"00:00:49.843",56.99]
[6,"Marcelo Clemente",36,110,"00:00:49.813",57.02]
[6,"Marcelo Clemente",36,110,"00:00:49.728",57.12]
[6,"Marcelo Clemente",36,110,"00:00:49.722",57.13]
[6,"Marcelo Clemente",36,110,"00:00:50.668",56.06]
[6,"Marcelo Chagas",36,122,"00:00:55.051",51.6]
[6,"Marcelo Chagas",36,122,"00:00:51.720",54.92]
[6,"Marcelo Chagas",36,122,"00:00:51.376",55.29]
[6,"Marcelo Chagas",36,122,"00:00:50.814",55.9]
[6,"Marcelo Chagas",36,122,"00:00:50.544",56.2]
[6,"Marcelo Chagas",36,122,"00:00:50.625",56.11]
[6,"Marcelo Chagas",36,122,"00:00:50.717",56]
[6,"Marcelo Chagas",36,122,"00:00:50.263",56.51]
[6,"Marcelo Chagas",36,122,"00:00:51.201",55.48]
[6,"Marcelo Chagas",36,122,"00:00:51.135",55.55]
[6,"Marcelo Chagas",36,122,"00:00:50.782",55.93]
[6,"Marcelo Chagas",36,122,"00:00:50.425",56.33]
[6,"Marcelo Chagas",36,122,"00:00:50.232",56.55]
[6,"Marcelo Chagas",36,122,"00:00:50.219",56.56]
[6,"Marcelo Chagas",36,122,"00:00:50.373",56.39]
[6,"Marcelo Chagas",36,122,"00:00:50.978",55.72]
[6,"Marcelo Chagas",36,122,"00:00:51.043",55.65]
[6,"Marcelo Chagas",36,122,"00:00:50.383",56.38]
[6,"Marcelo Chagas",36,122,"00:00:50.408",56.35]
[6,"Marcelo Chagas",36,122,"00:00:50.315",56.45]
[6,"Marcelo Chagas",36,122,"00:00:50.789",55.93]
[6,"Marcelo Chagas",36,122,"00:00:50.158",56.63]
[6,"Marcelo Chagas",36,122,"00:00:50.356",56.41]
[6,"Marcelo Chagas",36,122,"00:00:51.542",55.11]
[6,"Marcelo Chagas",36,122,"00:00:50.469",56.28]
[6,"Marcelo Chagas",36,122,"00:00:51.286",55.38]
[6,"Marcelo Chagas",36,122,"00:00:50.398",56.36]
[6,"Marcelo Chagas",36,122,"00:00:50.760",55.96]
[6,"Marcelo Chagas",36,122,"00:00:50.750",55.97]
[6,"Marcelo Chagas",36,122,"00:00:52.695",53.9]
[6,"Marcelo Chagas",36,122,"00:00:51.613",55.03]
[6,"Marcelo Chagas",36,122,"00:00:50.222",56.56]
[6,"Marcelo Chagas",36,122,"00:00:50.489",56.26]
[6,"Marcelo Chagas",36,122,"00:00:50.576",56.16]
[6,"Marcelo Chagas",36,122,"00:00:50.603",56.13]
[6,"Marcelo Chagas",36,122,"00:00:50.613",56.12]
[6,"Reila Ricardo",36,135,"00:00:55.748",50.95]
[6,"Reila Ricardo",36,135,"00:00:51.930",54.7]
[6,"Reila Ricardo",36,135,"00:00:50.975",55.72]
[6,"Reila Ricardo",36,135,"00:00:51.398",55.26]
[6,"Reila Ricardo",36,135,"00:00:51.229",55.45]
[6,"Reila Ricardo",36,135,"00:00:50.598",56.14]
[6,"Reila Ricardo",36,135,"00:00:50.796",55.92]
[6,"Reila Ricardo",36,135,"00:00:50.472",56.28]
[6,"Reila Ricardo",36,135,"00:00:50.288",56.48]
[6,"Reila Ricardo",36,135,"00:00:50.342",56.42]
[6,"Reila Ricardo",36,135,"00:00:50.317",56.45]
[6,"Reila Ricardo",36,135,"00:00:50.366",56.4]
[6,"Reila Ricardo",36,135,"00:00:50.346",56.42]
[6,"Reila Ricardo",36,135,"00:00:50.227",56.55]
[6,"Reila Ricardo",36,135,"00:00:50.467",56.28]
[6,"Reila Ricardo",36,135,"00:00:50.762",55.96]
[6,"Reila Ricardo",36,135,"00:00:51.283",55.39]
[6,"Reila Ricardo",36,135,"00:00:50.343",56.42]
[6,"Reila Ricardo",36,135,"00:00:50.899",55.8]
[6,"Reila Ricardo",36,135,"00:00:50.638",56.09]
[6,"Reila Ricardo",36,135,"00:00:50.279",56.49]
[6,"Reila Ricardo",36,135,"00:00:50.137",56.65]
[6,"Reila Ricardo",36,135,"00:00:50.206",56.57]
[6,"Reila Ricardo",36,135,"00:00:50.498",56.25]
[6,"Reila Ricardo",36,135,"00:00:50.738",55.98]
[6,"Reila Ricardo",36,135,"00:00:52.607",53.99]
[6,"Reila Ricardo",36,135,"00:00:50.394",56.36]
[6,"Reila Ricardo",36,135,"00:00:50.361",56.4]
[6,"Reila Ricardo",36,135,"00:00:50.924",55.78]
[6,"Reila Ricardo",36,135,"00:00:51.802",54.83]
[6,"Reila Ricardo",36,135,"00:00:51.916",54.71]
[6,"Reila Ricardo",36,135,"00:00:50.344",56.42]
[6,"Reila Ricardo",36,135,"00:00:50.680",56.05]
[6,"Reila Ricardo",36,135,"00:00:50.563",56.18]
[6,"Reila Ricardo",36,135,"00:00:50.591",56.14]
[6,"Reila Ricardo",36,135,"00:00:50.453",56.3]
[6,"JOSEPH SCHIOPPO",36,137,"00:00:57.074",49.77]
[6,"JOSEPH SCHIOPPO",36,137,"00:00:53.641",52.95]
[6,"JOSEPH SCHIOPPO",36,137,"00:00:51.474",55.18]
[6,"JOSEPH SCHIOPPO",36,137,"00:00:50.435",56.32]
[6,"JOSEPH SCHIOPPO",36,137,"00:00:51.174",55.5]
[6,"JOSEPH SCHIOPPO",36,137,"00:00:52.034",54.59]
[6,"JOSEPH SCHIOPPO",36,137,"00:00:50.896",55.81]
[6,"JOSEPH SCHIOPPO",36,137,"00:00:50.693",56.03]
[6,"JOSEPH SCHIOPPO",36,137,"00:00:50.861",55.85]
[6,"JOSEPH SCHIOPPO",36,137,"00:00:50.978",55.72]
[6,"JOSEPH SCHIOPPO",36,137,"00:00:50.221",56.56]
[6,"JOSEPH SCHIOPPO",36,137,"00:00:50.611",56.12]
[6,"JOSEPH SCHIOPPO",36,137,"00:00:51.633",55.01]
[6,"JOSEPH SCHIOPPO",36,137,"00:00:50.684",56.04]
[6,"JOSEPH SCHIOPPO",36,137,"00:00:50.456",56.29]
[6,"JOSEPH SCHIOPPO",36,137,"00:00:50.712",56.01]
[6,"JOSEPH SCHIOPPO",36,137,"00:00:50.788",55.93]
[6,"JOSEPH SCHIOPPO",36,137,"00:00:51.168",55.51]
[6,"JOSEPH SCHIOPPO",36,137,"00:00:50.879",55.83]
[6,"JOSEPH SCHIOPPO",36,137,"00:00:51.510",55.14]
[6,"JOSEPH SCHIOPPO",36,137,"00:00:50.445",56.31]
[6,"JOSEPH SCHIOPPO",36,137,"00:00:50.858",55.85]
[6,"JOSEPH SCHIOPPO",36,137,"00:00:50.596",56.14]
[6,"JOSEPH SCHIOPPO",36,137,"00:00:50.177",56.61]
[6,"JOSEPH SCHIOPPO",36,137,"00:00:50.372",56.39]
[6,"JOSEPH SCHIOPPO",36,137,"00:00:50.467",56.28]
[6,"JOSEPH SCHIOPPO",36,137,"00:00:50.387",56.37]
[6,"JOSEPH SCHIOPPO",36,137,"00:00:50.235",56.54]
[6,"JOSEPH SCHIOPPO",36,137,"00:00:50.096",56.7]
[6,"JOSEPH SCHIOPPO",36,137,"00:00:50.156",56.63]
[6,"JOSEPH SCHIOPPO",36,137,"00:00:51.057",55.63]
[6,"JOSEPH SCHIOPPO",36,137,"00:00:50.078",56.72]
[6,"JOSEPH SCHIOPPO",36,137,"00:00:50.576",56.16]
[6,"JOSEPH SCHIOPPO",36,137,"00:00:50.341",56.42]
[6,"JOSEPH SCHIOPPO",36,137,"00:00:50.368",56.39]
[6,"JOSEPH SCHIOPPO",36,137,"00:00:50.017",56.79]
[6,"Bernardo Freitas",36,142,"00:00:55.744",50.95]
[6,"Bernardo Freitas",36,142,"00:00:53.549",53.04]
[6,"Bernardo Freitas",36,142,"00:00:51.019",55.67]
[6,"Bernardo Freitas",36,142,"00:00:50.367",56.39]
[6,"Bernardo Freitas",36,142,"00:00:50.690",56.03]
[6,"Bernardo Freitas",36,142,"00:00:50.310",56.46]
[6,"Bernardo Freitas",36,142,"00:00:50.525",56.22]
[6,"Bernardo Freitas",36,142,"00:00:50.278",56.49]
[6,"Bernardo Freitas",36,142,"00:00:50.977",55.72]
[6,"Bernardo Freitas",36,142,"00:00:51.267",55.4]
[6,"Bernardo Freitas",36,142,"00:00:50.124",56.67]
[6,"Bernardo Freitas",36,142,"00:00:50.200",56.58]
[6,"Bernardo Freitas",36,142,"00:00:50.363",56.4]
[6,"Bernardo Freitas",36,142,"00:00:50.208",56.57]
[6,"Bernardo Freitas",36,142,"00:00:50.491",56.26]
[6,"Bernardo Freitas",36,142,"00:00:51.220",55.45]
[6,"Bernardo Freitas",36,142,"00:00:51.705",54.93]
[6,"Bernardo Freitas",36,142,"00:00:51.157",55.52]
[6,"Bernardo Freitas",36,142,"00:00:51.284",55.39]
[6,"Bernardo Freitas",36,142,"00:00:52.100",54.52]
[6,"Bernardo Freitas",36,142,"00:00:51.162",55.52]
[6,"Bernardo Freitas",36,142,"00:00:51.370",55.29]
[6,"Bernardo Freitas",36,142,"00:00:51.587",55.06]
[6,"Bernardo Freitas",36,142,"00:00:51.644",55]
[6,"Bernardo Freitas",36,142,"00:00:51.990",54.63]
[6,"Bernardo Freitas",36,142,"00:00:51.798",54.84]
[6,"Bernardo Freitas",36,142,"00:00:51.696",54.94]
[6,"Bernardo Freitas",36,142,"00:00:51.090",55.6]
[6,"Bernardo Freitas",36,142,"00:00:51.199",55.48]
[6,"Bernardo Freitas",36,142,"00:00:51.025",55.67]
[6,"Bernardo Freitas",36,142,"00:00:50.917",55.78]
[6,"Bernardo Freitas",36,142,"00:00:50.883",55.82]
[6,"Bernardo Freitas",36,142,"00:00:50.721",56]
[6,"Bernardo Freitas",36,142,"00:00:50.463",56.29]
[6,"Bernardo Freitas",36,142,"00:00:50.642",56.09]
[6,"Bernardo Freitas",36,142,"00:00:50.512",56.23]
[6,"Rodrigo Ricardo",36,134,"00:00:55.873",50.84]
[6,"Rodrigo Ricardo",36,134,"00:00:56.506",50.27]
[6,"Rodrigo Ricardo",36,134,"00:00:52.086",54.53]
[6,"Rodrigo Ricardo",36,134,"00:00:51.023",55.67]
[6,"Rodrigo Ricardo",36,134,"00:00:51.583",55.06]
[6,"Rodrigo Ricardo",36,134,"00:00:52.010",54.61]
[6,"Rodrigo Ricardo",36,134,"00:00:51.164",55.52]
[6,"Rodrigo Ricardo",36,134,"00:00:50.438",56.31]
[6,"Rodrigo Ricardo",36,134,"00:00:50.753",55.97]
[6,"Rodrigo Ricardo",36,134,"00:00:50.877",55.83]
[6,"Rodrigo Ricardo",36,134,"00:00:50.592",56.14]
[6,"Rodrigo Ricardo",36,134,"00:00:51.289",55.38]
[6,"Rodrigo Ricardo",36,134,"00:00:51.290",55.38]
[6,"Rodrigo Ricardo",36,134,"00:00:51.632",55.01]
[6,"Rodrigo Ricardo",36,134,"00:00:50.524",56.22]
[6,"Rodrigo Ricardo",36,134,"00:00:50.885",55.82]
[6,"Rodrigo Ricardo",36,134,"00:00:50.878",55.83]
[6,"Rodrigo Ricardo",36,134,"00:00:50.734",55.99]
[6,"Rodrigo Ricardo",36,134,"00:00:50.809",55.9]
[6,"Rodrigo Ricardo",36,134,"00:00:51.035",55.66]
[6,"Rodrigo Ricardo",36,134,"00:00:51.159",55.52]
[6,"Rodrigo Ricardo",36,134,"00:00:51.643",55]
[6,"Rodrigo Ricardo",36,134,"00:00:50.527",56.22]
[6,"Rodrigo Ricardo",36,134,"00:00:50.851",55.86]
[6,"Rodrigo Ricardo",36,134,"00:00:50.695",56.03]
[6,"Rodrigo Ricardo",36,134,"00:00:50.869",55.84]
[6,"Rodrigo Ricardo",36,134,"00:00:50.883",55.82]
[6,"Rodrigo Ricardo",36,134,"00:00:50.823",55.89]
[6,"Rodrigo Ricardo",36,134,"00:00:50.995",55.7]
[6,"Rodrigo Ricardo",36,134,"00:00:50.603",56.13]
[6,"Rodrigo Ricardo",36,134,"00:00:50.670",56.06]
[6,"Rodrigo Ricardo",36,134,"00:00:50.708",56.01]
[6,"Rodrigo Ricardo",36,134,"00:00:50.550",56.19]
[6,"Rodrigo Ricardo",36,134,"00:00:50.436",56.32]
[6,"Rodrigo Ricardo",36,134,"00:00:50.757",55.96]
[6,"Rodrigo Ricardo",36,134,"00:00:50.676",56.05]
[6,"Cláudio Naves",36,151,"00:00:56.724",50.07]
[6,"Cláudio Naves",36,151,"00:00:52.079",54.54]
[6,"Cláudio Naves",36,151,"00:00:52.196",54.42]
[6,"Cláudio Naves",36,151,"00:00:51.368",55.3]
[6,"Cláudio Naves",36,151,"00:00:50.980",55.72]
[6,"Cláudio Naves",36,151,"00:00:51.539",55.11]
[6,"Cláudio Naves",36,151,"00:00:51.390",55.27]
[6,"Cláudio Naves",36,151,"00:00:51.331",55.33]
[6,"Cláudio Naves",36,151,"00:00:50.526",56.22]
[6,"Cláudio Naves",36,151,"00:00:50.768",55.95]
[6,"Cláudio Naves",36,151,"00:00:50.616",56.12]
[6,"Cláudio Naves",36,151,"00:00:50.541",56.2]
[6,"Cláudio Naves",36,151,"00:00:51.219",55.46]
[6,"Cláudio Naves",36,151,"00:00:51.069",55.62]
[6,"Cláudio Naves",36,151,"00:00:50.481",56.27]
[6,"Cláudio Naves",36,151,"00:00:50.849",55.86]
[6,"Cláudio Naves",36,151,"00:00:51.109",55.58]
[6,"Cláudio Naves",36,151,"00:00:50.764",55.95]
[6,"Cláudio Naves",36,151,"00:00:51.690",54.95]
[6,"Cláudio Naves",36,151,"00:00:50.849",55.86]
[6,"Cláudio Naves",36,151,"00:00:50.855",55.85]
[6,"Cláudio Naves",36,151,"00:00:51.095",55.59]
[6,"Cláudio Naves",36,151,"00:00:50.751",55.97]
[6,"Cláudio Naves",36,151,"00:00:50.667",56.06]
[6,"Cláudio Naves",36,151,"00:00:50.620",56.11]
[6,"Cláudio Naves",36,151,"00:00:51.043",55.65]
[6,"Cláudio Naves",36,151,"00:00:51.658",54.98]
[6,"Cláudio Naves",36,151,"00:00:51.579",55.07]
[6,"Cláudio Naves",36,151,"00:00:51.069",55.62]
[6,"Cláudio Naves",36,151,"00:00:51.312",55.36]
[6,"Cláudio Naves",36,151,"00:00:51.148",55.53]
[6,"Cláudio Naves",36,151,"00:00:51.317",55.35]
[6,"Cláudio Naves",36,151,"00:00:51.159",55.52]
[6,"Cláudio Naves",36,151,"00:00:51.256",55.42]
[6,"Cláudio Naves",36,151,"00:00:51.738",54.9]
[6,"Cláudio Naves",36,151,"00:00:51.824",54.81]
[6,"Hélio Chagas",35,146,"00:00:55.892",50.82]
[6,"Hélio Chagas",35,146,"00:00:51.728",54.91]
[6,"Hélio Chagas",35,146,"00:00:51.051",55.64]
[6,"Hélio Chagas",35,146,"00:00:52.844",53.75]
[6,"Hélio Chagas",35,146,"00:00:51.113",55.57]
[6,"Hélio Chagas",35,146,"00:00:51.244",55.43]
[6,"Hélio Chagas",35,146,"00:00:51.392",55.27]
[6,"Hélio Chagas",35,146,"00:00:51.365",55.3]
[6,"Hélio Chagas",35,146,"00:00:50.615",56.12]
[6,"Hélio Chagas",35,146,"00:00:51.633",55.01]
[6,"Hélio Chagas",35,146,"00:00:50.716",56.01]
[6,"Hélio Chagas",35,146,"00:00:50.918",55.78]
[6,"Hélio Chagas",35,146,"00:00:51.179",55.5]
[6,"Hélio Chagas",35,146,"00:00:50.730",55.99]
[6,"Hélio Chagas",35,146,"00:00:50.637",56.09]
[6,"Hélio Chagas",35,146,"00:00:50.931",55.77]
[6,"Hélio Chagas",35,146,"00:00:50.815",55.9]
[6,"Hélio Chagas",35,146,"00:00:50.860",55.85]
[6,"Hélio Chagas",35,146,"00:00:50.931",55.77]
[6,"Hélio Chagas",35,146,"00:00:52.156",54.46]
[6,"Hélio Chagas",35,146,"00:00:51.575",55.07]
[6,"Hélio Chagas",35,146,"00:00:50.722",56]
[6,"Hélio Chagas",35,146,"00:00:50.794",55.92]
[6,"Hélio Chagas",35,146,"00:00:50.820",55.89]
[6,"Hélio Chagas",35,146,"00:00:50.995",55.7]
[6,"Hélio Chagas",35,146,"00:00:58.962",48.17]
[6,"Hélio Chagas",35,146,"00:00:51.342",55.32]
[6,"Hélio Chagas",35,146,"00:00:51.260",55.41]
[6,"Hélio Chagas",35,146,"00:00:51.210",55.47]
[6,"Hélio Chagas",35,146,"00:00:51.078",55.61]
[6,"Hélio Chagas",35,146,"00:00:51.170",55.51]
[6,"Hélio Chagas",35,146,"00:00:51.228",55.45]
[6,"Hélio Chagas",35,146,"00:00:52.372",54.24]
[6,"Hélio Chagas",35,146,"00:00:50.884",55.82]
[6,"Hélio Chagas",35,146,"00:00:51.569",55.08]
[6,"Pedro Mello",35,111,"00:00:56.551",50.23]
[6,"Pedro Mello",35,111,"00:00:53.177",53.41]
[6,"Pedro Mello",35,111,"00:00:52.947",53.65]
[6,"Pedro Mello",35,111,"00:00:51.610",55.04]
[6,"Pedro Mello",35,111,"00:00:51.703",54.94]
[6,"Pedro Mello",35,111,"00:00:51.412",55.25]
[6,"Pedro Mello",35,111,"00:00:51.369",55.29]
[6,"Pedro Mello",35,111,"00:00:51.141",55.54]
[6,"Pedro Mello",35,111,"00:00:52.508",54.09]
[6,"Pedro Mello",35,111,"00:00:51.483",55.17]
[6,"Pedro Mello",35,111,"00:00:52.717",53.88]
[6,"Pedro Mello",35,111,"00:00:51.445",55.21]
[6,"Pedro Mello",35,111,"00:00:51.431",55.23]
[6,"Pedro Mello",35,111,"00:00:51.317",55.35]
[6,"Pedro Mello",35,111,"00:00:51.910",54.72]
[6,"Pedro Mello",35,111,"00:00:51.853",54.78]
[6,"Pedro Mello",35,111,"00:00:51.324",55.34]
[6,"Pedro Mello",35,111,"00:00:51.432",55.23]
[6,"Pedro Mello",35,111,"00:00:51.392",55.27]
[6,"Pedro Mello",35,111,"00:00:51.635",55.01]
[6,"Pedro Mello",35,111,"00:00:51.316",55.35]
[6,"Pedro Mello",35,111,"00:00:51.575",55.07]
[6,"Pedro Mello",35,111,"00:00:51.414",55.25]
[6,"Pedro Mello",35,111,"00:00:52.037",54.58]
[6,"Pedro Mello",35,111,"00:00:51.689",54.95]
[6,"Pedro Mello",35,111,"00:00:52.506",54.1]
[6,"Pedro Mello",35,111,"00:00:52.146",54.47]
[6,"Pedro Mello",35,111,"00:00:51.490",55.16]
[6,"Pedro Mello",35,111,"00:00:53.387",53.2]
[6,"Pedro Mello",35,111,"00:00:51.847",54.78]
[6,"Pedro Mello",35,111,"00:00:52.052",54.57]
[6,"Pedro Mello",35,111,"00:00:52.413",54.19]
[6,"Pedro Mello",35,111,"00:00:51.690",54.95]
[6,"Pedro Mello",35,111,"00:00:52.039",54.58]
[6,"Pedro Mello",35,111,"00:00:51.507",55.15]
[6,"Jucimar Vieira",35,112,"00:00:57.026",49.81]
[6,"Jucimar Vieira",35,112,"00:00:52.228",54.38]
[6,"Jucimar Vieira",35,112,"00:00:51.582",55.07]
[6,"Jucimar Vieira",35,112,"00:00:50.950",55.75]
[6,"Jucimar Vieira",35,112,"00:00:50.793",55.92]
[6,"Jucimar Vieira",35,112,"00:00:52.190",54.42]
[6,"Jucimar Vieira",35,112,"00:00:51.399",55.26]
[6,"Jucimar Vieira",35,112,"00:00:50.611",56.12]
[6,"Jucimar Vieira",35,112,"00:00:51.105",55.58]
[6,"Jucimar Vieira",35,112,"00:00:50.786",55.93]
[6,"Jucimar Vieira",35,112,"00:00:50.655",56.07]
[6,"Jucimar Vieira",35,112,"00:00:51.178",55.5]
[6,"Jucimar Vieira",35,112,"00:00:51.171",55.51]
[6,"Jucimar Vieira",35,112,"00:00:50.845",55.86]
[6,"Jucimar Vieira",35,112,"00:00:50.566",56.17]
[6,"Jucimar Vieira",35,112,"00:00:50.589",56.15]
[6,"Jucimar Vieira",35,112,"00:00:50.891",55.81]
[6,"Jucimar Vieira",35,112,"00:00:51.310",55.36]
[6,"Jucimar Vieira",35,112,"00:00:50.807",55.91]
[6,"Jucimar Vieira",35,112,"00:00:50.986",55.71]
[6,"Jucimar Vieira",35,112,"00:00:50.861",55.85]
[6,"Jucimar Vieira",35,112,"00:00:50.693",56.03]
[6,"Jucimar Vieira",35,112,"00:00:51.390",55.27]
[6,"Jucimar Vieira",35,112,"00:01:18.965",35.97]
[6,"Jucimar Vieira",35,112,"00:00:51.643",55]
[6,"Jucimar Vieira",35,112,"00:00:51.029",55.66]
[6,"Jucimar Vieira",35,112,"00:00:51.372",55.29]
[6,"Jucimar Vieira",35,112,"00:00:50.880",55.83]
[6,"Jucimar Vieira",35,112,"00:00:50.812",55.9]
[6,"Jucimar Vieira",35,112,"00:00:50.998",55.7]
[6,"Jucimar Vieira",35,112,"00:00:51.042",55.65]
[6,"Jucimar Vieira",35,112,"00:00:51.077",55.61]
[6,"Jucimar Vieira",35,112,"00:00:52.167",54.45]
[6,"Jucimar Vieira",35,112,"00:00:50.747",55.97]
[6,"Jucimar Vieira",35,112,"00:00:50.918",55.78]
[6,"Roberta Epifânio",34,132,"00:00:59.249",47.94]
[6,"Roberta Epifânio",34,132,"00:00:52.913",53.68]
[6,"Roberta Epifânio",34,132,"00:00:52.660",53.94]
[6,"Roberta Epifânio",34,132,"00:00:52.694",53.9]
[6,"Roberta Epifânio",34,132,"00:00:52.812",53.78]
[6,"Roberta Epifânio",34,132,"00:00:52.686",53.91]
[6,"Roberta Epifânio",34,132,"00:00:52.744",53.85]
[6,"Roberta Epifânio",34,132,"00:00:52.695",53.9]
[6,"Roberta Epifânio",34,132,"00:00:53.587",53.01]
[6,"Roberta Epifânio",34,132,"00:00:52.803",53.79]
[6,"Roberta Epifânio",34,132,"00:00:52.684",53.91]
[6,"Roberta Epifânio",34,132,"00:00:52.009",54.61]
[6,"Roberta Epifânio",34,132,"00:00:52.305",54.3]
[6,"Roberta Epifânio",34,132,"00:00:52.956",53.64]
[6,"Roberta Epifânio",34,132,"00:00:52.748",53.85]
[6,"Roberta Epifânio",34,132,"00:00:53.594",53]
[6,"Roberta Epifânio",34,132,"00:00:52.372",54.24]
[6,"Roberta Epifânio",34,132,"00:00:54.463",52.15]
[6,"Roberta Epifânio",34,132,"00:00:52.597",54]
[6,"Roberta Epifânio",34,132,"00:00:52.395",54.21]
[6,"Roberta Epifânio",34,132,"00:00:52.359",54.25]
[6,"Roberta Epifânio",34,132,"00:00:52.330",54.28]
[6,"Roberta Epifânio",34,132,"00:00:52.638",53.96]
[6,"Roberta Epifânio",34,132,"00:00:52.873",53.72]
[6,"Roberta Epifânio",34,132,"00:01:14.186",38.29]
[6,"Roberta Epifânio",34,132,"00:00:52.957",53.64]
[6,"Roberta Epifânio",34,132,"00:00:53.636",52.96]
[6,"Roberta Epifânio",34,132,"00:00:53.385",53.21]
[6,"Roberta Epifânio",34,132,"00:00:53.562",53.03]
[6,"Roberta Epifânio",34,132,"00:00:53.550",53.04]
[6,"Roberta Epifânio",34,132,"00:00:53.124",53.47]
[6,"Roberta Epifânio",34,132,"00:00:53.198",53.39]
[6,"Roberta Epifânio",34,132,"00:00:52.677",53.92]
[6,"Roberta Epifânio",34,132,"00:00:52.315",54.29]
[6,"Tati Marcondes",25,127,"00:00:55.414",51.26]
[6,"Tati Marcondes",25,127,"00:01:12.242",39.32]
[6,"Tati Marcondes",25,127,"00:00:51.698",54.94]
[6,"Tati Marcondes",25,127,"00:00:51.420",55.24]
[6,"Tati Marcondes",25,127,"00:00:51.195",55.48]
[6,"Tati Marcondes",25,127,"00:00:51.076",55.61]
[6,"Tati Marcondes",25,127,"00:00:51.633",55.01]
[6,"Tati Marcondes",25,127,"00:00:50.724",56]
[6,"Tati Marcondes",25,127,"00:00:50.792",55.92]
[6,"Tati Marcondes",25,127,"00:00:50.497",56.25]
[6,"Tati Marcondes",25,127,"00:00:51.868",54.76]
[6,"Tati Marcondes",25,127,"00:00:50.451",56.3]
[6,"Tati Marcondes",25,127,"00:00:50.345",56.42]
[6,"Tati Marcondes",25,127,"00:00:50.597",56.14]
[6,"Tati Marcondes",25,127,"00:00:50.548",56.19]
[6,"Tati Marcondes",25,127,"00:00:50.775",55.94]
[6,"Tati Marcondes",25,127,"00:00:50.253",56.52]
[6,"Tati Marcondes",25,127,"00:00:53.358",53.23]
[6,"Tati Marcondes",25,127,"00:00:50.788",55.93]
[6,"Tati Marcondes",25,127,"00:00:50.797",55.92]
[6,"Tati Marcondes",25,127,"00:00:50.757",55.96]
[6,"Tati Marcondes",25,127,"00:00:51.992",54.63]
[6,"Tati Marcondes",25,127,"00:00:51.677",54.96]
[6,"Tati Marcondes",25,127,"00:00:54.792",51.84]
[6,"Tati Marcondes",25,127,"00:00:52.253",54.36]
[6,"Marcelo Campos",15,154,"00:00:54.701",51.93]
[6,"Marcelo Campos",15,154,"00:00:50.849",55.86]
[6,"Marcelo Campos",15,154,"00:00:50.451",56.3]
[6,"Marcelo Campos",15,154,"00:00:50.011",56.8]
[6,"Marcelo Campos",15,154,"00:00:49.754",57.09]
[6,"Marcelo Campos",15,154,"00:00:49.997",56.81]
[6,"Marcelo Campos",15,154,"00:00:49.732",57.11]
[6,"Marcelo Campos",15,154,"00:00:49.445",57.45]
[6,"Marcelo Campos",15,154,"00:00:49.320",57.59]
[6,"Marcelo Campos",15,154,"00:00:49.224",57.7]
[6,"Marcelo Campos",15,154,"00:00:49.560",57.31]
[6,"Marcelo Campos",15,154,"00:00:49.538",57.34]
[6,"Marcelo Campos",15,154,"00:00:49.450",57.44]
[6,"Marcelo Campos",15,154,"00:00:49.542",57.33]
[6,"Marcelo Campos",15,154,"00:00:49.390",57.51]
[6,"Leandro Malias",12,150,"00:00:57.413",49.47]
[6,"Leandro Malias",12,150,"00:00:53.170",53.42]
[6,"Leandro Malias",12,150,"00:00:52.242",54.37]
[6,"Leandro Malias",12,150,"00:00:51.509",55.14]
[6,"Leandro Malias",12,150,"00:00:51.490",55.16]
[6,"Leandro Malias",12,150,"00:00:52.017",54.61]
[6,"Leandro Malias",12,150,"00:00:51.200",55.48]
[6,"Leandro Malias",12,150,"00:00:51.086",55.6]
[6,"Leandro Malias",12,150,"00:00:51.558",55.09]
[6,"Leandro Malias",12,150,"00:00:51.964",54.66]
[6,"Leandro Malias",12,150,"00:00:52.245",54.37]
[6,"Leandro Malias",12,150,"00:00:51.480",55.17]

{"sheet":"ETAPA 5","index":7,"n_rows":844,"n_cols":12,"rows_kept":844,"cut":false,"hidden":false,"merged":[[0,0,0,6]]}
["Obs.: Selecione até 3 pilotos colocando na frente do seu nome os números 1, 2 e 3.",null,null,null,null,null,null,"PILOTO",{"$f":"J52","v":"Marcelo Clemente"},{"$f":"K52","v":"Wesley Bambirra"},{"$f":"L52","v":"Eduardo Henrique"}]
[1,"Marcelo Clemente",null,null,null,null,null,"MÉDIA",{"$f":"AVERAGE(J53:J97)","v":"00:00:57.036"},{"$f":"AVERAGE(K53:K97)","v":"00:00:57.239"},{"$f":"AVERAGE(L53:L97)","v":"00:00:57.645"}]
[2,"Wesley Bambirra",null,null,null,null,null,"MAXIMA",{"$f":"LARGE(J53:J97,1)","v":"00:01:03.008"},{"$f":"LARGE(K53:K97,1)","v":"00:01:02.496"},{"$f":"LARGE(L53:L97,1)","v":"00:01:05.162"}]
[3,"Eduardo Henrique",null,null,null,null,null,"MÍNIMA",{"$f":"SMALL(J53:J97,1)","v":"00:00:56.340"},{"$f":"SMALL(K53:K97,1)","v":"00:00:56.599"},{"$f":"SMALL(L53:L97,1)","v":"00:00:56.821"}]
[null,"Jarbas Reis",null,null,null,null,null,"Desvio Padrão",{"$f":"_xlfn.STDEV.S(J53:J97)","v":"00:00:01.166"},{"$f":"_xlfn.STDEV.S(K53:K97)","v":"00:00:01.019"},{"$f":"_xlfn.STDEV.S(L53:L97)","v":"00:00:01.436"}]
[null,"Marcelo Campos",null,null,null,null,null,"TEMPO TOTAL",{"$f":"SUM(J53:J97,1)","v":1.0211243171296296},{"$f":"SUM(K53:K97,1)","v":1.0211995486111112},{"$f":"SUM(L53:L97,1)","v":1.0213498958333334}]
[null,"Alexandre Melillo"]
[null,"Lucas Guimarães"]
[null,"Marcelo Chagas"]
[null,"Marcelo Surerus"]
[null,"Rodrigo Mercadante"]
[null,"Wesley Canuto"]
[null,"Guilherme Alves",null,null,null,null,null,null,null,null,{"$f":"SMALL(I4:K4,1)-L13","v":"00:00:56.340"}]
[null,"Maurício Júnior",null,null,null,null,null,null,null,null,{"$f":"LARGE(I3:K3,1)+L13","v":"00:01:05.162"}]
[null,"Marcelo Pereira"]
[null,"Rodrigo Ricardo"]
[null,"Bernardo Freitas"]
[null,"DELCIO OLIVEIRA"]
[null,"Renato Amaral"]
[null,"Jucimar Vieira"]
[null,"Tati Marcondes"]
[null,"Hélio Chagas"]
[null,"JOSEPH SCHIOPPO"]
[null,"Daniel Nahum"]
[null,"Cláudio Naves"]
[null,"Marcelo Marcondes"]
[null,"Cláudio Dumont"]
[]
[]
[]
[]
[1]
[]
[]
[]
[]
[]
[]
[]
[]
[]
[]
[]
[]
[]
[]
[]
[]
[]
["ETAPA","PILOTO","NÚMERO VOLTAS","KART","Volta Tm","velocidade Media",null,null,null,{"$f":"MATCH(J52,$B$51:$B$1500,0)","v":1},{"$f":"MATCH(K52,$B$51:$B$1500,0)","v":33},65]
[5,"Marcelo Clemente",32,136,"00:01:03.008",55.94,null,null,null,{"$f":"VLOOKUP(J$52,$B$50:$F$1500,2,FALSE)","v":32},{"$f":"VLOOKUP(K$52,$B$50:$F$1500,2,FALSE)","v":32},{"$f":"VLOOKUP(L$52,$B$50:$F$1500,2,FALSE)","v":32}]
[5,"Marcelo Clemente",32,136,"00:00:58.090",60.67,null,null,"VOLTA",{"$f":"VLOOKUP(1,$A$2:$B$36,2,FALSE)","v":"Marcelo Clemente"},{"$f":"VLOOKUP(2,$A$2:$B$36,2,FALSE)","v":"Wesley Bambirra"},{"$f":"VLOOKUP(3,$A$2:$B$36,2,FALSE)","v":"Eduardo Henrique"}]
[5,"Marcelo Clemente",32,136,"00:00:57.162",61.66,null,null,1,{"$f":"OFFSET($E$51:$E$1500,J50-1,,J51)","v":"00:01:03.008"},{"$f":"OFFSET($E$51:$E$1500,K50-1,,K51)","v":"00:01:02.496"},{"$f":"OFFSET($E$51:$E$1500,L50-1,,L51)","v":"00:01:05.162"}]
[5,"Marcelo Clemente",32,136,"00:00:58.106",60.65,null,null,2,"00:00:58.090","00:00:57.946","00:00:59.169"]
[5,"Marcelo Clemente",32,136,"00:00:57.131",61.69,null,null,3,"00:00:57.162","00:00:58.071","00:00:58.486"]
[5,"Marcelo Clemente",32,136,"00:00:56.900",61.94,null,null,4,"00:00:58.106","00:00:57.352","00:00:57.646"]
[5,"Marcelo Clemente",32,136,"00:00:56.340",62.56,null,null,5,"00:00:57.131","00:00:57.188","00:00:57.604"]
[5,"Marcelo Clemente",32,136,"00:00:57.030",61.8,null,null,6,"00:00:56.900","00:00:56.709","00:00:57.291"]
[5,"Marcelo Clemente",32,136,"00:00:56.602",62.27,null,null,7,"00:00:56.340","00:00:57.191","00:00:57.405"]
[5,"Marcelo Clemente",32,136,"00:00:56.631",62.23,null,null,8,"00:00:57.030","00:00:57.430","00:00:57.309"]
[5,"Marcelo Clemente",32,136,"00:00:56.759",62.09,null,null,9,"00:00:56.602","00:00:57.250","00:00:57.172"]
[5,"Marcelo Clemente",32,136,"00:00:56.624",62.24,null,null,10,"00:00:56.631","00:00:57.333","00:00:57.353"]
[5,"Marcelo Clemente",32,136,"00:00:56.683",62.18,null,null,11,"00:00:56.759","00:00:56.763","00:00:57.176"]
[5,"Marcelo Clemente",32,136,"00:00:56.781",62.07,null,null,12,"00:00:56.624","00:00:56.761","00:00:57.431"]
[5,"Marcelo Clemente",32,136,"00:00:56.492",62.39,null,null,13,"00:00:56.683","00:00:56.669","00:00:57.718"]
[5,"Marcelo Clemente",32,136,"00:00:57.042",61.79,null,null,14,"00:00:56.781","00:00:56.678","00:00:56.821"]
[5,"Marcelo Clemente",32,136,"00:00:56.872",61.97,null,null,15,"00:00:56.492","00:00:56.599","00:00:57.203"]
[5,"Marcelo Clemente",32,136,"00:00:57.571",61.22,null,null,16,"00:00:57.042","00:00:56.698","00:00:57.139"]
[5,"Marcelo Clemente",32,136,"00:00:56.842",62,null,null,17,"00:00:56.872","00:00:56.887","00:00:57.361"]
[5,"Marcelo Clemente",32,136,"00:00:56.881",61.96,null,null,18,"00:00:57.571","00:00:57.326","00:00:57.332"]
[5,"Marcelo Clemente",32,136,"00:00:56.575",62.3,null,null,19,"00:00:56.842","00:00:57.091","00:00:57.160"]
[5,"Marcelo Clemente",32,136,"00:00:56.651",62.21,null,null,20,"00:00:56.881","00:00:57.458","00:00:57.183"]
[5,"Marcelo Clemente",32,136,"00:00:56.371",62.52,null,null,21,"00:00:56.575","00:00:56.923","00:00:57.192"]
[5,"Marcelo Clemente",32,136,"00:00:56.642",62.22,null,null,22,"00:00:56.651","00:00:56.774","00:00:57.469"]
[5,"Marcelo Clemente",32,136,"00:00:56.666",62.2,null,null,23,"00:00:56.371","00:00:56.798","00:00:57.373"]
[5,"Marcelo Clemente",32,136,"00:00:56.656",62.21,null,null,24,"00:00:56.642","00:00:57.024","00:00:57.305"]
[5,"Marcelo Clemente",32,136,"00:00:56.478",62.4,null,null,25,"00:00:56.666","00:00:56.802","00:00:57.607"]
[5,"Marcelo Clemente",32,136,"00:00:56.521",62.36,null,null,26,"00:00:56.656","00:00:56.928","00:00:57.246"]
[5,"Marcelo Clemente",32,136,"00:00:56.754",62.1,null,null,27,"00:00:56.478","00:00:57.013","00:00:57.337"]
[5,"Marcelo Clemente",32,136,"00:00:56.987",61.85,null,null,28,"00:00:56.521","00:00:57.101","00:00:57.260"]
[5,"Marcelo Clemente",32,136,"00:00:56.504",62.37,null,null,29,"00:00:56.754","00:00:57.081","00:00:57.392"]
[5,"Marcelo Clemente",32,136,"00:00:56.789",62.06,null,null,30,"00:00:56.987","00:00:57.175","00:00:57.172"]
[5,"Wesley Bambirra",32,112,"00:01:02.496",56.39,null,null,31,"00:00:56.504","00:00:56.948","00:00:57.178"]
[5,"Wesley Bambirra",32,112,"00:00:57.946",60.82,null,null,32,"00:00:56.789","00:00:57.178","00:00:56.979"]
[5,"Wesley Bambirra",32,112,"00:00:58.071",60.69,null,null,33]
[5,"Wesley Bambirra",32,112,"00:00:57.352",61.45,null,null,34]
[5,"Wesley Bambirra",32,112,"00:00:57.188",61.63,null,null,35]
[5,"Wesley Bambirra",32,112,"00:00:56.709",62.15,null,null,36]
[5,"Wesley Bambirra",32,112,"00:00:57.191",61.63,null,null,37]
[5,"Wesley Bambirra",32,112,"00:00:57.430",61.37,null,null,38]
[5,"Wesley Bambirra",32,112,"00:00:57.250",61.56,null,null,39]
[5,"Wesley Bambirra",32,112,"00:00:57.333",61.47,null,null,40]
[5,"Wesley Bambirra",32,112,"00:00:56.763",62.09,null,null,41]
[5,"Wesley Bambirra",32,112,"00:00:56.761",62.09,null,null,42]
[5,"Wesley Bambirra",32,112,"00:00:56.669",62.19,null,null,43]
[5,"Wesley Bambirra",32,112,"00:00:56.678",62.18,null,null,44]
[5,"Wesley Bambirra",32,112,"00:00:56.599",62.27,null,null,45]
[5,"Wesley Bambirra",32,112,"00:00:56.698",62.16]
[5,"Wesley Bambirra",32,112,"00:00:56.887",61.95]
[5,"Wesley Bambirra",32,112,"00:00:57.326",61.48]
[5,"Wesley Bambirra",32,112,"00:00:57.091",61.73]
[5,"Wesley Bambirra",32,112,"00:00:57.458",61.34]
[5,"Wesley Bambirra",32,112,"00:00:56.923",61.92]
[5,"Wesley Bambirra",32,112,"00:00:56.774",62.08]
[5,"Wesley Bambirra",32,112,"00:00:56.798",62.05]
[5,"Wesley Bambirra",32,112,"00:00:57.024",61.81]
[5,"Wesley Bambirra",32,112,"00:00:56.802",62.05]
[5,"Wesley Bambirra",32,112,"00:00:56.928",61.91]
[5,"Wesley Bambirra",32,112,"00:00:57.013",61.82]
[5,"Wesley Bambirra",32,112,"00:00:57.101",61.72]
[5,"Wesley Bambirra",32,112,"00:00:57.081",61.74]
[5,"Wesley Bambirra",32,112,"00:00:57.175",61.64]
[5,"Wesley Bambirra",32,112,"00:00:56.948",61.89]
[5,"Wesley Bambirra",32,112,"00:00:57.178",61.64]
[5,"Eduardo Henrique",32,131,"00:01:05.162",54.09]
[5,"Eduardo Henrique",32,131,"00:00:59.169",59.56]
[5,"Eduardo Henrique",32,131,"00:00:58.486",60.26]
[5,"Eduardo Henrique",32,131,"00:00:57.646",61.14]
[5,"Eduardo Henrique",32,131,"00:00:57.604",61.18]
[5,"Eduardo Henrique",32,131,"00:00:57.291",61.52]
[5,"Eduardo Henrique",32,131,"00:00:57.405",61.4]
[5,"Eduardo Henrique",32,131,"00:00:57.309",61.5]
[5,"Eduardo Henrique",32,131,"00:00:57.172",61.65]
[5,"Eduardo Henrique",32,131,"00:00:57.353",61.45]
[5,"Eduardo Henrique",32,131,"00:00:57.176",61.64]
[5,"Eduardo Henrique",32,131,"00:00:57.431",61.37]
[5,"Eduardo Henrique",32,131,"00:00:57.718",61.06]
[5,"Eduardo Henrique",32,131,"00:00:56.821",62.03]
[5,"Eduardo Henrique",32,131,"00:00:57.203",61.61]
[5,"Eduardo Henrique",32,131,"00:00:57.139",61.68]
[5,"Eduardo Henrique",32,131,"00:00:57.361",61.44]
[5,"Eduardo Henrique",32,131,"00:00:57.332",61.47]
[5,"Eduardo Henrique",32,131,"00:00:57.160",61.66]
[5,"Eduardo Henrique",32,131,"00:00:57.183",61.63]
[5,"Eduardo Henrique",32,131,"00:00:57.192",61.62]
[5,"Eduardo Henrique",32,131,"00:00:57.469",61.33]
[5,"Eduardo Henrique",32,131,"00:00:57.373",61.43]
[5,"Eduardo Henrique",32,131,"00:00:57.305",61.5]
[5,"Eduardo Henrique",32,131,"00:00:57.607",61.18]
[5,"Eduardo Henrique",32,131,"00:00:57.246",61.57]
[5,"Eduardo Henrique",32,131,"00:00:57.337",61.47]
[5,"Eduardo Henrique",32,131,"00:00:57.260",61.55]
[5,"Eduardo Henrique",32,131,"00:00:57.392",61.41]
[5,"Eduardo Henrique",32,131,"00:00:57.172",61.65]
[5,"Eduardo Henrique",32,131,"00:00:57.178",61.64]
[5,"Eduardo Henrique",32,131,"00:00:56.979",61.85]
[5,"Jarbas Reis",32,106,"00:01:07.035",52.58]
[5,"Jarbas Reis",32,106,"00:00:59.004",59.73]
[5,"Jarbas Reis",32,106,"00:00:58.372",60.38]
[5,"Jarbas Reis",32,106,"00:00:58.653",60.09]
[5,"Jarbas Reis",32,106,"00:00:57.631",61.15]
[5,"Jarbas Reis",32,106,"00:00:58.896",59.84]
[5,"Jarbas Reis",32,106,"00:00:57.485",61.31]
[5,"Jarbas Reis",32,106,"00:00:57.522",61.27]
[5,"Jarbas Reis",32,106,"00:00:57.837",60.94]
[5,"Jarbas Reis",32,106,"00:00:58.030",60.73]
[5,"Jarbas Reis",32,106,"00:00:57.516",61.28]
[5,"Jarbas Reis",32,106,"00:00:57.329",61.48]
[5,"Jarbas Reis",32,106,"00:00:57.263",61.55]
[5,"Jarbas Reis",32,106,"00:00:57.047",61.78]
[5,"Jarbas Reis",32,106,"00:00:57.090",61.73]
[5,"Jarbas Reis",32,106,"00:00:56.854",61.99]
[5,"Jarbas Reis",32,106,"00:00:56.951",61.88]
[5,"Jarbas Reis",32,106,"00:00:56.995",61.84]
[5,"Jarbas Reis",32,106,"00:00:56.983",61.85]
[5,"Jarbas Reis",32,106,"00:00:56.817",62.03]
[5,"Jarbas Reis",32,106,"00:00:56.755",62.1]
[5,"Jarbas Reis",32,106,"00:00:58.158",60.6]
[5,"Jarbas Reis",32,106,"00:00:57.411",61.39]
[5,"Jarbas Reis",32,106,"00:00:56.960",61.88]
[5,"Jarbas Reis",32,106,"00:00:56.789",62.06]
[5,"Jarbas Reis",32,106,"00:00:57.502",61.29]
[5,"Jarbas Reis",32,106,"00:00:57.472",61.32]
[5,"Jarbas Reis",32,106,"00:00:57.080",61.74]
[5,"Jarbas Reis",32,106,"00:00:57.039",61.79]
[5,"Jarbas Reis",32,106,"00:00:56.955",61.88]
[5,"Jarbas Reis",32,106,"00:00:57.132",61.69]
[5,"Jarbas Reis",32,106,"00:00:56.938",61.9]
[5,"Marcelo Campos",32,109,"00:01:03.948",55.11]
[5,"Marcelo Campos",32,109,"00:00:59.515",59.22]
[5,"Marcelo Campos",32,109,"00:00:57.971",60.8]
[5,"Marcelo Campos",32,109,"00:00:57.684",61.1]
[5,"Marcelo Campos",32,109,"00:00:57.415",61.38]
[5,"Marcelo Campos",32,109,"00:00:57.574",61.22]
[5,"Marcelo Campos",32,109,"00:00:57.338",61.47]
[5,"Marcelo Campos",32,109,"00:00:57.134",61.69]
[5,"Marcelo Campos",32,109,"00:00:57.661",61.12]
[5,"Marcelo Campos",32,109,"00:00:57.404",61.4]
[5,"Marcelo Campos",32,109,"00:00:57.176",61.64]
[5,"Marcelo Campos",32,109,"00:00:58.747",59.99]
[5,"Marcelo Campos",32,109,"00:00:57.433",61.37]
[5,"Marcelo Campos",32,109,"00:00:57.235",61.58]
[5,"Marcelo Campos",32,109,"00:00:57.539",61.25]
[5,"Marcelo Campos",32,109,"00:00:57.057",61.77]
[5,"Marcelo Campos",32,109,"00:00:57.454",61.34]
[5,"Marcelo Campos",32,109,"00:00:57.945",60.82]
[5,"Marcelo Campos",32,109,"00:00:57.152",61.67]
[5,"Marcelo Campos",32,109,"00:00:56.982",61.85]
[5,"Marcelo Campos",32,109,"00:00:57.090",61.73]
[5,"Marcelo Campos",32,109,"00:00:57.870",60.9]
[5,"Marcelo Campos",32,109,"00:00:57.709",61.07]
[5,"Marcelo Campos",32,109,"00:00:58.069",60.69]
[5,"Marcelo Campos",32,109,"00:00:57.115",61.71]
[5,"Marcelo Campos",32,109,"00:00:57.537",61.25]
[5,"Marcelo Campos",32,109,"00:00:58.386",60.36]
[5,"Marcelo Campos",32,109,"00:00:57.090",61.73]
[5,"Marcelo Campos",32,109,"00:00:57.023",61.81]
[5,"Marcelo Campos",32,109,"00:00:57.058",61.77]
[5,"Marcelo Campos",32,109,"00:00:56.919",61.92]
[5,"Marcelo Campos",32,109,"00:00:57.244",61.57]
[5,"Alexandre Melillo",32,149,"00:01:02.295",56.58]
[5,"Alexandre Melillo",32,149,"00:00:58.348",60.4]
[5,"Alexandre Melillo",32,149,"00:00:58.654",60.09]
[5,"Alexandre Melillo",32,149,"00:00:57.412",61.39]
[5,"Alexandre Melillo",32,149,"00:00:57.602",61.19]
[5,"Alexandre Melillo",32,149,"00:00:57.772",61.01]
[5,"Alexandre Melillo",32,149,"00:00:57.306",61.5]
[5,"Alexandre Melillo",32,149,"00:00:57.786",60.99]
[5,"Alexandre Melillo",32,149,"00:00:57.538",61.25]
[5,"Alexandre Melillo",32,149,"00:00:57.849",60.92]
[5,"Alexandre Melillo",32,149,"00:00:58.474",60.27]
[5,"Alexandre Melillo",32,149,"00:00:57.453",61.34]
[5,"Alexandre Melillo",32,149,"00:00:57.499",61.29]
[5,"Alexandre Melillo",32,149,"00:00:57.783",60.99]
[5,"Alexandre Melillo",32,149,"00:00:57.556",61.23]
[5,"Alexandre Melillo",32,149,"00:00:57.506",61.29]
[5,"Alexandre Melillo",32,149,"00:00:57.666",61.12]
[5,"Alexandre Melillo",32,149,"00:00:57.836",60.94]
[5,"Alexandre Melillo",32,149,"00:00:57.160",61.66]
[5,"Alexandre Melillo",32,149,"00:00:57.003",61.83]
[5,"Alexandre Melillo",32,149,"00:00:57.296",61.51]
[5,"Alexandre Melillo",32,149,"00:00:57.814",60.96]
[5,"Alexandre Melillo",32,149,"00:00:57.779",61]
[5,"Alexandre Melillo",32,149,"00:00:58.962",59.77]
[5,"Alexandre Melillo",32,149,"00:00:57.601",61.19]
[5,"Alexandre Melillo",32,149,"00:00:57.364",61.44]
[5,"Alexandre Melillo",32,149,"00:00:57.458",61.34]
[5,"Alexandre Melillo",32,149,"00:00:57.168",61.65]
[5,"Alexandre Melillo",32,149,"00:00:56.999",61.83]
[5,"Alexandre Melillo",32,149,"00:00:57.025",61.8]
[5,"Alexandre Melillo",32,149,"00:00:57.909",60.86]
[5,"Alexandre Melillo",32,149,"00:00:57.381",61.42]
[5,"Lucas Guimarães",32,137,"00:01:03.966",55.1]
[5,"Lucas Guimarães",32,137,"00:00:58.641",60.1]
[5,"Lucas Guimarães",32,137,"00:00:58.194",60.56]
[5,"Lucas Guimarães",32,137,"00:00:58.840",59.9]
[5,"Lucas Guimarães",32,137,"00:00:57.847",60.93]
[5,"Lucas Guimarães",32,137,"00:00:57.065",61.76]
[5,"Lucas Guimarães",32,137,"00:00:57.336",61.47]
[5,"Lucas Guimarães",32,137,"00:01:02.534",56.36]
[5,"Lucas Guimarães",32,137,"00:00:57.557",61.23]
[5,"Lucas Guimarães",32,137,"00:00:57.450",61.35]
[5,"Lucas Guimarães",32,137,"00:00:57.460",61.34]
[5,"Lucas Guimarães",32,137,"00:00:57.348",61.46]
[5,"Lucas Guimarães",32,137,"00:00:57.087",61.74]
[5,"Lucas Guimarães",32,137,"00:00:56.822",62.03]
[5,"Lucas Guimarães",32,137,"00:00:56.908",61.93]
[5,"Lucas Guimarães",32,137,"00:00:56.938",61.9]
[5,"Lucas Guimarães",32,137,"00:00:56.879",61.96]
[5,"Lucas Guimarães",32,137,"00:00:57.258",61.55]
[5,"Lucas Guimarães",32,137,"00:00:56.961",61.87]
[5,"Lucas Guimarães",32,137,"00:00:56.771",62.08]
[5,"Lucas Guimarães",32,137,"00:00:57.356",61.45]
[5,"Lucas Guimarães",32,137,"00:00:57.488",61.31]
[5,"Lucas Guimarães",32,137,"00:00:57.417",61.38]
[5,"Lucas Guimarães",32,137,"00:00:57.804",60.97]
[5,"Lucas Guimarães",32,137,"00:00:56.943",61.89]
[5,"Lucas Guimarães",32,137,"00:00:56.906",61.93]
[5,"Lucas Guimarães",32,137,"00:00:57.056",61.77]
[5,"Lucas Guimarães",32,137,"00:00:57.493",61.3]
[5,"Lucas Guimarães",32,137,"00:00:56.964",61.87]
[5,"Lucas Guimarães",32,137,"00:00:56.732",62.12]
[5,"Lucas Guimarães",32,137,"00:00:57.503",61.29]
[5,"Lucas Guimarães",32,137,"00:00:57.570",61.22]
[5,"Marcelo Chagas",32,133,"00:01:05.332",53.95]
[5,"Marcelo Chagas",32,133,"00:00:59.129",59.61]
[5,"Marcelo Chagas",32,133,"00:00:57.691",61.09]
[5,"Marcelo Chagas",32,133,"00:00:57.687",61.1]
[5,"Marcelo Chagas",32,133,"00:00:58.316",60.44]
[5,"Marcelo Chagas",32,133,"00:00:58.879",59.86]
[5,"Marcelo Chagas",32,133,"00:00:57.098",61.73]
[5,"Marcelo Chagas",32,133,"00:00:57.526",61.27]
[5,"Marcelo Chagas",32,133,"00:00:57.584",61.2]
[5,"Marcelo Chagas",32,133,"00:00:58.483",60.26]
[5,"Marcelo Chagas",32,133,"00:00:57.798",60.98]
[5,"Marcelo Chagas",32,133,"00:00:57.282",61.53]
[5,"Marcelo Chagas",32,133,"00:00:57.424",61.38]
[5,"Marcelo Chagas",32,133,"00:00:57.354",61.45]
[5,"Marcelo Chagas",32,133,"00:00:56.995",61.84]
[5,"Marcelo Chagas",32,133,"00:00:56.761",62.09]
[5,"Marcelo Chagas",32,133,"00:00:56.953",61.88]
[5,"Marcelo Chagas",32,133,"00:00:57.181",61.64]
[5,"Marcelo Chagas",32,133,"00:00:57.102",61.72]
[5,"Marcelo Chagas",32,133,"00:00:56.875",61.97]
[5,"Marcelo Chagas",32,133,"00:00:57.472",61.32]
[5,"Marcelo Chagas",32,133,"00:00:57.970",60.8]
[5,"Marcelo Chagas",32,133,"00:00:57.104",61.72]
[5,"Marcelo Chagas",32,133,"00:00:57.275",61.53]
[5,"Marcelo Chagas",32,133,"00:00:57.120",61.7]
[5,"Marcelo Chagas",32,133,"00:00:57.157",61.66]
[5,"Marcelo Chagas",32,133,"00:00:56.950",61.89]
[5,"Marcelo Chagas",32,133,"00:00:57.217",61.6]
[5,"Marcelo Chagas",32,133,"00:00:57.621",61.17]
[5,"Marcelo Chagas",32,133,"00:00:57.007",61.82]
[5,"Marcelo Chagas",32,133,"00:00:57.019",61.81]
[5,"Marcelo Chagas",32,133,"00:00:57.077",61.75]
[5,"Marcelo Surerus",32,115,"00:01:02.066",56.78]
[5,"Marcelo Surerus",32,115,"00:00:58.172",60.59]
[5,"Marcelo Surerus",32,115,"00:00:58.024",60.74]
[5,"Marcelo Surerus",32,115,"00:00:57.320",61.49]
[5,"Marcelo Surerus",32,115,"00:00:57.478",61.32]
[5,"Marcelo Surerus",32,115,"00:00:57.200",61.62]
[5,"Marcelo Surerus",32,115,"00:00:57.821",60.95]
[5,"Marcelo Surerus",32,115,"00:00:59.684",59.05]
[5,"Marcelo Surerus",32,115,"00:00:57.605",61.18]
[5,"Marcelo Surerus",32,115,"00:00:58.197",60.56]
[5,"Marcelo Surerus",32,115,"00:00:58.110",60.65]
[5,"Marcelo Surerus",32,115,"00:00:59.216",59.52]
[5,"Marcelo Surerus",32,115,"00:00:58.275",60.48]
[5,"Marcelo Surerus",32,115,"00:00:57.266",61.54]
[5,"Marcelo Surerus",32,115,"00:00:57.329",61.48]
[5,"Marcelo Surerus",32,115,"00:00:56.975",61.86]
[5,"Marcelo Surerus",32,115,"00:00:57.194",61.62]
[5,"Marcelo Surerus",32,115,"00:00:58.089",60.67]
[5,"Marcelo Surerus",32,115,"00:00:56.858",61.99]
[5,"Marcelo Surerus",32,115,"00:00:57.378",61.42]
[5,"Marcelo Surerus",32,115,"00:00:57.500",61.29]
[5,"Marcelo Surerus",32,115,"00:00:57.612",61.17]
[5,"Marcelo Surerus",32,115,"00:00:57.109",61.71]
[5,"Marcelo Surerus",32,115,"00:00:57.991",60.77]
[5,"Marcelo Surerus",32,115,"00:00:57.081",61.74]
[5,"Marcelo Surerus",32,115,"00:00:57.965",60.8]
[5,"Marcelo Surerus",32,115,"00:00:57.888",60.88]
[5,"Marcelo Surerus",32,115,"00:00:57.740",61.04]
[5,"Marcelo Surerus",32,115,"00:00:58.345",60.41]
[5,"Marcelo Surerus",32,115,"00:00:57.500",61.29]
[5,"Marcelo Surerus",32,115,"00:00:57.044",61.78]
[5,"Marcelo Surerus",32,115,"00:00:56.873",61.97]
[5,"Rodrigo Mercadante",32,138,"00:01:09.305",50.85]
[5,"Rodrigo Mercadante",32,138,"00:00:58.212",60.54]
[5,"Rodrigo Mercadante",32,138,"00:00:59.077",59.66]
[5,"Rodrigo Mercadante",32,138,"00:01:02.494",56.4]
[5,"Rodrigo Mercadante",32,138,"00:00:57.487",61.31]
[5,"Rodrigo Mercadante",32,138,"00:00:57.482",61.31]
[5,"Rodrigo Mercadante",32,138,"00:00:57.079",61.75]
[5,"Rodrigo Mercadante",32,138,"00:00:56.930",61.91]
[5,"Rodrigo Mercadante",32,138,"00:00:57.067",61.76]
[5,"Rodrigo Mercadante",32,138,"00:00:56.837",62.01]
[5,"Rodrigo Mercadante",32,138,"00:00:57.404",61.4]
[5,"Rodrigo Mercadante",32,138,"00:00:57.951",60.82]
[5,"Rodrigo Mercadante",32,138,"00:00:57.906",60.86]
[5,"Rodrigo Mercadante",32,138,"00:00:57.285",61.52]
[5,"Rodrigo Mercadante",32,138,"00:00:57.169",61.65]
[5,"Rodrigo Mercadante",32,138,"00:00:58.003",60.76]
[5,"Rodrigo Mercadante",32,138,"00:00:57.253",61.56]
[5,"Rodrigo Mercadante",32,138,"00:00:57.162",61.66]
[5,"Rodrigo Mercadante",32,138,"00:00:57.255",61.56]
[5,"Rodrigo Mercadante",32,138,"00:00:57.138",61.68]
[5,"Rodrigo Mercadante",32,138,"00:00:57.048",61.78]
[5,"Rodrigo Mercadante",32,138,"00:00:57.141",61.68]
[5,"Rodrigo Mercadante",32,138,"00:00:57.418",61.38]
[5,"Rodrigo Mercadante",32,138,"00:00:57.209",61.61]
[5,"Rodrigo Mercadante",32,138,"00:00:56.914",61.93]
[5,"Rodrigo Mercadante",32,138,"00:00:57.007",61.82]
[5,"Rodrigo Mercadante",32,138,"00:00:57.142",61.68]
[5,"Rodrigo Mercadante",32,138,"00:00:56.959",61.88]
[5,"Rodrigo Mercadante",32,138,"00:00:57.026",61.8]
[5,"Rodrigo Mercadante",32,138,"00:00:56.814",62.03]
[5,"Rodrigo Mercadante",32,138,"00:00:56.750",62.1]
[5,"Rodrigo Mercadante",32,138,"00:00:57.014",61.82]
[5,"Wesley Canuto",32,125,"00:01:02.607",56.29]
[5,"Wesley Canuto",32,125,"00:00:58.102",60.66]
[5,"Wesley Canuto",32,125,"00:00:57.844",60.93]
[5,"Wesley Canuto",32,125,"00:00:57.370",61.43]
[5,"Wesley Canuto",32,125,"00:00:57.490",61.3]
[5,"Wesley Canuto",32,125,"00:00:57.147",61.67]
[5,"Wesley Canuto",32,125,"00:00:57.790",60.99]
[5,"Wesley Canuto",32,125,"00:00:59.187",59.55]
[5,"Wesley Canuto",32,125,"00:00:57.560",61.23]
[5,"Wesley Canuto",32,125,"00:00:58.522",60.22]
[5,"Wesley Canuto",32,125,"00:00:57.815",60.96]
[5,"Wesley Canuto",32,125,"00:00:58.010",60.76]
[5,"Wesley Canuto",32,125,"00:00:57.298",61.51]
[5,"Wesley Canuto",32,125,"00:00:57.807",60.97]
[5,"Wesley Canuto",32,125,"00:00:57.805",60.97]
[5,"Wesley Canuto",32,125,"00:00:57.383",61.42]
[5,"Wesley Canuto",32,125,"00:00:58.151",60.61]
[5,"Wesley Canuto",32,125,"00:00:57.984",60.78]
[5,"Wesley Canuto",32,125,"00:00:56.766",62.09]
[5,"Wesley Canuto",32,125,"00:00:58.335",60.42]
[5,"Wesley Canuto",32,125,"00:00:57.215",61.6]
[5,"Wesley Canuto",32,125,"00:00:58.205",60.55]
[5,"Wesley Canuto",32,125,"00:00:58.242",60.51]
[5,"Wesley Canuto",32,125,"00:00:58.656",60.09]
[5,"Wesley Canuto",32,125,"00:00:57.528",61.26]
[5,"Wesley Canuto",32,125,"00:00:58.229",60.53]
[5,"Wesley Canuto",32,125,"00:00:57.857",60.92]
[5,"Wesley Canuto",32,125,"00:00:57.806",60.97]
[5,"Wesley Canuto",32,125,"00:00:57.233",61.58]
[5,"Wesley Canuto",32,125,"00:00:57.192",61.62]
[5,"Wesley Canuto",32,125,"00:00:57.504",61.29]
[5,"Wesley Canuto",32,125,"00:00:58.059",60.7]
[5,"Guilherme Alves",32,101,"00:01:03.347",55.64]
[5,"Guilherme Alves",32,101,"00:00:58.861",59.88]
[5,"Guilherme Alves",32,101,"00:00:58.667",60.07]
[5,"Guilherme Alves",32,101,"00:00:58.146",60.61]
[5,"Guilherme Alves",32,101,"00:00:57.661",61.12]
[5,"Guilherme Alves",32,101,"00:00:57.651",61.13]
[5,"Guilherme Alves",32,101,"00:00:57.659",61.12]
[5,"Guilherme Alves",32,101,"00:00:57.586",61.2]
[5,"Guilherme Alves",32,101,"00:00:58.074",60.69]
[5,"Guilherme Alves",32,101,"00:00:57.449",61.35]
[5,"Guilherme Alves",32,101,"00:00:57.328",61.48]
[5,"Guilherme Alves",32,101,"00:00:58.433",60.32]
[5,"Guilherme Alves",32,101,"00:00:58.372",60.38]
[5,"Guilherme Alves",32,101,"00:00:57.261",61.55]
[5,"Guilherme Alves",32,101,"00:00:57.546",61.24]
[5,"Guilherme Alves",32,101,"00:00:57.452",61.35]
[5,"Guilherme Alves",32,101,"00:00:57.714",61.07]
[5,"Guilherme Alves",32,101,"00:00:57.184",61.63]
[5,"Guilherme Alves",32,101,"00:00:56.956",61.88]
[5,"Guilherme Alves",32,101,"00:00:57.309",61.5]
[5,"Guilherme Alves",32,101,"00:00:57.410",61.39]
[5,"Guilherme Alves",32,101,"00:01:05.470",53.83]
[5,"Guilherme Alves",32,101,"00:00:58.272",60.48]
[5,"Guilherme Alves",32,101,"00:00:57.581",61.21]
[5,"Guilherme Alves",32,101,"00:00:58.095",60.67]
[5,"Guilherme Alves",32,101,"00:00:57.414",61.39]
[5,"Guilherme Alves",32,101,"00:00:57.509",61.28]
[5,"Guilherme Alves",32,101,"00:00:57.710",61.07]
[5,"Guilherme Alves",32,101,"00:00:58.154",60.6]
[5,"Guilherme Alves",32,101,"00:00:57.511",61.28]
[5,"Guilherme Alves",32,101,"00:00:57.162",61.66]
[5,"Guilherme Alves",32,101,"00:00:58.081",60.68]
[5,"Maurício Júnior",32,147,"00:01:02.323",56.55]
[5,"Maurício Júnior",32,147,"00:00:59.092",59.64]
[5,"Maurício Júnior",32,147,"00:00:58.545",60.2]
[5,"Maurício Júnior",32,147,"00:00:59.010",59.73]
[5,"Maurício Júnior",32,147,"00:00:58.552",60.19]
[5,"Maurício Júnior",32,147,"00:00:58.650",60.09]
[5,"Maurício Júnior",32,147,"00:00:58.871",59.87]
[5,"Maurício Júnior",32,147,"00:00:58.923",59.81]
[5,"Maurício Júnior",32,147,"00:00:58.552",60.19]
[5,"Maurício Júnior",32,147,"00:00:58.972",59.76]
[5,"Maurício Júnior",32,147,"00:00:57.693",61.09]
[5,"Maurício Júnior",32,147,"00:00:58.570",60.17]
[5,"Maurício Júnior",32,147,"00:00:57.610",61.18]
[5,"Maurício Júnior",32,147,"00:00:57.634",61.15]
[5,"Maurício Júnior",32,147,"00:00:58.423",60.33]
[5,"Maurício Júnior",32,147,"00:00:57.578",61.21]
[5,"Maurício Júnior",32,147,"00:00:58.008",60.76]
[5,"Maurício Júnior",32,147,"00:00:57.743",61.04]
[5,"Maurício Júnior",32,147,"00:00:57.967",60.8]
[5,"Maurício Júnior",32,147,"00:00:57.399",61.4]
[5,"Maurício Júnior",32,147,"00:00:57.372",61.43]
[5,"Maurício Júnior",32,147,"00:00:57.561",61.23]
[5,"Maurício Júnior",32,147,"00:00:57.435",61.36]
[5,"Maurício Júnior",32,147,"00:00:57.269",61.54]
[5,"Maurício Júnior",32,147,"00:00:57.537",61.25]
[5,"Maurício Júnior",32,147,"00:00:57.317",61.49]
[5,"Maurício Júnior",32,147,"00:00:57.484",61.31]
[5,"Maurício Júnior",32,147,"00:00:57.921",60.85]
[5,"Maurício Júnior",32,147,"00:00:58.327",60.42]
[5,"Maurício Júnior",32,147,"00:00:57.294",61.51]
[5,"Maurício Júnior",32,147,"00:00:57.268",61.54]
[5,"Maurício Júnior",32,147,"00:00:58.093",60.67]
[5,"Marcelo Pereira",32,110,"00:01:05.079",54.16]
[5,"Marcelo Pereira",32,110,"00:00:59.837",58.9]
[5,"Marcelo Pereira",32,110,"00:00:57.797",60.98]
[5,"Marcelo Pereira",32,110,"00:00:58.015",60.75]
[5,"Marcelo Pereira",32,110,"00:00:57.805",60.97]
[5,"Marcelo Pereira",32,110,"00:00:58.873",59.86]
[5,"Marcelo Pereira",32,110,"00:00:57.496",61.3]
[5,"Marcelo Pereira",32,110,"00:00:57.912",60.86]
[5,"Marcelo Pereira",32,110,"00:00:57.794",60.98]
[5,"Marcelo Pereira",32,110,"00:00:58.620",60.12]
[5,"Marcelo Pereira",32,110,"00:00:58.433",60.32]
[5,"Marcelo Pereira",32,110,"00:00:57.829",60.95]
[5,"Marcelo Pereira",32,110,"00:00:57.464",61.33]
[5,"Marcelo Pereira",32,110,"00:00:57.791",60.99]
[5,"Marcelo Pereira",32,110,"00:00:58.412",60.34]
[5,"Marcelo Pereira",32,110,"00:00:57.592",61.2]
[5,"Marcelo Pereira",32,110,"00:00:58",60.77]
[5,"Marcelo Pereira",32,110,"00:00:57.600",61.19]
[5,"Marcelo Pereira",32,110,"00:00:57.870",60.9]
[5,"Marcelo Pereira",32,110,"00:00:57.306",61.5]
[5,"Marcelo Pereira",32,110,"00:00:57.473",61.32]
[5,"Marcelo Pereira",32,110,"00:00:57.571",61.22]
[5,"Marcelo Pereira",32,110,"00:00:57.437",61.36]
[5,"Marcelo Pereira",32,110,"00:00:57.261",61.55]
[5,"Marcelo Pereira",32,110,"00:00:57.403",61.4]
[5,"Marcelo Pereira",32,110,"00:00:57.564",61.23]
[5,"Marcelo Pereira",32,110,"00:00:57.498",61.3]
[5,"Marcelo Pereira",32,110,"00:00:57.949",60.82]
[5,"Marcelo Pereira",32,110,"00:00:57.886",60.89]
[5,"Marcelo Pereira",32,110,"00:00:57.527",61.27]
[5,"Marcelo Pereira",32,110,"00:00:57.164",61.65]
[5,"Marcelo Pereira",32,110,"00:00:58.697",60.04]
[5,"Rodrigo Ricardo",32,105,"00:01:04.589",54.57]
[5,"Rodrigo Ricardo",32,105,"00:00:59.351",59.38]
[5,"Rodrigo Ricardo",32,105,"00:00:58.968",59.77]
[5,"Rodrigo Ricardo",32,105,"00:01:00.371",58.38]
[5,"Rodrigo Ricardo",32,105,"00:00:57.854",60.92]
[5,"Rodrigo Ricardo",32,105,"00:00:59.207",59.53]
[5,"Rodrigo Ricardo",32,105,"00:00:57.513",61.28]
[5,"Rodrigo Ricardo",32,105,"00:00:58.065",60.7]
[5,"Rodrigo Ricardo",32,105,"00:00:58.425",60.32]
[5,"Rodrigo Ricardo",32,105,"00:00:57.628",61.16]
[5,"Rodrigo Ricardo",32,105,"00:00:57.505",61.29]
[5,"Rodrigo Ricardo",32,105,"00:00:57.995",60.77]
[5,"Rodrigo Ricardo",32,105,"00:00:58",60.77]
[5,"Rodrigo Ricardo",32,105,"00:00:57.814",60.96]
[5,"Rodrigo Ricardo",32,105,"00:00:57.591",61.2]
[5,"Rodrigo Ricardo",32,105,"00:00:58.848",59.89]
[5,"Rodrigo Ricardo",32,105,"00:00:57.548",61.24]
[5,"Rodrigo Ricardo",32,105,"00:00:58.278",60.48]
[5,"Rodrigo Ricardo",32,105,"00:00:57.524",61.27]
[5,"Rodrigo Ricardo",32,105,"00:00:57.898",60.87]
[5,"Rodrigo Ricardo",32,105,"00:00:58.155",60.6]
[5,"Rodrigo Ricardo",32,105,"00:00:58.111",60.65]
[5,"Rodrigo Ricardo",32,105,"00:00:57.737",61.04]
[5,"Rodrigo Ricardo",32,105,"00:00:57.964",60.8]
[5,"Rodrigo Ricardo",32,105,"00:00:58.011",60.75]
[5,"Rodrigo Ricardo",32,105,"00:00:57.667",61.12]
[5,"Rodrigo Ricardo",32,105,"00:00:57.572",61.22]
[5,"Rodrigo Ricardo",32,105,"00:00:57.785",60.99]
[5,"Rodrigo Ricardo",32,105,"00:00:58.291",60.46]
[5,"Rodrigo Ricardo",32,105,"00:00:57.619",61.17]
[5,"Rodrigo Ricardo",32,105,"00:00:57.676",61.11]
[5,"Rodrigo Ricardo",32,105,"00:00:57.630",61.16]
[5,"Bernardo Freitas",32,119,"00:01:05.736",53.61]
[5,"Bernardo Freitas",32,119,"00:01:00.437",58.32]
[5,"Bernardo Freitas",32,119,"00:00:57.956",60.81]
[5,"Bernardo Freitas",32,119,"00:00:58.598",60.15]
[5,"Bernardo Freitas",32,119,"00:00:58.172",60.59]
[5,"Bernardo Freitas",32,119,"00:00:58.870",59.87]
[5,"Bernardo Freitas",32,119,"00:00:57.369",61.43]
[5,"Bernardo Freitas",32,119,"00:00:57.360",61.44]
[5,"Bernardo Freitas",32,119,"00:00:57.485",61.31]
[5,"Bernardo Freitas",32,119,"00:00:59.008",59.73]
[5,"Bernardo Freitas",32,119,"00:00:58.049",60.71]
[5,"Bernardo Freitas",32,119,"00:00:58.256",60.5]
[5,"Bernardo Freitas",32,119,"00:00:57.841",60.93]
[5,"Bernardo Freitas",32,119,"00:00:57.659",61.12]
[5,"Bernardo Freitas",32,119,"00:00:57.879",60.89]
[5,"Bernardo Freitas",32,119,"00:00:57.957",60.81]
[5,"Bernardo Freitas",32,119,"00:00:58.229",60.53]
[5,"Bernardo Freitas",32,119,"00:00:59.351",59.38]
[5,"Bernardo Freitas",32,119,"00:00:57.609",61.18]
[5,"Bernardo Freitas",32,119,"00:00:57.517",61.28]
[5,"Bernardo Freitas",32,119,"00:00:57.846",60.93]
[5,"Bernardo Freitas",32,119,"00:00:58.192",60.57]
[5,"Bernardo Freitas",32,119,"00:00:57.685",61.1]
[5,"Bernardo Freitas",32,119,"00:00:58.274",60.48]
[5,"Bernardo Freitas",32,119,"00:00:57.939",60.83]
[5,"Bernardo Freitas",32,119,"00:00:58.077",60.68]
[5,"Bernardo Freitas",32,119,"00:00:58.038",60.73]
[5,"Bernardo Freitas",32,119,"00:00:57.220",61.59]
[5,"Bernardo Freitas",32,119,"00:00:57.978",60.79]
[5,"Bernardo Freitas",32,119,"00:00:58.102",60.66]
[5,"Bernardo Freitas",32,119,"00:00:57.487",61.31]
[5,"Bernardo Freitas",32,119,"00:00:57.616",61.17]
[5,"DELCIO OLIVEIRA",32,140,"00:01:15.544",46.65]
[5,"DELCIO OLIVEIRA",32,140,"00:00:59.263",59.47]
[5,"DELCIO OLIVEIRA",32,140,"00:00:58.006",60.76]
[5,"DELCIO OLIVEIRA",32,140,"00:00:58.406",60.34]
[5,"DELCIO OLIVEIRA",32,140,"00:00:57.882",60.89]
[5,"DELCIO OLIVEIRA",32,140,"00:00:58.081",60.68]
[5,"DELCIO OLIVEIRA",32,140,"00:00:58.223",60.53]
[5,"DELCIO OLIVEIRA",32,140,"00:00:58.426",60.32]
[5,"DELCIO OLIVEIRA",32,140,"00:00:57.882",60.89]
[5,"DELCIO OLIVEIRA",32,140,"00:00:56.884",61.96]
[5,"DELCIO OLIVEIRA",32,140,"00:00:57.148",61.67]
[5,"DELCIO OLIVEIRA",32,140,"00:00:57.897",60.87]
[5,"DELCIO OLIVEIRA",32,140,"00:00:57.544",61.25]
[5,"DELCIO OLIVEIRA",32,140,"00:00:57.407",61.39]
[5,"DELCIO OLIVEIRA",32,140,"00:00:57.522",61.27]
[5,"DELCIO OLIVEIRA",32,140,"00:00:57.267",61.54]
[5,"DELCIO OLIVEIRA",32,140,"00:00:57.122",61.7]
[5,"DELCIO OLIVEIRA",32,140,"00:00:57.095",61.73]
[5,"DELCIO OLIVEIRA",32,140,"00:00:56.794",62.06]
[5,"DELCIO OLIVEIRA",32,140,"00:00:56.992",61.84]
[5,"DELCIO OLIVEIRA",32,140,"00:00:58.211",60.55]
[5,"DELCIO OLIVEIRA",32,140,"00:00:57.769",61.01]
[5,"DELCIO OLIVEIRA",32,140,"00:00:57.759",61.02]
[5,"DELCIO OLIVEIRA",32,140,"00:00:58.573",60.17]
[5,"DELCIO OLIVEIRA",32,140,"00:00:57.239",61.57]
[5,"DELCIO OLIVEIRA",32,140,"00:00:58.012",60.75]
[5,"DELCIO OLIVEIRA",32,140,"00:00:57.576",61.21]
[5,"DELCIO OLIVEIRA",32,140,"00:00:57.182",61.63]
[5,"DELCIO OLIVEIRA",32,140,"00:00:58.653",60.09]
[5,"DELCIO OLIVEIRA",32,140,"00:00:58.074",60.69]
[5,"DELCIO OLIVEIRA",32,140,"00:00:57.500",61.29]
[5,"DELCIO OLIVEIRA",32,140,"00:00:57.627",61.16]
[5,"Renato Amaral",32,124,"00:01:06.293",53.16]
[5,"Renato Amaral",32,124,"00:01:00.611",58.15]
[5,"Renato Amaral",32,124,"00:00:59.516",59.22]
[5,"Renato Amaral",32,124,"00:00:59.202",59.53]
[5,"Renato Amaral",32,124,"00:00:58.164",60.59]
[5,"Renato Amaral",32,124,"00:00:58.003",60.76]
[5,"Renato Amaral",32,124,"00:00:57.797",60.98]
[5,"Renato Amaral",32,124,"00:00:57.737",61.04]
[5,"Renato Amaral",32,124,"00:00:57.924",60.85]
[5,"Renato Amaral",32,124,"00:00:57.848",60.93]
[5,"Renato Amaral",32,124,"00:00:58.112",60.65]
[5,"Renato Amaral",32,124,"00:00:58.323",60.43]
[5,"Renato Amaral",32,124,"00:00:57.935",60.83]
[5,"Renato Amaral",32,124,"00:00:57.581",61.21]
[5,"Renato Amaral",32,124,"00:00:57.945",60.82]
[5,"Renato Amaral",32,124,"00:00:57.479",61.32]
[5,"Renato Amaral",32,124,"00:00:57.431",61.37]
[5,"Renato Amaral",32,124,"00:00:58.332",60.42]
[5,"Renato Amaral",32,124,"00:00:57.739",61.04]
[5,"Renato Amaral",32,124,"00:00:57.500",61.29]
[5,"Renato Amaral",32,124,"00:00:57.992",60.77]
[5,"Renato Amaral",32,124,"00:00:58.090",60.67]
[5,"Renato Amaral",32,124,"00:00:57.747",61.03]
[5,"Renato Amaral",32,124,"00:00:58.134",60.63]
[5,"Renato Amaral",32,124,"00:00:58.273",60.48]
[5,"Renato Amaral",32,124,"00:00:58.271",60.48]
[5,"Renato Amaral",32,124,"00:00:57.698",61.08]
[5,"Renato Amaral",32,124,"00:00:57.691",61.09]
[5,"Renato Amaral",32,124,"00:00:58.624",60.12]
[5,"Renato Amaral",32,124,"00:00:57.673",61.11]
[5,"Renato Amaral",32,124,"00:00:57.378",61.42]
[5,"Renato Amaral",32,124,"00:00:57.430",61.37]
[5,"Jucimar Vieira",32,134,"00:01:07.424",52.27]
[5,"Jucimar Vieira",32,134,"00:00:59.844",58.89]
[5,"Jucimar Vieira",32,134,"00:00:59.517",59.22]
[5,"Jucimar Vieira",32,134,"00:00:59.175",59.56]
[5,"Jucimar Vieira",32,134,"00:00:59.934",58.8]
[5,"Jucimar Vieira",32,134,"00:00:59.114",59.62]
[5,"Jucimar Vieira",32,134,"00:00:58.666",60.08]
[5,"Jucimar Vieira",32,134,"00:00:58.060",60.7]
[5,"Jucimar Vieira",32,134,"00:00:57.578",61.21]
[5,"Jucimar Vieira",32,134,"00:00:57.946",60.82]
[5,"Jucimar Vieira",32,134,"00:00:57.726",61.05]
[5,"Jucimar Vieira",32,134,"00:00:58.027",60.74]
[5,"Jucimar Vieira",32,134,"00:00:58.205",60.55]
[5,"Jucimar Vieira",32,134,"00:00:57.730",61.05]
[5,"Jucimar Vieira",32,134,"00:00:58.363",60.39]
[5,"Jucimar Vieira",32,134,"00:00:57.851",60.92]
[5,"Jucimar Vieira",32,134,"00:00:57.813",60.96]
[5,"Jucimar Vieira",32,134,"00:00:58.001",60.76]
[5,"Jucimar Vieira",32,134,"00:00:57.761",61.02]
[5,"Jucimar Vieira",32,134,"00:00:57.669",61.11]
[5,"Jucimar Vieira",32,134,"00:00:57.445",61.35]
[5,"Jucimar Vieira",32,134,"00:00:57.733",61.05]
[5,"Jucimar Vieira",32,134,"00:00:58.349",60.4]
[5,"Jucimar Vieira",32,134,"00:00:57.844",60.93]
[5,"Jucimar Vieira",32,134,"00:00:57.822",60.95]
[5,"Jucimar Vieira",32,134,"00:00:57.789",60.99]
[5,"Jucimar Vieira",32,134,"00:00:57.565",61.22]
[5,"Jucimar Vieira",32,134,"00:00:57.768",61.01]
[5,"Jucimar Vieira",32,134,"00:00:57.682",61.1]
[5,"Jucimar Vieira",32,134,"00:00:57.286",61.52]
[5,"Jucimar Vieira",32,134,"00:00:57.589",61.2]
[5,"Jucimar Vieira",32,134,"00:00:57.456",61.34]
[5,"Tati Marcondes",32,123,"00:01:08.335",51.58]
[5,"Tati Marcondes",32,123,"00:00:59.690",59.05]
[5,"Tati Marcondes",32,123,"00:00:59.856",58.88]
[5,"Tati Marcondes",32,123,"00:01:02.822",56.1]
[5,"Tati Marcondes",32,123,"00:00:58.214",60.54]
[5,"Tati Marcondes",32,123,"00:00:58.023",60.74]
[5,"Tati Marcondes",32,123,"00:00:59.725",59.01]
[5,"Tati Marcondes",32,123,"00:00:58.079",60.68]
[5,"Tati Marcondes",32,123,"00:00:58.517",60.23]
[5,"Tati Marcondes",32,123,"00:00:57.747",61.03]
[5,"Tati Marcondes",32,123,"00:00:58.533",60.21]
[5,"Tati Marcondes",32,123,"00:00:57.908",60.86]
[5,"Tati Marcondes",32,123,"00:00:59.238",59.5]
[5,"Tati Marcondes",32,123,"00:00:58.077",60.68]
[5,"Tati Marcondes",32,123,"00:00:57.684",61.1]
[5,"Tati Marcondes",32,123,"00:00:57.778",61]
[5,"Tati Marcondes",32,123,"00:00:58.660",60.08]
[5,"Tati Marcondes",32,123,"00:00:57.713",61.07]
[5,"Tati Marcondes",32,123,"00:00:58.310",60.44]
[5,"Tati Marcondes",32,123,"00:00:58.178",60.58]
[5,"Tati Marcondes",32,123,"00:00:57.961",60.81]
[5,"Tati Marcondes",32,123,"00:00:57.871",60.9]
[5,"Tati Marcondes",32,123,"00:00:57.938",60.83]
[5,"Tati Marcondes",32,123,"00:00:58.172",60.59]
[5,"Tati Marcondes",32,123,"00:00:58.361",60.39]
[5,"Tati Marcondes",32,123,"00:00:58.117",60.64]
[5,"Tati Marcondes",32,123,"00:00:58.060",60.7]
[5,"Tati Marcondes",32,123,"00:00:58.502",60.24]
[5,"Tati Marcondes",32,123,"00:00:58.086",60.68]
[5,"Tati Marcondes",32,123,"00:00:58.406",60.34]
[5,"Tati Marcondes",32,123,"00:00:58.368",60.38]
[5,"Tati Marcondes",32,123,"00:00:58.214",60.54]
[5,"Hélio Chagas",31,118,"00:01:06.561",52.95]
[5,"Hélio Chagas",31,118,"00:01:00.088",58.65]
[5,"Hélio Chagas",31,118,"00:00:59.740",59]
[5,"Hélio Chagas",31,118,"00:00:59.386",59.35]
[5,"Hélio Chagas",31,118,"00:01:00.158",58.59]
[5,"Hélio Chagas",31,118,"00:00:58.979",59.76]
[5,"Hélio Chagas",31,118,"00:01:00.621",58.14]
[5,"Hélio Chagas",31,118,"00:00:58.283",60.47]
[5,"Hélio Chagas",31,118,"00:00:58.446",60.3]
[5,"Hélio Chagas",31,118,"00:00:59.977",58.76]
[5,"Hélio Chagas",31,118,"00:01:06.922",52.66]
[5,"Hélio Chagas",31,118,"00:00:59.170",59.56]
[5,"Hélio Chagas",31,118,"00:00:58.381",60.37]
[5,"Hélio Chagas",31,118,"00:00:58.493",60.25]
[5,"Hélio Chagas",31,118,"00:00:58.299",60.45]
[5,"Hélio Chagas",31,118,"00:00:58.300",60.45]
[5,"Hélio Chagas",31,118,"00:00:58.274",60.48]
[5,"Hélio Chagas",31,118,"00:00:58.423",60.33]
[5,"Hélio Chagas",31,118,"00:00:58.484",60.26]
[5,"Hélio Chagas",31,118,"00:00:58.545",60.2]
[5,"Hélio Chagas",31,118,"00:00:58.831",59.91]
[5,"Hélio Chagas",31,118,"00:00:58.468",60.28]
[5,"Hélio Chagas",31,118,"00:00:59.108",59.63]
[5,"Hélio Chagas",31,118,"00:00:58.326",60.43]
[5,"Hélio Chagas",31,118,"00:00:58.103",60.66]
[5,"Hélio Chagas",31,118,"00:00:57.958",60.81]
[5,"Hélio Chagas",31,118,"00:00:58.479",60.27]
[5,"Hélio Chagas",31,118,"00:00:58.424",60.32]
[5,"Hélio Chagas",31,118,"00:00:58.901",59.84]
[5,"Hélio Chagas",31,118,"00:00:58.660",60.08]
[5,"Hélio Chagas",31,118,"00:00:58.171",60.59]
[5,"JOSEPH SCHIOPPO",31,120,"00:01:07.117",52.51]
[5,"JOSEPH SCHIOPPO",31,120,"00:00:59.243",59.49]
[5,"JOSEPH SCHIOPPO",31,120,"00:00:59.306",59.43]
[5,"JOSEPH SCHIOPPO",31,120,"00:00:59.545",59.19]
[5,"JOSEPH SCHIOPPO",31,120,"00:00:58.441",60.31]
[5,"JOSEPH SCHIOPPO",31,120,"00:00:58.116",60.64]
[5,"JOSEPH SCHIOPPO",31,120,"00:00:58.504",60.24]
[5,"JOSEPH SCHIOPPO",31,120,"00:00:57.996",60.77]
[5,"JOSEPH SCHIOPPO",31,120,"00:00:58.535",60.21]
[5,"JOSEPH SCHIOPPO",31,120,"00:00:58.255",60.5]
[5,"JOSEPH SCHIOPPO",31,120,"00:00:58.141",60.62]
[5,"JOSEPH SCHIOPPO",31,120,"00:00:58.268",60.49]
[5,"JOSEPH SCHIOPPO",31,120,"00:00:58.663",60.08]
[5,"JOSEPH SCHIOPPO",31,120,"00:00:57.769",61.01]
[5,"JOSEPH SCHIOPPO",31,120,"00:01:07.716",52.05]
[5,"JOSEPH SCHIOPPO",31,120,"00:00:58.609",60.13]
[5,"JOSEPH SCHIOPPO",31,120,"00:00:58.238",60.52]
[5,"JOSEPH SCHIOPPO",31,120,"00:00:58.138",60.62]
[5,"JOSEPH SCHIOPPO",31,120,"00:00:58.666",60.08]
[5,"JOSEPH SCHIOPPO",31,120,"00:00:58.206",60.55]
[5,"JOSEPH SCHIOPPO",31,120,"00:01:23.962",41.98]
[5,"JOSEPH SCHIOPPO",31,120,"00:00:59.726",59.01]
[5,"JOSEPH SCHIOPPO",31,120,"00:01:01.343",57.45]
[5,"JOSEPH SCHIOPPO",31,120,"00:00:58.378",60.37]
[5,"JOSEPH SCHIOPPO",31,120,"00:00:57.851",60.92]
[5,"JOSEPH SCHIOPPO",31,120,"00:00:58.018",60.75]
[5,"JOSEPH SCHIOPPO",31,120,"00:00:58.551",60.19]
[5,"JOSEPH SCHIOPPO",31,120,"00:00:58.286",60.47]
[5,"JOSEPH SCHIOPPO",31,120,"00:00:58.043",60.72]
[5,"JOSEPH SCHIOPPO",31,120,"00:00:58.471",60.28]
[5,"JOSEPH SCHIOPPO",31,120,"00:01:00.134",58.61]
[5,"Daniel Nahum",30,145,"00:01:04.250",54.85]
[5,"Daniel Nahum",30,145,"00:01:00.149",58.59]
[5,"Daniel Nahum",30,145,"00:00:58.140",60.62]
[5,"Daniel Nahum",30,145,"00:00:58.368",60.38]
[5,"Daniel Nahum",30,145,"00:00:58.221",60.53]
[5,"Daniel Nahum",30,145,"00:00:57.826",60.95]
[5,"Daniel Nahum",30,145,"00:00:57.605",61.18]
[5,"Daniel Nahum",30,145,"00:02:50.288",20.7]
[5,"Daniel Nahum",30,145,"00:00:59.118",59.62]
[5,"Daniel Nahum",30,145,"00:00:57.708",61.07]
[5,"Daniel Nahum",30,145,"00:00:57.779",61]
[5,"Daniel Nahum",30,145,"00:00:57.018",61.81]
[5,"Daniel Nahum",30,145,"00:00:57.207",61.61]
[5,"Daniel Nahum",30,145,"00:00:56.776",62.08]
[5,"Daniel Nahum",30,145,"00:00:57.768",61.01]
[5,"Daniel Nahum",30,145,"00:01:01.701",57.12]
[5,"Daniel Nahum",30,145,"00:00:57.033",61.8]
[5,"Daniel Nahum",30,145,"00:00:57.157",61.66]
[5,"Daniel Nahum",30,145,"00:00:56.932",61.91]
[5,"Daniel Nahum",30,145,"00:00:57.388",61.41]
[5,"Daniel Nahum",30,145,"00:00:56.852",61.99]
[5,"Daniel Nahum",30,145,"00:00:57.084",61.74]
[5,"Daniel Nahum",30,145,"00:00:57.405",61.4]
[5,"Daniel Nahum",30,145,"00:00:58.653",60.09]
[5,"Daniel Nahum",30,145,"00:00:57.443",61.35]
[5,"Daniel Nahum",30,145,"00:00:57.211",61.6]
[5,"Daniel Nahum",30,145,"00:00:57.025",61.8]
[5,"Daniel Nahum",30,145,"00:00:56.641",62.22]
[5,"Daniel Nahum",30,145,"00:00:56.640",62.22]
[5,"Daniel Nahum",30,145,"00:00:56.618",62.25]
[5,"Cláudio Naves",28,144,"00:01:06.309",53.15]
[5,"Cláudio Naves",28,144,"00:00:59.924",58.81]
[5,"Cláudio Naves",28,144,"00:00:59.441",59.29]
[5,"Cláudio Naves",28,144,"00:00:59.217",59.52]
[5,"Cláudio Naves",28,144,"00:00:59.939",58.8]
[5,"Cláudio Naves",28,144,"00:00:59.648",59.09]
[5,"Cláudio Naves",28,144,"00:00:59.177",59.56]
[5,"Cláudio Naves",28,144,"00:00:58.628",60.11]
[5,"Cláudio Naves",28,144,"00:00:59.979",58.76]
[5,"Cláudio Naves",28,144,"00:00:59.952",58.79]
[5,"Cláudio Naves",28,144,"00:01:01.917",56.92]
[5,"Cláudio Naves",28,144,"00:01:00.251",58.5]
[5,"Cláudio Naves",28,144,"00:00:59.860",58.88]
[5,"Cláudio Naves",28,144,"00:00:59.643",59.09]
[5,"Cláudio Naves",28,144,"00:00:59.726",59.01]
[5,"Cláudio Naves",28,144,"00:00:59.063",59.67]
[5,"Cláudio Naves",28,144,"00:00:59.256",59.48]
[5,"Cláudio Naves",28,144,"00:00:59.211",59.52]
[5,"Cláudio Naves",28,144,"00:01:04.547",54.6]
[5,"Cláudio Naves",28,144,"00:00:59.026",59.71]
[5,"Cláudio Naves",28,144,"00:00:59.506",59.23]
[5,"Cláudio Naves",28,144,"00:00:59.999",58.74]
[5,"Cláudio Naves",28,144,"00:00:59.244",59.49]
[5,"Cláudio Naves",28,144,"00:01:00.205",58.54]
[5,"Cláudio Naves",28,144,"00:04:14.107",13.87]
[5,"Cláudio Naves",28,144,"00:01:05.851",53.52]
[5,"Cláudio Naves",28,144,"00:00:58.345",60.41]
[5,"Cláudio Naves",28,144,"00:01:05.713",53.63]
[5,"Marcelo Marcondes",22,113,"00:01:04.307",54.81]
[5,"Marcelo Marcondes",22,113,"00:00:59.965",58.77]
[5,"Marcelo Marcondes",22,113,"00:00:58.593",60.15]
[5,"Marcelo Marcondes",22,113,"00:00:59.427",59.31]
[5,"Marcelo Marcondes",22,113,"00:00:58.869",59.87]
[5,"Marcelo Marcondes",22,113,"00:00:59.691",59.04]
[5,"Marcelo Marcondes",22,113,"00:00:58.679",60.06]
[5,"Marcelo Marcondes",22,113,"00:00:57.830",60.94]
[5,"Marcelo Marcondes",22,113,"00:00:57.952",60.82]
[5,"Marcelo Marcondes",22,113,"00:00:57.703",61.08]
[5,"Marcelo Marcondes",22,113,"00:00:57.909",60.86]
[5,"Marcelo Marcondes",22,113,"00:00:58.468",60.28]
[5,"Marcelo Marcondes",22,113,"00:01:16.230",46.23]
[5,"Marcelo Marcondes",22,113,"00:06:46.430",8.67]
[5,"Marcelo Marcondes",22,113,"00:00:58.833",59.91]
[5,"Marcelo Marcondes",22,113,"00:00:58.208",60.55]
[5,"Marcelo Marcondes",22,113,"00:00:58.304",60.45]
[5,"Marcelo Marcondes",22,113,"00:00:58.447",60.3]
[5,"Marcelo Marcondes",22,113,"00:00:57.826",60.95]
[5,"Marcelo Marcondes",22,113,"00:00:58.198",60.56]
[5,"Marcelo Marcondes",22,113,"00:00:58.813",59.93]
[5,"Marcelo Marcondes",22,113,"00:00:58.271",60.48]
[5,"Cláudio Dumont",12,148,"00:01:17.014",45.76]
[5,"Cláudio Dumont",12,148,"00:00:58.229",60.53]
[5,"Cláudio Dumont",12,148,"00:00:57.508",61.29]
[5,"Cláudio Dumont",12,148,"00:00:57.155",61.66]
[5,"Cláudio Dumont",12,148,"00:00:58.946",59.79]
[5,"Cláudio Dumont",12,148,"00:00:58.198",60.56]
[5,"Cláudio Dumont",12,148,"00:00:57.663",61.12]
[5,"Cláudio Dumont",12,148,"00:00:56.846",62]
[5,"Cláudio Dumont",12,148,"00:00:56.734",62.12]
[5,"Cláudio Dumont",12,148,"00:00:57.056",61.77]
[5,"Cláudio Dumont",12,148,"00:00:56.838",62.01]
[5,"Cláudio Dumont",12,148,"00:00:57.210",61.6]

{"sheet":"ETAPA 3","index":8,"n_rows":974,"n_cols":12,"rows_kept":974,"cut":false,"hidden":false,"merged":[[0,0,0,6]]}
["Obs.: Selecione até 3 pilotos colocando na frente do seu nome os números 1, 2 e 3.",null,null,null,null,null,null,"PILOTO",{"$f":"J52","v":"Marcelo Campos"},{"$f":"K52","v":"Daniel Nahum"},{"$f":"L52","v":"Alexandre Melillo"}]
[null,"Marcelo Marcondes",null,null,null,null,null,"MÉDIA",{"$f":"AVERAGE(J53:J97)","v":"00:01:01.911"},{"$f":"AVERAGE(K53:K97)","v":"00:01:01.937"},{"$f":"AVERAGE(L53:L97)","v":"00:01:03.034"}]
[null,"Marcelo Pereira",null,null,null,null,null,"MAXIMA",{"$f":"LARGE(J53:J97,1)","v":"00:01:07.743"},{"$f":"LARGE(K53:K97,1)","v":"00:01:13.973"},{"$f":"LARGE(L53:L97,1)","v":"00:01:17.503"}]
[null,"Wesley Bambirra",null,null,null,null,null,"MÍNIMA",{"$f":"SMALL(J53:J97,1)","v":"00:01:01.041"},{"$f":"SMALL(K53:K97,1)","v":"00:01:00.750"},{"$f":"SMALL(L53:L97,1)","v":"00:01:01.186"}]
[1,"Marcelo Campos",null,null,null,null,null,"Desvio Padrão",{"$f":"_xlfn.STDEV.S(J53:J97)","v":"00:00:01.224"},{"$f":"_xlfn.STDEV.S(K53:K97)","v":"00:00:02.402"},{"$f":"_xlfn.STDEV.S(L53:L97)","v":"00:00:03.639"}]
[2,"Daniel Nahum",null,null,null,null,null,"TEMPO TOTAL",{"$f":"SUM(J53:J97,1)","v":1.0214970370370371},{"$f":"SUM(K53:K97,1)","v":1.0215057291666667},{"$f":"SUM(L53:L97,1)","v":1.0218866435185185}]
[null,"Bernardo Freitas"]
[null,"Marcelo Surerus"]
[null,"Marcelo Chagas"]
[null,"Maurício Júnior"]
[null,"Guilherme Alves"]
[null,"Marcelo Clemente"]
[null,"Renato Amaral",null,null,null,null,null,null,null,null,{"$f":"SMALL(I4:K4,1)-L13","v":"00:01:00.750"}]
[null,"Wesley Canuto",null,null,null,null,null,null,null,null,{"$f":"LARGE(I3:K3,1)+L13","v":"00:01:17.503"}]
[null,"Rodrigo Ricardo"]
[null,"Eduardo Henrique"]
[null,"Cláudio Dumont"]
[null,"Luciano Robervine"]
[null,"Frederico Papatella"]
[3,"Alexandre Melillo"]
[null,"Raphael Reis"]
[null,"GUILHERME RUAS"]
[null,"Tati Marcondes"]
[null,"Jarbas Reis"]
[null,"Hélio Chagas"]
[null,"Cláudio Naves"]
[null,"Izabella Rodrigues"]
[null,"Marcelo Sant'anna"]
[null,"JOSEPH SCHIOPPO"]
[null,"Jucimar Vieira"]
[null,"Reila Ricardo"]
[1,"Roberta Epifânio"]
[]
[]
[]
[]
[]
[]
[]
[]
[]
[]
[]
[]
[]
[]
[]
[]
[]
["ETAPA","PILOTO","NÚMERO VOLTAS","KART","Volta Tm","velocidade Media",null,null,null,{"$f":"MATCH(J52,$B$51:$B$1500,0)","v":91},{"$f":"MATCH(K52,$B$51:$B$1500,0)","v":121},541]
[3,"Marcelo Marcondes",30,109,"00:01:05.748",57.49,null,null,null,{"$f":"VLOOKUP(J$52,$B$50:$F$1500,2,FALSE)","v":30},{"$f":"VLOOKUP(K$52,$B$50:$F$1500,2,FALSE)","v":30},{"$f":"VLOOKUP(L$52,$B$50:$F$1500,2,FALSE)","v":30}]
[3,"Marcelo Marcondes",30,109,"00:01:01.612",61.35,null,null,"VOLTA",{"$f":"VLOOKUP(1,$A$2:$B$36,2,FALSE)","v":"Marcelo Campos"},{"$f":"VLOOKUP(2,$A$2:$B$36,2,FALSE)","v":"Daniel Nahum"},{"$f":"VLOOKUP(3,$A$2:$B$36,2,FALSE)","v":"Alexandre Melillo"}]
[3,"Marcelo Marcondes",30,109,"00:01:01.494",61.47,null,null,1,{"$f":"OFFSET($E$51:$E$1500,J50-1,,J51)","v":"00:01:07.743"},{"$f":"OFFSET($E$51:$E$1500,K50-1,,K51)","v":"00:01:13.973"},{"$f":"OFFSET($E$51:$E$1500,L50-1,,L51)","v":"00:01:14.567"}]
[3,"Marcelo Marcondes",30,109,"00:01:01.438",61.53,null,null,2,"00:01:02.199","00:01:03.534","00:01:17.503"]
[3,"Marcelo Marcondes",30,109,"00:01:01.178",61.79,null,null,3,"00:01:02.602","00:01:02.338","00:01:04.424"]
[3,"Marcelo Marcondes",30,109,"00:01:01.113",61.85,null,null,4,"00:01:01.489","00:01:01.754","00:01:02.119"]
[3,"Marcelo Marcondes",30,109,"00:01:01.137",61.83,null,null,5,"00:01:02.032","00:01:02.115","00:01:01.809"]
[3,"Marcelo Marcondes",30,109,"00:01:01.211",61.75,null,null,6,"00:01:01.886","00:01:01.062","00:01:02.197"]
[3,"Marcelo Marcondes",30,109,"00:01:01.146",61.82,null,null,7,"00:01:01.711","00:01:01.225","00:01:02.402"]
[3,"Marcelo Marcondes",30,109,"00:01:01.170",61.79,null,null,8,"00:01:01.703","00:01:01.089","00:01:01.789"]
[3,"Marcelo Marcondes",30,109,"00:01:01.066",61.9,null,null,9,"00:01:01.613","00:01:00.956","00:01:01.806"]
[3,"Marcelo Marcondes",30,109,"00:01:01.088",61.88,null,null,10,"00:01:01.258","00:01:01.328","00:01:01.576"]
[3,"Marcelo Marcondes",30,109,"00:01:01.188",61.78,null,null,11,"00:01:01.278","00:01:00.975","00:01:01.732"]
[3,"Marcelo Marcondes",30,109,"00:01:00.878",62.09,null,null,12,"00:01:01.214","00:01:01.189","00:01:01.567"]
[3,"Marcelo Marcondes",30,109,"00:01:00.954",62.01,null,null,13,"00:01:02.262","00:01:01.096","00:01:01.608"]
[3,"Marcelo Marcondes",30,109,"00:01:00.989",61.98,null,null,14,"00:01:01.823","00:01:01.290","00:01:02.606"]
[3,"Marcelo Marcondes",30,109,"00:01:00.694",62.28,null,null,15,"00:01:01.547","00:01:01.211","00:01:02.553"]
[3,"Marcelo Marcondes",30,109,"00:01:01.436",61.53,null,null,16,"00:01:01.575","00:01:01.498","00:01:01.928"]
[3,"Marcelo Marcondes",30,109,"00:01:01.231",61.73,null,null,17,"00:01:01.601","00:01:00.750","00:01:01.579"]
[3,"Marcelo Marcondes",30,109,"00:01:01.052",61.91,null,null,18,"00:01:01.041","00:01:00.773","00:01:01.221"]
[3,"Marcelo Marcondes",30,109,"00:01:01.099",61.87,null,null,19,"00:01:02.031","00:01:01.612","00:01:01.808"]
[3,"Marcelo Marcondes",30,109,"00:01:01.009",61.96,null,null,20,"00:01:01.156","00:01:01.069","00:01:01.186"]
[3,"Marcelo Marcondes",30,109,"00:01:00.777",62.19,null,null,21,"00:01:01.202","00:01:01.128","00:01:01.405"]
[3,"Marcelo Marcondes",30,109,"00:01:01.743",61.22,null,null,22,"00:01:01.063","00:01:01.326","00:01:02.291"]
[3,"Marcelo Marcondes",30,109,"00:01:01.478",61.49,null,null,23,"00:01:01.166","00:01:00.820","00:01:01.265"]
[3,"Marcelo Marcondes",30,109,"00:01:01.353",61.61,null,null,24,"00:01:03.533","00:01:03.511","00:01:01.395"]
[3,"Marcelo Marcondes",30,109,"00:01:01.519",61.44,null,null,25,"00:01:01.473","00:01:02.744","00:01:02.731"]
[3,"Marcelo Marcondes",30,109,"00:01:01.223",61.74,null,null,26,"00:01:01.831","00:01:01.351","00:01:02.179"]
[3,"Marcelo Marcondes",30,109,"00:01:01.203",61.76,null,null,27,"00:01:01.519","00:01:01.145","00:01:02.154"]
[3,"Marcelo Marcondes",30,109,"00:01:01.691",61.27,null,null,28,"00:01:01.305","00:01:00.923","00:01:04.239"]
[3,"Marcelo Pereira",30,140,"00:01:17.758",48.61,null,null,29,"00:01:02.233","00:01:01.168","00:01:01.971"]
[3,"Marcelo Pereira",30,140,"00:01:01.806",61.16,null,null,30,"00:01:02.255","00:01:03.142","00:01:03.396"]
[3,"Marcelo Pereira",30,140,"00:01:01.840",61.13,null,null,31]
[3,"Marcelo Pereira",30,140,"00:01:01.323",61.64,null,null,32]
[3,"Marcelo Pereira",30,140,"00:01:01.705",61.26,null,null,33]
[3,"Marcelo Pereira",30,140,"00:01:01.385",61.58,null,null,34]
[3,"Marcelo Pereira",30,140,"00:01:01.034",61.93,null,null,35]
[3,"Marcelo Pereira",30,140,"00:01:01.490",61.47,null,null,36]
[3,"Marcelo Pereira",30,140,"00:01:00.780",62.19,null,null,37]
[3,"Marcelo Pereira",30,140,"00:01:00.812",62.16,null,null,38]
[3,"Marcelo Pereira",30,140,"00:01:00.760",62.21,null,null,39]
[3,"Marcelo Pereira",30,140,"00:01:01.492",61.47,null,null,40]
[3,"Marcelo Pereira",30,140,"00:01:00.656",62.32,null,null,41]
[3,"Marcelo Pereira",30,140,"00:01:00.573",62.4,null,null,42]
[3,"Marcelo Pereira",30,140,"00:01:00.944",62.02,null,null,43]
[3,"Marcelo Pereira",30,140,"00:01:01.223",61.74,null,null,44]
[3,"Marcelo Pereira",30,140,"00:01:00.620",62.36,null,null,45]
[3,"Marcelo Pereira",30,140,"00:01:00.560",62.42]
[3,"Marcelo Pereira",30,140,"00:01:01.295",61.67]
[3,"Marcelo Pereira",30,140,"00:01:01.035",61.93]
[3,"Marcelo Pereira",30,140,"00:01:00.898",62.07]
[3,"Marcelo Pereira",30,140,"00:01:00.967",62]
[3,"Marcelo Pereira",30,140,"00:01:00.938",62.03]
[3,"Marcelo Pereira",30,140,"00:01:01.039",61.93]
[3,"Marcelo Pereira",30,140,"00:01:01.299",61.66]
[3,"Marcelo Pereira",30,140,"00:01:01.215",61.75]
[3,"Marcelo Pereira",30,140,"00:01:01.229",61.74]
[3,"Marcelo Pereira",30,140,"00:01:00.972",62]
[3,"Marcelo Pereira",30,140,"00:01:01.013",61.95]
[3,"Marcelo Pereira",30,140,"00:01:01.394",61.57]
[3,"Wesley Bambirra",30,130,"00:01:09.419",54.45]
[3,"Wesley Bambirra",30,130,"00:01:02.196",60.78]
[3,"Wesley Bambirra",30,130,"00:01:02.304",60.67]
[3,"Wesley Bambirra",30,130,"00:01:01.671",61.29]
[3,"Wesley Bambirra",30,130,"00:01:01.728",61.24]
[3,"Wesley Bambirra",30,130,"00:01:02.207",60.76]
[3,"Wesley Bambirra",30,130,"00:01:01.407",61.56]
[3,"Wesley Bambirra",30,130,"00:01:01.472",61.49]
[3,"Wesley Bambirra",30,130,"00:01:01.328",61.64]
[3,"Wesley Bambirra",30,130,"00:01:01.438",61.53]
[3,"Wesley Bambirra",30,130,"00:01:01.153",61.81]
[3,"Wesley Bambirra",30,130,"00:01:00.928",62.04]
[3,"Wesley Bambirra",30,130,"00:01:01.809",61.16]
[3,"Wesley Bambirra",30,130,"00:01:01.581",61.38]
[3,"Wesley Bambirra",30,130,"00:01:01.519",61.44]
[3,"Wesley Bambirra",30,130,"00:01:01.565",61.4]
[3,"Wesley Bambirra",30,130,"00:01:01.519",61.44]
[3,"Wesley Bambirra",30,130,"00:01:01.325",61.64]
[3,"Wesley Bambirra",30,130,"00:01:01.596",61.37]
[3,"Wesley Bambirra",30,130,"00:01:01.679",61.29]
[3,"Wesley Bambirra",30,130,"00:01:01.127",61.84]
[3,"Wesley Bambirra",30,130,"00:01:01.169",61.8]
[3,"Wesley Bambirra",30,130,"00:01:01.168",61.8]
[3,"Wesley Bambirra",30,130,"00:01:01.950",61.02]
[3,"Wesley Bambirra",30,130,"00:01:01.655",61.31]
[3,"Wesley Bambirra",30,130,"00:01:01.867",61.1]
[3,"Wesley Bambirra",30,130,"00:01:01.981",60.99]
[3,"Wesley Bambirra",30,130,"00:01:01.820",61.15]
[3,"Wesley Bambirra",30,130,"00:01:01.829",61.14]
[3,"Wesley Bambirra",30,130,"00:01:03.028",59.97]
[3,"Marcelo Campos",30,153,"00:01:07.743",55.8]
[3,"Marcelo Campos",30,153,"00:01:02.199",60.77]
[3,"Marcelo Campos",30,153,"00:01:02.602",60.38]
[3,"Marcelo Campos",30,153,"00:01:01.489",61.47]
[3,"Marcelo Campos",30,153,"00:01:02.032",60.94]
[3,"Marcelo Campos",30,153,"00:01:01.886",61.08]
[3,"Marcelo Campos",30,153,"00:01:01.711",61.25]
[3,"Marcelo Campos",30,153,"00:01:01.703",61.26]
[3,"Marcelo Campos",30,153,"00:01:01.613",61.35]
[3,"Marcelo Campos",30,153,"00:01:01.258",61.71]
[3,"Marcelo Campos",30,153,"00:01:01.278",61.69]
[3,"Marcelo Campos",30,153,"00:01:01.214",61.75]
[3,"Marcelo Campos",30,153,"00:01:02.262",60.71]
[3,"Marcelo Campos",30,153,"00:01:01.823",61.14]
[3,"Marcelo Campos",30,153,"00:01:01.547",61.42]
[3,"Marcelo Campos",30,153,"00:01:01.575",61.39]
[3,"Marcelo Campos",30,153,"00:01:01.601",61.36]
[3,"Marcelo Campos",30,153,"00:01:01.041",61.93]
[3,"Marcelo Campos",30,153,"00:01:02.031",60.94]
[3,"Marcelo Campos",30,153,"00:01:01.156",61.81]
[3,"Marcelo Campos",30,153,"00:01:01.202",61.76]
[3,"Marcelo Campos",30,153,"00:01:01.063",61.9]
[3,"Marcelo Campos",30,153,"00:01:01.166",61.8]
[3,"Marcelo Campos",30,153,"00:01:03.533",59.5]
[3,"Marcelo Campos",30,153,"00:01:01.473",61.49]
[3,"Marcelo Campos",30,153,"00:01:01.831",61.13]
[3,"Marcelo Campos",30,153,"00:01:01.519",61.44]
[3,"Marcelo Campos",30,153,"00:01:01.305",61.66]
[3,"Marcelo Campos",30,153,"00:01:02.233",60.74]
[3,"Marcelo Campos",30,153,"00:01:02.255",60.72]
[3,"Daniel Nahum",30,143,"00:01:13.973",51.1]
[3,"Daniel Nahum",30,143,"00:01:03.534",59.5]
[3,"Daniel Nahum",30,143,"00:01:02.338",60.64]
[3,"Daniel Nahum",30,143,"00:01:01.754",61.21]
[3,"Daniel Nahum",30,143,"00:01:02.115",60.85]
[3,"Daniel Nahum",30,143,"00:01:01.062",61.9]
[3,"Daniel Nahum",30,143,"00:01:01.225",61.74]
[3,"Daniel Nahum",30,143,"00:01:01.089",61.88]
[3,"Daniel Nahum",30,143,"00:01:00.956",62.01]
[3,"Daniel Nahum",30,143,"00:01:01.328",61.64]
[3,"Daniel Nahum",30,143,"00:01:00.975",61.99]
[3,"Daniel Nahum",30,143,"00:01:01.189",61.78]
[3,"Daniel Nahum",30,143,"00:01:01.096",61.87]
[3,"Daniel Nahum",30,143,"00:01:01.290",61.67]
[3,"Daniel Nahum",30,143,"00:01:01.211",61.75]
[3,"Daniel Nahum",30,143,"00:01:01.498",61.47]
[3,"Daniel Nahum",30,143,"00:01:00.750",62.22]
[3,"Daniel Nahum",30,143,"00:01:00.773",62.2]
[3,"Daniel Nahum",30,143,"00:01:01.612",61.35]
[3,"Daniel Nahum",30,143,"00:01:01.069",61.9]
[3,"Daniel Nahum",30,143,"00:01:01.128",61.84]
[3,"Daniel Nahum",30,143,"00:01:01.326",61.64]
[3,"Daniel Nahum",30,143,"00:01:00.820",62.15]
[3,"Daniel Nahum",30,143,"00:01:03.511",59.52]
[3,"Daniel Nahum",30,143,"00:01:02.744",60.24]
[3,"Daniel Nahum",30,143,"00:01:01.351",61.61]
[3,"Daniel Nahum",30,143,"00:01:01.145",61.82]
[3,"Daniel Nahum",30,143,"00:01:00.923",62.05]
[3,"Daniel Nahum",30,143,"00:01:01.168",61.8]
[3,"Daniel Nahum",30,143,"00:01:03.142",59.87]
[3,"Bernardo Freitas",30,127,"00:01:07.247",56.21]
[3,"Bernardo Freitas",30,127,"00:01:02.703",60.28]
[3,"Bernardo Freitas",30,127,"00:01:01.702",61.26]
[3,"Bernardo Freitas",30,127,"00:01:02.284",60.69]
[3,"Bernardo Freitas",30,127,"00:01:01.122",61.84]
[3,"Bernardo Freitas",30,127,"00:01:02.131",60.84]
[3,"Bernardo Freitas",30,127,"00:01:02.110",60.86]
[3,"Bernardo Freitas",30,127,"00:01:02.241",60.73]
[3,"Bernardo Freitas",30,127,"00:01:01.271",61.69]
[3,"Bernardo Freitas",30,127,"00:01:01.101",61.86]
[3,"Bernardo Freitas",30,127,"00:01:01.127",61.84]
[3,"Bernardo Freitas",30,127,"00:01:01.347",61.62]
[3,"Bernardo Freitas",30,127,"00:01:01.728",61.24]
[3,"Bernardo Freitas",30,127,"00:01:01.059",61.91]
[3,"Bernardo Freitas",30,127,"00:01:00.785",62.19]
[3,"Bernardo Freitas",30,127,"00:01:01.725",61.24]
[3,"Bernardo Freitas",30,127,"00:01:01.576",61.39]
[3,"Bernardo Freitas",30,127,"00:01:01.008",61.96]
[3,"Bernardo Freitas",30,127,"00:01:02.184",60.79]
[3,"Bernardo Freitas",30,127,"00:01:01.720",61.24]
[3,"Bernardo Freitas",30,127,"00:01:01.241",61.72]
[3,"Bernardo Freitas",30,127,"00:01:00.882",62.09]
[3,"Bernardo Freitas",30,127,"00:01:01.004",61.96]
[3,"Bernardo Freitas",30,127,"00:01:03.601",59.43]
[3,"Bernardo Freitas",30,127,"00:01:01.961",61.01]
[3,"Bernardo Freitas",30,127,"00:01:01.518",61.45]
[3,"Bernardo Freitas",30,127,"00:01:01.156",61.81]
[3,"Bernardo Freitas",30,127,"00:01:01.286",61.68]
[3,"Bernardo Freitas",30,127,"00:01:01.136",61.83]
[3,"Bernardo Freitas",30,127,"00:01:03.341",59.68]
[3,"Marcelo Surerus",30,112,"00:01:06.957",56.45]
[3,"Marcelo Surerus",30,112,"00:01:02.219",60.75]
[3,"Marcelo Surerus",30,112,"00:01:02.652",60.33]
[3,"Marcelo Surerus",30,112,"00:01:01.722",61.24]
[3,"Marcelo Surerus",30,112,"00:01:01.746",61.22]
[3,"Marcelo Surerus",30,112,"00:01:02.583",60.4]
[3,"Marcelo Surerus",30,112,"00:01:01.136",61.83]
[3,"Marcelo Surerus",30,112,"00:01:01.546",61.42]
[3,"Marcelo Surerus",30,112,"00:01:01.619",61.34]
[3,"Marcelo Surerus",30,112,"00:01:01.250",61.71]
[3,"Marcelo Surerus",30,112,"00:01:01.432",61.53]
[3,"Marcelo Surerus",30,112,"00:01:01.070",61.9]
[3,"Marcelo Surerus",30,112,"00:01:02.509",60.47]
[3,"Marcelo Surerus",30,112,"00:01:01.328",61.64]
[3,"Marcelo Surerus",30,112,"00:01:01.454",61.51]
[3,"Marcelo Surerus",30,112,"00:01:01.492",61.47]
[3,"Marcelo Surerus",30,112,"00:01:01.767",61.2]
[3,"Marcelo Surerus",30,112,"00:01:01.070",61.9]
[3,"Marcelo Surerus",30,112,"00:01:02.436",60.54]
[3,"Marcelo Surerus",30,112,"00:01:01.166",61.8]
[3,"Marcelo Surerus",30,112,"00:01:01.148",61.82]
[3,"Marcelo Surerus",30,112,"00:01:01.171",61.79]
[3,"Marcelo Surerus",30,112,"00:01:00.917",62.05]
[3,"Marcelo Surerus",30,112,"00:01:03.883",59.17]
[3,"Marcelo Surerus",30,112,"00:01:01.983",60.98]
[3,"Marcelo Surerus",30,112,"00:01:02.256",60.72]
[3,"Marcelo Surerus",30,112,"00:01:01.221",61.74]
[3,"Marcelo Surerus",30,112,"00:01:02.320",60.65]
[3,"Marcelo Surerus",30,112,"00:01:01.456",61.51]
[3,"Marcelo Surerus",30,112,"00:01:01.754",61.21]
[3,"Marcelo Chagas",30,117,"00:01:07.172",56.27]
[3,"Marcelo Chagas",30,117,"00:01:02.712",60.28]
[3,"Marcelo Chagas",30,117,"00:01:02.861",60.13]
[3,"Marcelo Chagas",30,117,"00:01:02.127",60.84]
[3,"Marcelo Chagas",30,117,"00:01:01.755",61.21]
[3,"Marcelo Chagas",30,117,"00:01:01.664",61.3]
[3,"Marcelo Chagas",30,117,"00:01:01.701",61.26]
[3,"Marcelo Chagas",30,117,"00:01:01.564",61.4]
[3,"Marcelo Chagas",30,117,"00:01:01.682",61.28]
[3,"Marcelo Chagas",30,117,"00:01:02.215",60.76]
[3,"Marcelo Chagas",30,117,"00:01:01.357",61.61]
[3,"Marcelo Chagas",30,117,"00:01:02.585",60.4]
[3,"Marcelo Chagas",30,117,"00:01:01.457",61.51]
[3,"Marcelo Chagas",30,117,"00:01:01.671",61.29]
[3,"Marcelo Chagas",30,117,"00:01:01.930",61.04]
[3,"Marcelo Chagas",30,117,"00:01:01.184",61.78]
[3,"Marcelo Chagas",30,117,"00:01:01.635",61.33]
[3,"Marcelo Chagas",30,117,"00:01:01.358",61.61]
[3,"Marcelo Chagas",30,117,"00:01:01.355",61.61]
[3,"Marcelo Chagas",30,117,"00:01:01.340",61.62]
[3,"Marcelo Chagas",30,117,"00:01:01.591",61.37]
[3,"Marcelo Chagas",30,117,"00:01:01.240",61.72]
[3,"Marcelo Chagas",30,117,"00:01:02.094",60.88]
[3,"Marcelo Chagas",30,117,"00:01:02.391",60.59]
[3,"Marcelo Chagas",30,117,"00:01:02.636",60.35]
[3,"Marcelo Chagas",30,117,"00:01:02.303",60.67]
[3,"Marcelo Chagas",30,117,"00:01:02.907",60.09]
[3,"Marcelo Chagas",30,117,"00:01:02.528",60.45]
[3,"Marcelo Chagas",30,117,"00:01:02.298",60.68]
[3,"Marcelo Chagas",30,117,"00:01:02.415",60.56]
[3,"Maurício Júnior",30,151,"00:01:06.759",56.62]
[3,"Maurício Júnior",30,151,"00:01:03.121",59.88]
[3,"Maurício Júnior",30,151,"00:01:02.539",60.44]
[3,"Maurício Júnior",30,151,"00:01:02.016",60.95]
[3,"Maurício Júnior",30,151,"00:01:02.037",60.93]
[3,"Maurício Júnior",30,151,"00:01:03.617",59.42]
[3,"Maurício Júnior",30,151,"00:01:02.178",60.79]
[3,"Maurício Júnior",30,151,"00:01:03.278",59.74]
[3,"Maurício Júnior",30,151,"00:01:01.605",61.36]
[3,"Maurício Júnior",30,151,"00:01:02.369",60.61]
[3,"Maurício Júnior",30,151,"00:01:01.470",61.49]
[3,"Maurício Júnior",30,151,"00:01:03.483",59.54]
[3,"Maurício Júnior",30,151,"00:01:01.427",61.54]
[3,"Maurício Júnior",30,151,"00:01:02.342",60.63]
[3,"Maurício Júnior",30,151,"00:01:02.085",60.88]
[3,"Maurício Júnior",30,151,"00:01:01.683",61.28]
[3,"Maurício Júnior",30,151,"00:01:01.730",61.23]
[3,"Maurício Júnior",30,151,"00:01:01.439",61.52]
[3,"Maurício Júnior",30,151,"00:01:01.525",61.44]
[3,"Maurício Júnior",30,151,"00:01:01.565",61.4]
[3,"Maurício Júnior",30,151,"00:01:01.760",61.2]
[3,"Maurício Júnior",30,151,"00:01:01.763",61.2]
[3,"Maurício Júnior",30,151,"00:01:01.747",61.22]
[3,"Maurício Júnior",30,151,"00:01:01.893",61.07]
[3,"Maurício Júnior",30,151,"00:01:01.914",61.05]
[3,"Maurício Júnior",30,151,"00:01:02.209",60.76]
[3,"Maurício Júnior",30,151,"00:01:01.803",61.16]
[3,"Maurício Júnior",30,151,"00:01:02.496",60.48]
[3,"Maurício Júnior",30,151,"00:01:02.829",60.16]
[3,"Maurício Júnior",30,151,"00:01:02.064",60.9]
[3,"Guilherme Alves",30,124,"00:01:13.121",51.7]
[3,"Guilherme Alves",30,124,"00:01:03.353",59.67]
[3,"Guilherme Alves",30,124,"00:01:03.599",59.43]
[3,"Guilherme Alves",30,124,"00:01:02.523",60.46]
[3,"Guilherme Alves",30,124,"00:01:02.748",60.24]
[3,"Guilherme Alves",30,124,"00:01:02.487",60.49]
[3,"Guilherme Alves",30,124,"00:01:01.646",61.32]
[3,"Guilherme Alves",30,124,"00:01:02.090",60.88]
[3,"Guilherme Alves",30,124,"00:01:01.647",61.32]
[3,"Guilherme Alves",30,124,"00:01:02.398",60.58]
[3,"Guilherme Alves",30,124,"00:01:01.739",61.23]
[3,"Guilherme Alves",30,124,"00:01:01.491",61.47]
[3,"Guilherme Alves",30,124,"00:01:01.805",61.16]
[3,"Guilherme Alves",30,124,"00:01:01.617",61.35]
[3,"Guilherme Alves",30,124,"00:01:01.428",61.54]
[3,"Guilherme Alves",30,124,"00:01:01.445",61.52]
[3,"Guilherme Alves",30,124,"00:01:01.376",61.59]
[3,"Guilherme Alves",30,124,"00:01:01.830",61.14]
[3,"Guilherme Alves",30,124,"00:01:01.672",61.29]
[3,"Guilherme Alves",30,124,"00:01:01.480",61.48]
[3,"Guilherme Alves",30,124,"00:01:01.859",61.11]
[3,"Guilherme Alves",30,124,"00:01:01.564",61.4]
[3,"Guilherme Alves",30,124,"00:01:01.723",61.24]
[3,"Guilherme Alves",30,124,"00:01:01.647",61.32]
[3,"Guilherme Alves",30,124,"00:01:01.747",61.22]
[3,"Guilherme Alves",30,124,"00:01:01.912",61.05]
[3,"Guilherme Alves",30,124,"00:01:02.290",60.68]
[3,"Guilherme Alves",30,124,"00:01:01.873",61.09]
[3,"Guilherme Alves",30,124,"00:01:01.599",61.36]
[3,"Guilherme Alves",30,124,"00:01:02.219",60.75]
[3,"Marcelo Clemente",30,150,"00:01:11.588",52.8]
[3,"Marcelo Clemente",30,150,"00:01:03.339",59.68]
[3,"Marcelo Clemente",30,150,"00:01:03.522",59.51]
[3,"Marcelo Clemente",30,150,"00:01:02.556",60.43]
[3,"Marcelo Clemente",30,150,"00:01:02.148",60.82]
[3,"Marcelo Clemente",30,150,"00:01:02.637",60.35]
[3,"Marcelo Clemente",30,150,"00:01:02.020",60.95]
[3,"Marcelo Clemente",30,150,"00:01:01.970",61]
[3,"Marcelo Clemente",30,150,"00:01:01.879",61.09]
[3,"Marcelo Clemente",30,150,"00:01:02.028",60.94]
[3,"Marcelo Clemente",30,150,"00:01:01.878",61.09]
[3,"Marcelo Clemente",30,150,"00:01:01.751",61.21]
[3,"Marcelo Clemente",30,150,"00:01:02.032",60.94]
[3,"Marcelo Clemente",30,150,"00:01:01.612",61.35]
[3,"Marcelo Clemente",30,150,"00:01:01.429",61.53]
[3,"Marcelo Clemente",30,150,"00:01:01.442",61.52]
[3,"Marcelo Clemente",30,150,"00:01:01.376",61.59]
[3,"Marcelo Clemente",30,150,"00:01:01.971",61]
[3,"Marcelo Clemente",30,150,"00:01:01.556",61.41]
[3,"Marcelo Clemente",30,150,"00:01:01.452",61.51]
[3,"Marcelo Clemente",30,150,"00:01:01.640",61.32]
[3,"Marcelo Clemente",30,150,"00:01:01.534",61.43]
[3,"Marcelo Clemente",30,150,"00:01:01.722",61.24]
[3,"Marcelo Clemente",30,150,"00:01:01.684",61.28]
[3,"Marcelo Clemente",30,150,"00:01:01.751",61.21]
[3,"Marcelo Clemente",30,150,"00:01:01.871",61.09]
[3,"Marcelo Clemente",30,150,"00:01:02.147",60.82]
[3,"Marcelo Clemente",30,150,"00:01:01.905",61.06]
[3,"Marcelo Clemente",30,150,"00:01:01.709",61.26]
[3,"Marcelo Clemente",30,150,"00:01:02.497",60.48]
[3,"Renato Amaral",30,114,"00:01:07.100",56.33]
[3,"Renato Amaral",30,114,"00:01:02.158",60.81]
[3,"Renato Amaral",30,114,"00:01:03.407",59.61]
[3,"Renato Amaral",30,114,"00:01:02.993",60.01]
[3,"Renato Amaral",30,114,"00:01:01.694",61.27]
[3,"Renato Amaral",30,114,"00:01:01.591",61.37]
[3,"Renato Amaral",30,114,"00:01:01.948",61.02]
[3,"Renato Amaral",30,114,"00:01:02.365",60.61]
[3,"Renato Amaral",30,114,"00:01:01.503",61.46]
[3,"Renato Amaral",30,114,"00:01:01.265",61.7]
[3,"Renato Amaral",30,114,"00:01:01.416",61.55]
[3,"Renato Amaral",30,114,"00:01:01.653",61.31]
[3,"Renato Amaral",30,114,"00:01:01.984",60.98]
[3,"Renato Amaral",30,114,"00:01:01.145",61.82]
[3,"Renato Amaral",30,114,"00:01:02.442",60.54]
[3,"Renato Amaral",30,114,"00:01:01.589",61.37]
[3,"Renato Amaral",30,114,"00:01:02.300",60.67]
[3,"Renato Amaral",30,114,"00:01:01.638",61.33]
[3,"Renato Amaral",30,114,"00:01:01.765",61.2]
[3,"Renato Amaral",30,114,"00:01:01.504",61.46]
[3,"Renato Amaral",30,114,"00:01:01.681",61.28]
[3,"Renato Amaral",30,114,"00:01:01.443",61.52]
[3,"Renato Amaral",30,114,"00:01:03.026",59.98]
[3,"Renato Amaral",30,114,"00:01:01.966",61]
[3,"Renato Amaral",30,114,"00:01:02.617",60.37]
[3,"Renato Amaral",30,114,"00:01:02.370",60.61]
[3,"Renato Amaral",30,114,"00:01:02.591",60.39]
[3,"Renato Amaral",30,114,"00:01:02.751",60.24]
[3,"Renato Amaral",30,114,"00:01:02.075",60.89]
[3,"Renato Amaral",30,114,"00:01:04.716",58.41]
[3,"Wesley Canuto",30,145,"00:01:11.889",52.58]
[3,"Wesley Canuto",30,145,"00:01:03.174",59.83]
[3,"Wesley Canuto",30,145,"00:01:03.060",59.94]
[3,"Wesley Canuto",30,145,"00:01:03.667",59.37]
[3,"Wesley Canuto",30,145,"00:01:02.767",60.22]
[3,"Wesley Canuto",30,145,"00:01:02.465",60.51]
[3,"Wesley Canuto",30,145,"00:01:01.685",61.28]
[3,"Wesley Canuto",30,145,"00:01:02.067",60.9]
[3,"Wesley Canuto",30,145,"00:01:01.654",61.31]
[3,"Wesley Canuto",30,145,"00:01:02.590",60.39]
[3,"Wesley Canuto",30,145,"00:01:01.993",60.97]
[3,"Wesley Canuto",30,145,"00:01:01.495",61.47]
[3,"Wesley Canuto",30,145,"00:01:01.443",61.52]
[3,"Wesley Canuto",30,145,"00:01:01.620",61.34]
[3,"Wesley Canuto",30,145,"00:01:01.461",61.5]
[3,"Wesley Canuto",30,145,"00:01:01.403",61.56]
[3,"Wesley Canuto",30,145,"00:01:01.410",61.55]
[3,"Wesley Canuto",30,145,"00:01:01.939",61.03]
[3,"Wesley Canuto",30,145,"00:01:01.561",61.4]
[3,"Wesley Canuto",30,145,"00:01:01.568",61.4]
[3,"Wesley Canuto",30,145,"00:01:01.667",61.3]
[3,"Wesley Canuto",30,145,"00:01:01.775",61.19]
[3,"Wesley Canuto",30,145,"00:01:01.491",61.47]
[3,"Wesley Canuto",30,145,"00:01:01.669",61.29]
[3,"Wesley Canuto",30,145,"00:01:01.749",61.22]
[3,"Wesley Canuto",30,145,"00:01:01.992",60.98]
[3,"Wesley Canuto",30,145,"00:01:02.630",60.35]
[3,"Wesley Canuto",30,145,"00:01:01.949",61.02]
[3,"Wesley Canuto",30,145,"00:01:01.890",61.08]
[3,"Wesley Canuto",30,145,"00:01:01.862",61.1]
[3,"Rodrigo Ricardo",30,146,"00:01:06.687",56.68]
[3,"Rodrigo Ricardo",30,146,"00:01:03.914",59.14]
[3,"Rodrigo Ricardo",30,146,"00:01:03.570",59.46]
[3,"Rodrigo Ricardo",30,146,"00:01:01.977",60.99]
[3,"Rodrigo Ricardo",30,146,"00:01:01.684",61.28]
[3,"Rodrigo Ricardo",30,146,"00:01:03.136",59.87]
[3,"Rodrigo Ricardo",30,146,"00:01:02.241",60.73]
[3,"Rodrigo Ricardo",30,146,"00:01:02.434",60.54]
[3,"Rodrigo Ricardo",30,146,"00:01:01.521",61.44]
[3,"Rodrigo Ricardo",30,146,"00:01:01.692",61.27]
[3,"Rodrigo Ricardo",30,146,"00:01:02.169",60.8]
[3,"Rodrigo Ricardo",30,146,"00:01:02.025",60.94]
[3,"Rodrigo Ricardo",30,146,"00:01:02.371",60.61]
[3,"Rodrigo Ricardo",30,146,"00:01:02.890",60.1]
[3,"Rodrigo Ricardo",30,146,"00:01:02.554",60.43]
[3,"Rodrigo Ricardo",30,146,"00:01:01.781",61.18]
[3,"Rodrigo Ricardo",30,146,"00:01:01.586",61.38]
[3,"Rodrigo Ricardo",30,146,"00:01:01.507",61.46]
[3,"Rodrigo Ricardo",30,146,"00:01:01.530",61.43]
[3,"Rodrigo Ricardo",30,146,"00:01:01.558",61.41]
[3,"Rodrigo Ricardo",30,146,"00:01:02.060",60.91]
[3,"Rodrigo Ricardo",30,146,"00:01:01.832",61.13]
[3,"Rodrigo Ricardo",30,146,"00:01:01.997",60.97]
[3,"Rodrigo Ricardo",30,146,"00:01:02.409",60.57]
[3,"Rodrigo Ricardo",30,146,"00:01:02.398",60.58]
[3,"Rodrigo Ricardo",30,146,"00:01:02.455",60.52]
[3,"Rodrigo Ricardo",30,146,"00:01:03.070",59.93]
[3,"Rodrigo Ricardo",30,146,"00:01:02.663",60.32]
[3,"Rodrigo Ricardo",30,146,"00:01:02.607",60.38]
[3,"Rodrigo Ricardo",30,146,"00:01:02.403",60.57]
[3,"Eduardo Henrique",30,107,"00:01:08.700",55.02]
[3,"Eduardo Henrique",30,107,"00:01:03.487",59.54]
[3,"Eduardo Henrique",30,107,"00:01:02.296",60.68]
[3,"Eduardo Henrique",30,107,"00:01:02.651",60.33]
[3,"Eduardo Henrique",30,107,"00:01:01.667",61.3]
[3,"Eduardo Henrique",30,107,"00:01:01.683",61.28]
[3,"Eduardo Henrique",30,107,"00:01:01.688",61.28]
[3,"Eduardo Henrique",30,107,"00:01:01.618",61.35]
[3,"Eduardo Henrique",30,107,"00:01:01.137",61.83]
[3,"Eduardo Henrique",30,107,"00:01:01.485",61.48]
[3,"Eduardo Henrique",30,107,"00:01:02.014",60.95]
[3,"Eduardo Henrique",30,107,"00:01:02.302",60.67]
[3,"Eduardo Henrique",30,107,"00:01:01.292",61.67]
[3,"Eduardo Henrique",30,107,"00:01:01.556",61.41]
[3,"Eduardo Henrique",30,107,"00:01:01.917",61.05]
[3,"Eduardo Henrique",30,107,"00:01:01.287",61.68]
[3,"Eduardo Henrique",30,107,"00:01:01.525",61.44]
[3,"Eduardo Henrique",30,107,"00:01:01.310",61.65]
[3,"Eduardo Henrique",30,107,"00:01:01.463",61.5]
[3,"Eduardo Henrique",30,107,"00:01:01.182",61.78]
[3,"Eduardo Henrique",30,107,"00:01:01.713",61.25]
[3,"Eduardo Henrique",30,107,"00:01:01.161",61.8]
[3,"Eduardo Henrique",30,107,"00:01:02.492",60.49]
[3,"Eduardo Henrique",30,107,"00:01:01.941",61.03]
[3,"Eduardo Henrique",30,107,"00:01:02.685",60.3]
[3,"Eduardo Henrique",30,107,"00:01:02.280",60.69]
[3,"Eduardo Henrique",30,107,"00:01:03.169",59.84]
[3,"Eduardo Henrique",30,107,"00:01:03.104",59.9]
[3,"Eduardo Henrique",30,107,"00:01:01.709",61.26]
[3,"Eduardo Henrique",30,107,"00:01:12.028",52.48]
[3,"Cláudio Dumont",30,132,"00:01:06.364",56.96]
[3,"Cláudio Dumont",30,132,"00:01:02.768",60.22]
[3,"Cláudio Dumont",30,132,"00:01:02.500",60.48]
[3,"Cláudio Dumont",30,132,"00:01:02.067",60.9]
[3,"Cláudio Dumont",30,132,"00:01:01.996",60.97]
[3,"Cláudio Dumont",30,132,"00:01:02.028",60.94]
[3,"Cláudio Dumont",30,132,"00:01:01.699",61.27]
[3,"Cláudio Dumont",30,132,"00:01:02.303",60.67]
[3,"Cláudio Dumont",30,132,"00:01:01.507",61.46]
[3,"Cláudio Dumont",30,132,"00:01:01.996",60.97]
[3,"Cláudio Dumont",30,132,"00:01:01.632",61.33]
[3,"Cláudio Dumont",30,132,"00:01:01.874",61.09]
[3,"Cláudio Dumont",30,132,"00:01:02.423",60.55]
[3,"Cláudio Dumont",30,132,"00:01:01.951",61.02]
[3,"Cláudio Dumont",30,132,"00:01:02.583",60.4]
[3,"Cláudio Dumont",30,132,"00:01:01.897",61.07]
[3,"Cláudio Dumont",30,132,"00:01:02.310",60.66]
[3,"Cláudio Dumont",30,132,"00:01:01.592",61.37]
[3,"Cláudio Dumont",30,132,"00:01:15.065",50.36]
[3,"Cláudio Dumont",30,132,"00:01:03.145",59.86]
[3,"Cláudio Dumont",30,132,"00:01:02.210",60.76]
[3,"Cláudio Dumont",30,132,"00:01:01.593",61.37]
[3,"Cláudio Dumont",30,132,"00:01:01.786",61.18]
[3,"Cláudio Dumont",30,132,"00:01:01.898",61.07]
[3,"Cláudio Dumont",30,132,"00:01:02.038",60.93]
[3,"Cláudio Dumont",30,132,"00:01:01.816",61.15]
[3,"Cláudio Dumont",30,132,"00:01:01.792",61.17]
[3,"Cláudio Dumont",30,132,"00:01:01.946",61.02]
[3,"Cláudio Dumont",30,132,"00:01:01.854",61.11]
[3,"Cláudio Dumont",30,132,"00:01:02.024",60.94]
[3,"Luciano Robervine",30,"125","00:01:13.964",51.11]
[3,"Luciano Robervine",30,"125","00:01:02.955",60.04]
[3,"Luciano Robervine",30,"125","00:01:02.698",60.29]
[3,"Luciano Robervine",30,"125","00:01:04.186",58.89]
[3,"Luciano Robervine",30,"125","00:01:01.775",61.19]
[3,"Luciano Robervine",30,"125","00:01:01.722",61.24]
[3,"Luciano Robervine",30,"125","00:01:01.939",61.03]
[3,"Luciano Robervine",30,"125","00:01:02.727",60.26]
[3,"Luciano Robervine",30,"125","00:01:02.195",60.78]
[3,"Luciano Robervine",30,"125","00:01:01.632",61.33]
[3,"Luciano Robervine",30,"125","00:01:01.913",61.05]
[3,"Luciano Robervine",30,"125","00:01:02.168",60.8]
[3,"Luciano Robervine",30,"125","00:01:02.004",60.96]
[3,"Luciano Robervine",30,"125","00:01:01.793",61.17]
[3,"Luciano Robervine",30,"125","00:01:01.532",61.43]
[3,"Luciano Robervine",30,"125","00:01:01.738",61.23]
[3,"Luciano Robervine",30,"125","00:01:01.615",61.35]
[3,"Luciano Robervine",30,"125","00:01:01.995",60.97]
[3,"Luciano Robervine",30,"125","00:01:03.076",59.93]
[3,"Luciano Robervine",30,"125","00:01:03.117",59.89]
[3,"Luciano Robervine",30,"125","00:01:02.674",60.31]
[3,"Luciano Robervine",30,"125","00:01:01.617",61.35]
[3,"Luciano Robervine",30,"125","00:01:01.663",61.3]
[3,"Luciano Robervine",30,"125","00:01:02.071",60.9]
[3,"Luciano Robervine",30,"125","00:01:01.977",60.99]
[3,"Luciano Robervine",30,"125","00:01:01.673",61.29]
[3,"Luciano Robervine",30,"125","00:01:02.448",60.53]
[3,"Luciano Robervine",30,"125","00:01:02.576",60.41]
[3,"Luciano Robervine",30,"125","00:01:02.669",60.32]
[3,"Luciano Robervine",30,"125","00:01:02.982",60.02]
[3,"Frederico Papatella",30,120,"00:01:09.036",54.75]
[3,"Frederico Papatella",30,120,"00:01:03.793",59.25]
[3,"Frederico Papatella",30,120,"00:01:04.225",58.86]
[3,"Frederico Papatella",30,120,"00:01:16.688",49.29]
[3,"Frederico Papatella",30,120,"00:01:01.841",61.12]
[3,"Frederico Papatella",30,120,"00:01:02.117",60.85]
[3,"Frederico Papatella",30,120,"00:01:01.893",61.07]
[3,"Frederico Papatella",30,120,"00:01:01.851",61.11]
[3,"Frederico Papatella",30,120,"00:01:01.586",61.38]
[3,"Frederico Papatella",30,120,"00:01:01.787",61.18]
[3,"Frederico Papatella",30,120,"00:01:01.616",61.35]
[3,"Frederico Papatella",30,120,"00:01:01.406",61.56]
[3,"Frederico Papatella",30,120,"00:01:01.797",61.17]
[3,"Frederico Papatella",30,120,"00:01:03.761",59.28]
[3,"Frederico Papatella",30,120,"00:01:01.953",61.01]
[3,"Frederico Papatella",30,120,"00:01:01.824",61.14]
[3,"Frederico Papatella",30,120,"00:01:01.659",61.3]
[3,"Frederico Papatella",30,120,"00:01:01.837",61.13]
[3,"Frederico Papatella",30,120,"00:01:01.971",61]
[3,"Frederico Papatella",30,120,"00:01:01.192",61.77]
[3,"Frederico Papatella",30,120,"00:01:01.423",61.54]
[3,"Frederico Papatella",30,120,"00:01:02.147",60.82]
[3,"Frederico Papatella",30,120,"00:01:01.327",61.64]
[3,"Frederico Papatella",30,120,"00:01:01.298",61.67]
[3,"Frederico Papatella",30,120,"00:01:02.533",60.45]
[3,"Frederico Papatella",30,120,"00:01:02.323",60.65]
[3,"Frederico Papatella",30,120,"00:01:02.326",60.65]
[3,"Frederico Papatella",30,120,"00:01:02.431",60.55]
[3,"Frederico Papatella",30,120,"00:01:01.877",61.09]
[3,"Frederico Papatella",30,120,"00:01:02.019",60.95]
[3,"Alexandre Melillo",30,111,"00:01:14.567",50.69]
[3,"Alexandre Melillo",30,111,"00:01:17.503",48.77]
[3,"Alexandre Melillo",30,111,"00:01:04.424",58.67]
[3,"Alexandre Melillo",30,111,"00:01:02.119",60.85]
[3,"Alexandre Melillo",30,111,"00:01:01.809",61.16]
[3,"Alexandre Melillo",30,111,"00:01:02.197",60.77]
[3,"Alexandre Melillo",30,111,"00:01:02.402",60.57]
[3,"Alexandre Melillo",30,111,"00:01:01.789",61.18]
[3,"Alexandre Melillo",30,111,"00:01:01.806",61.16]
[3,"Alexandre Melillo",30,111,"00:01:01.576",61.39]
[3,"Alexandre Melillo",30,111,"00:01:01.732",61.23]
[3,"Alexandre Melillo",30,111,"00:01:01.567",61.4]
[3,"Alexandre Melillo",30,111,"00:01:01.608",61.36]
[3,"Alexandre Melillo",30,111,"00:01:02.606",60.38]
[3,"Alexandre Melillo",30,111,"00:01:02.553",60.43]
[3,"Alexandre Melillo",30,111,"00:01:01.928",61.04]
[3,"Alexandre Melillo",30,111,"00:01:01.579",61.38]
[3,"Alexandre Melillo",30,111,"00:01:01.221",61.74]
[3,"Alexandre Melillo",30,111,"00:01:01.808",61.16]
[3,"Alexandre Melillo",30,111,"00:01:01.186",61.78]
[3,"Alexandre Melillo",30,111,"00:01:01.405",61.56]
[3,"Alexandre Melillo",30,111,"00:01:02.291",60.68]
[3,"Alexandre Melillo",30,111,"00:01:01.265",61.7]
[3,"Alexandre Melillo",30,111,"00:01:01.395",61.57]
[3,"Alexandre Melillo",30,111,"00:01:02.731",60.26]
[3,"Alexandre Melillo",30,111,"00:01:02.179",60.79]
[3,"Alexandre Melillo",30,111,"00:01:02.154",60.82]
[3,"Alexandre Melillo",30,111,"00:01:04.239",58.84]
[3,"Alexandre Melillo",30,111,"00:01:01.971",61]
[3,"Alexandre Melillo",30,111,"00:01:03.396",59.63]
[3,"Raphael Reis",30,149,"00:01:08.401",55.26]
[3,"Raphael Reis",30,149,"00:01:03.291",59.72]
[3,"Raphael Reis",30,149,"00:01:03.230",59.78]
[3,"Raphael Reis",30,149,"00:01:02.993",60.01]
[3,"Raphael Reis",30,149,"00:01:02.933",60.06]
[3,"Raphael Reis",30,149,"00:01:02.561",60.42]
[3,"Raphael Reis",30,149,"00:01:02.564",60.42]
[3,"Raphael Reis",30,149,"00:01:02.997",60]
[3,"Raphael Reis",30,149,"00:01:02.860",60.13]
[3,"Raphael Reis",30,149,"00:01:02.865",60.13]
[3,"Raphael Reis",30,149,"00:01:02.004",60.96]
[3,"Raphael Reis",30,149,"00:01:02.544",60.44]
[3,"Raphael Reis",30,149,"00:01:02.910",60.09]
[3,"Raphael Reis",30,149,"00:01:02.520",60.46]
[3,"Raphael Reis",30,149,"00:01:02.596",60.39]
[3,"Raphael Reis",30,149,"00:01:02.344",60.63]
[3,"Raphael Reis",30,149,"00:01:02.293",60.68]
[3,"Raphael Reis",30,149,"00:01:02.794",60.2]
[3,"Raphael Reis",30,149,"00:01:02.641",60.34]
[3,"Raphael Reis",30,149,"00:01:02.688",60.3]
[3,"Raphael Reis",30,149,"00:01:02.442",60.54]
[3,"Raphael Reis",30,149,"00:01:02.559",60.42]
[3,"Raphael Reis",30,149,"00:01:02.596",60.39]
[3,"Raphael Reis",30,149,"00:01:02.970",60.03]
[3,"Raphael Reis",30,149,"00:01:02.947",60.05]
[3,"Raphael Reis",30,149,"00:01:03.259",59.75]
[3,"Raphael Reis",30,149,"00:01:02.986",60.01]
[3,"Raphael Reis",30,149,"00:01:03.366",59.65]
[3,"Raphael Reis",30,149,"00:01:02.460",60.52]
[3,"Raphael Reis",30,149,"00:01:04.317",58.77]
[3,"GUILHERME RUAS",30,142,"00:01:10.249",53.81]
[3,"GUILHERME RUAS",30,142,"00:01:04.995",58.16]
[3,"GUILHERME RUAS",30,142,"00:01:04.116",58.96]
[3,"GUILHERME RUAS",30,142,"00:01:02.775",60.22]
[3,"GUILHERME RUAS",30,142,"00:01:03.712",59.33]
[3,"GUILHERME RUAS",30,142,"00:01:01.949",61.02]
[3,"GUILHERME RUAS",30,142,"00:01:02.411",60.57]
[3,"GUILHERME RUAS",30,142,"00:01:03.956",59.1]
[3,"GUILHERME RUAS",30,142,"00:01:03.468",59.56]
[3,"GUILHERME RUAS",30,142,"00:01:02.008",60.96]
[3,"GUILHERME RUAS",30,142,"00:01:03.487",59.54]
[3,"GUILHERME RUAS",30,142,"00:01:02.406",60.57]
[3,"GUILHERME RUAS",30,142,"00:01:02.266",60.71]
[3,"GUILHERME RUAS",30,142,"00:01:02.787",60.2]
[3,"GUILHERME RUAS",30,142,"00:01:01.957",61.01]
[3,"GUILHERME RUAS",30,142,"00:01:02.068",60.9]
[3,"GUILHERME RUAS",30,142,"00:01:02.283",60.69]
[3,"GUILHERME RUAS",30,142,"00:01:02.364",60.61]
[3,"GUILHERME RUAS",30,142,"00:01:02.137",60.83]
[3,"GUILHERME RUAS",30,142,"00:01:01.981",60.99]
[3,"GUILHERME RUAS",30,142,"00:01:02.358",60.62]
[3,"GUILHERME RUAS",30,142,"00:01:01.748",61.22]
[3,"GUILHERME RUAS",30,142,"00:01:01.792",61.17]
[3,"GUILHERME RUAS",30,142,"00:01:02.266",60.71]
[3,"GUILHERME RUAS",30,142,"00:01:01.945",61.02]
[3,"GUILHERME RUAS",30,142,"00:01:03.733",59.31]
[3,"GUILHERME RUAS",30,142,"00:01:02.413",60.56]
[3,"GUILHERME RUAS",30,142,"00:01:03.408",59.61]
[3,"GUILHERME RUAS",30,142,"00:01:02.120",60.85]
[3,"GUILHERME RUAS",30,142,"00:01:04.415",58.68]
[3,"Tati Marcondes",30,138,"00:01:08.130",55.48]
[3,"Tati Marcondes",30,138,"00:01:03.465",59.56]
[3,"Tati Marcondes",30,138,"00:01:03.488",59.54]
[3,"Tati Marcondes",30,138,"00:01:03.541",59.49]
[3,"Tati Marcondes",30,138,"00:01:03.148",59.86]
[3,"Tati Marcondes",30,138,"00:01:02.221",60.75]
[3,"Tati Marcondes",30,138,"00:01:02.614",60.37]
[3,"Tati Marcondes",30,138,"00:01:03.420",59.6]
[3,"Tati Marcondes",30,138,"00:01:02.326",60.65]
[3,"Tati Marcondes",30,138,"00:01:02.022",60.95]
[3,"Tati Marcondes",30,138,"00:01:02.072",60.9]
[3,"Tati Marcondes",30,138,"00:01:04.116",58.96]
[3,"Tati Marcondes",30,138,"00:01:03.379",59.64]
[3,"Tati Marcondes",30,138,"00:01:02.040",60.93]
[3,"Tati Marcondes",30,138,"00:01:02.249",60.72]
[3,"Tati Marcondes",30,138,"00:01:02.242",60.73]
[3,"Tati Marcondes",30,138,"00:01:01.836",61.13]
[3,"Tati Marcondes",30,138,"00:01:02.535",60.45]
[3,"Tati Marcondes",30,138,"00:01:02.668",60.32]
[3,"Tati Marcondes",30,138,"00:01:03.180",59.83]
[3,"Tati Marcondes",30,138,"00:01:02.540",60.44]
[3,"Tati Marcondes",30,138,"00:01:01.985",60.98]
[3,"Tati Marcondes",30,138,"00:01:02.305",60.67]
[3,"Tati Marcondes",30,138,"00:01:02.543",60.44]
[3,"Tati Marcondes",30,138,"00:01:02.307",60.67]
[3,"Tati Marcondes",30,138,"00:01:04.516",58.59]
[3,"Tati Marcondes",30,138,"00:01:02.442",60.54]
[3,"Tati Marcondes",30,138,"00:01:03.966",59.09]
[3,"Tati Marcondes",30,138,"00:01:03.441",59.58]
[3,"Tati Marcondes",30,138,"00:01:03.335",59.68]
[3,"Jarbas Reis",30,155,"00:01:12.127",52.41]
[3,"Jarbas Reis",30,155,"00:01:03.447",59.58]
[3,"Jarbas Reis",30,155,"00:01:02.750",60.24]
[3,"Jarbas Reis",30,155,"00:01:02.725",60.26]
[3,"Jarbas Reis",30,155,"00:01:03.722",59.32]
[3,"Jarbas Reis",30,155,"00:01:03.301",59.71]
[3,"Jarbas Reis",30,155,"00:01:02.248",60.72]
[3,"Jarbas Reis",30,155,"00:01:02.529",60.45]
[3,"Jarbas Reis",30,155,"00:01:02.224",60.75]
[3,"Jarbas Reis",30,155,"00:01:01.817",61.15]
[3,"Jarbas Reis",30,155,"00:01:01.949",61.02]
[3,"Jarbas Reis",30,155,"00:01:04.632",58.48]
[3,"Jarbas Reis",30,155,"00:01:03.940",59.12]
[3,"Jarbas Reis",30,155,"00:01:02.265",60.71]
[3,"Jarbas Reis",30,155,"00:01:02.118",60.85]
[3,"Jarbas Reis",30,155,"00:01:02.053",60.92]
[3,"Jarbas Reis",30,155,"00:01:01.964",61]
[3,"Jarbas Reis",30,155,"00:01:01.823",61.14]
[3,"Jarbas Reis",30,155,"00:01:02.271",60.7]
[3,"Jarbas Reis",30,155,"00:01:03.158",59.85]
[3,"Jarbas Reis",30,155,"00:01:02.803",60.19]
[3,"Jarbas Reis",30,155,"00:01:01.926",61.04]
[3,"Jarbas Reis",30,155,"00:01:02.369",60.61]
[3,"Jarbas Reis",30,155,"00:01:03.162",59.85]
[3,"Jarbas Reis",30,155,"00:01:03.174",59.83]
[3,"Jarbas Reis",30,155,"00:01:03.138",59.87]
[3,"Jarbas Reis",30,155,"00:01:03.099",59.91]
[3,"Jarbas Reis",30,155,"00:01:03.121",59.88]
[3,"Jarbas Reis",30,155,"00:01:02.930",60.07]
[3,"Jarbas Reis",30,155,"00:01:04.841",58.3]
[3,"Hélio Chagas",30,141,"00:01:09.034",54.76]
[3,"Hélio Chagas",30,141,"00:01:03.614",59.42]
[3,"Hélio Chagas",30,141,"00:01:04.180",58.9]
[3,"Hélio Chagas",30,141,"00:01:04.397",58.7]
[3,"Hélio Chagas",30,141,"00:01:02.771",60.22]
[3,"Hélio Chagas",30,141,"00:01:02.643",60.34]
[3,"Hélio Chagas",30,141,"00:01:03.085",59.92]
[3,"Hélio Chagas",30,141,"00:01:03.626",59.41]
[3,"Hélio Chagas",30,141,"00:01:02.965",60.03]
[3,"Hélio Chagas",30,141,"00:01:02.799",60.19]
[3,"Hélio Chagas",30,141,"00:01:03.511",59.52]
[3,"Hélio Chagas",30,141,"00:01:02.979",60.02]
[3,"Hélio Chagas",30,141,"00:01:01.979",60.99]
[3,"Hélio Chagas",30,141,"00:01:02.889",60.11]
[3,"Hélio Chagas",30,141,"00:01:02.762",60.23]
[3,"Hélio Chagas",30,141,"00:01:02.455",60.52]
[3,"Hélio Chagas",30,141,"00:01:01.978",60.99]
[3,"Hélio Chagas",30,141,"00:01:01.939",61.03]
[3,"Hélio Chagas",30,141,"00:01:02.244",60.73]
[3,"Hélio Chagas",30,141,"00:01:02.026",60.94]
[3,"Hélio Chagas",30,141,"00:01:02.681",60.31]
[3,"Hélio Chagas",30,141,"00:01:03.245",59.77]
[3,"Hélio Chagas",30,141,"00:01:02.229",60.74]
[3,"Hélio Chagas",30,141,"00:01:02.759",60.23]
[3,"Hélio Chagas",30,141,"00:01:03.032",59.97]
[3,"Hélio Chagas",30,141,"00:01:02.784",60.21]
[3,"Hélio Chagas",30,141,"00:01:02.500",60.48]
[3,"Hélio Chagas",30,141,"00:01:02.726",60.26]
[3,"Hélio Chagas",30,141,"00:01:02.681",60.31]
[3,"Hélio Chagas",30,141,"00:01:03.456",59.57]
[3,"Cláudio Naves",30,128,"00:01:13.613",51.35]
[3,"Cláudio Naves",30,128,"00:01:03.380",59.64]
[3,"Cláudio Naves",30,128,"00:01:03.316",59.7]
[3,"Cláudio Naves",30,128,"00:01:02.825",60.17]
[3,"Cláudio Naves",30,128,"00:01:01.939",61.03]
[3,"Cláudio Naves",30,128,"00:01:01.908",61.06]
[3,"Cláudio Naves",30,128,"00:01:02.396",60.58]
[3,"Cláudio Naves",30,128,"00:01:03.395",59.63]
[3,"Cláudio Naves",30,128,"00:01:03.194",59.82]
[3,"Cláudio Naves",30,128,"00:01:07.005",56.41]
[3,"Cláudio Naves",30,128,"00:01:02.896",60.1]
[3,"Cláudio Naves",30,128,"00:01:02.505",60.48]
[3,"Cláudio Naves",30,128,"00:01:01.953",61.01]
[3,"Cláudio Naves",30,128,"00:01:03.220",59.79]
[3,"Cláudio Naves",30,128,"00:01:03.227",59.78]
[3,"Cláudio Naves",30,128,"00:01:02.836",60.16]
[3,"Cláudio Naves",30,128,"00:01:01.673",61.29]
[3,"Cláudio Naves",30,128,"00:01:02.446",60.53]
[3,"Cláudio Naves",30,128,"00:01:02.349",60.63]
[3,"Cláudio Naves",30,128,"00:01:03.439",59.58]
[3,"Cláudio Naves",30,128,"00:01:02.592",60.39]
[3,"Cláudio Naves",30,128,"00:01:02.023",60.95]
[3,"Cláudio Naves",30,128,"00:01:02.741",60.25]
[3,"Cláudio Naves",30,128,"00:01:02.323",60.65]
[3,"Cláudio Naves",30,128,"00:01:02.402",60.57]
[3,"Cláudio Naves",30,128,"00:01:02.470",60.51]
[3,"Cláudio Naves",30,128,"00:01:02.504",60.48]
[3,"Cláudio Naves",30,128,"00:01:03.229",59.78]
[3,"Cláudio Naves",30,128,"00:01:02.696",60.29]
[3,"Cláudio Naves",30,128,"00:01:02.081",60.89]
[3,"Izabella Rodrigues",30,106,"00:01:09.336",54.52]
[3,"Izabella Rodrigues",30,106,"00:01:23.990",45.01]
[3,"Izabella Rodrigues",30,106,"00:01:02.580",60.4]
[3,"Izabella Rodrigues",30,106,"00:01:03.307",59.71]
[3,"Izabella Rodrigues",30,106,"00:01:03.724",59.32]
[3,"Izabella Rodrigues",30,106,"00:01:02.166",60.8]
[3,"Izabella Rodrigues",30,106,"00:01:02.426",60.55]
[3,"Izabella Rodrigues",30,106,"00:01:02.513",60.47]
[3,"Izabella Rodrigues",30,106,"00:01:02.274",60.7]
[3,"Izabella Rodrigues",30,106,"00:01:02.386",60.59]
[3,"Izabella Rodrigues",30,106,"00:01:02.344",60.63]
[3,"Izabella Rodrigues",30,106,"00:01:01.968",61]
[3,"Izabella Rodrigues",30,106,"00:01:01.858",61.11]
[3,"Izabella Rodrigues",30,106,"00:01:02.346",60.63]
[3,"Izabella Rodrigues",30,106,"00:01:02.869",60.13]
[3,"Izabella Rodrigues",30,106,"00:01:02.552",60.43]
[3,"Izabella Rodrigues",30,106,"00:01:02.198",60.77]
[3,"Izabella Rodrigues",30,106,"00:01:02.195",60.78]
[3,"Izabella Rodrigues",30,106,"00:01:02.182",60.79]
[3,"Izabella Rodrigues",30,106,"00:01:02.097",60.87]
[3,"Izabella Rodrigues",30,106,"00:01:02.373",60.6]
[3,"Izabella Rodrigues",30,106,"00:01:02.013",60.95]
[3,"Izabella Rodrigues",30,106,"00:01:01.662",61.3]
[3,"Izabella Rodrigues",30,106,"00:01:02.433",60.54]
[3,"Izabella Rodrigues",30,106,"00:01:02.100",60.87]
[3,"Izabella Rodrigues",30,106,"00:01:01.970",61]
[3,"Izabella Rodrigues",30,106,"00:01:02.224",60.75]
[3,"Izabella Rodrigues",30,106,"00:01:02.078",60.89]
[3,"Izabella Rodrigues",30,106,"00:01:02.455",60.52]
[3,"Izabella Rodrigues",30,106,"00:01:05.698",57.54]
[3,"Marcelo Sant'anna",29,121,"00:01:08.504",55.18]
[3,"Marcelo Sant'anna",29,121,"00:01:03.771",59.27]
[3,"Marcelo Sant'anna",29,121,"00:01:05.398",57.8]
[3,"Marcelo Sant'anna",29,121,"00:01:06.495",56.85]
[3,"Marcelo Sant'anna",29,121,"00:01:03.456",59.57]
[3,"Marcelo Sant'anna",29,121,"00:01:03.094",59.91]
[3,"Marcelo Sant'anna",29,121,"00:01:02.819",60.17]
[3,"Marcelo Sant'anna",29,121,"00:01:02.772",60.22]
[3,"Marcelo Sant'anna",29,121,"00:01:02.900",60.1]
[3,"Marcelo Sant'anna",29,121,"00:01:02.767",60.22]
[3,"Marcelo Sant'anna",29,121,"00:01:03.435",59.59]
[3,"Marcelo Sant'anna",29,121,"00:01:04.033",59.03]
[3,"Marcelo Sant'anna",29,121,"00:01:03.389",59.63]
[3,"Marcelo Sant'anna",29,121,"00:01:03.364",59.66]
[3,"Marcelo Sant'anna",29,121,"00:01:03.015",59.99]
[3,"Marcelo Sant'anna",29,121,"00:01:02.796",60.19]
[3,"Marcelo Sant'anna",29,121,"00:01:02.393",60.58]
[3,"Marcelo Sant'anna",29,121,"00:01:02.710",60.28]
[3,"Marcelo Sant'anna",29,121,"00:01:02.329",60.65]
[3,"Marcelo Sant'anna",29,121,"00:01:03.308",59.71]
[3,"Marcelo Sant'anna",29,121,"00:01:02.876",60.12]
[3,"Marcelo Sant'anna",29,121,"00:01:02.771",60.22]
[3,"Marcelo Sant'anna",29,121,"00:01:02.711",60.28]
[3,"Marcelo Sant'anna",29,121,"00:01:02.775",60.22]
[3,"Marcelo Sant'anna",29,121,"00:01:03.390",59.63]
[3,"Marcelo Sant'anna",29,121,"00:01:02.727",60.26]
[3,"Marcelo Sant'anna",29,121,"00:01:02.913",60.08]
[3,"Marcelo Sant'anna",29,121,"00:01:02.447",60.53]
[3,"Marcelo Sant'anna",29,121,"00:01:03.191",59.82]
[3,"JOSEPH SCHIOPPO",29,101,"00:01:09.796",54.16]
[3,"JOSEPH SCHIOPPO",29,101,"00:01:17.383",48.85]
[3,"JOSEPH SCHIOPPO",29,101,"00:01:05.322",57.87]
[3,"JOSEPH SCHIOPPO",29,101,"00:01:02.999",60]
[3,"JOSEPH SCHIOPPO",29,101,"00:01:02.024",60.94]
[3,"JOSEPH SCHIOPPO",29,101,"00:01:02.679",60.31]
[3,"JOSEPH SCHIOPPO",29,101,"00:01:03.669",59.37]
[3,"JOSEPH SCHIOPPO",29,101,"00:01:02.589",60.39]
[3,"JOSEPH SCHIOPPO",29,101,"00:01:02.201",60.77]
[3,"JOSEPH SCHIOPPO",29,101,"00:01:09.074",54.72]
[3,"JOSEPH SCHIOPPO",29,101,"00:01:02.134",60.84]
[3,"JOSEPH SCHIOPPO",29,101,"00:01:02.006",60.96]
[3,"JOSEPH SCHIOPPO",29,101,"00:01:02.111",60.86]
[3,"JOSEPH SCHIOPPO",29,101,"00:01:02.183",60.79]
[3,"JOSEPH SCHIOPPO",29,101,"00:01:02.291",60.68]
[3,"JOSEPH SCHIOPPO",29,101,"00:01:02.145",60.83]
[3,"JOSEPH SCHIOPPO",29,101,"00:01:02.254",60.72]
[3,"JOSEPH SCHIOPPO",29,101,"00:01:02.277",60.7]
[3,"JOSEPH SCHIOPPO",29,101,"00:01:03.010",59.99]
[3,"JOSEPH SCHIOPPO",29,101,"00:01:02.514",60.47]
[3,"JOSEPH SCHIOPPO",29,101,"00:01:02.545",60.44]
[3,"JOSEPH SCHIOPPO",29,101,"00:01:02.867",60.13]
[3,"JOSEPH SCHIOPPO",29,101,"00:01:03.810",59.24]
[3,"JOSEPH SCHIOPPO",29,101,"00:01:03.195",59.81]
[3,"JOSEPH SCHIOPPO",29,101,"00:01:02.987",60.01]
[3,"JOSEPH SCHIOPPO",29,101,"00:01:02.699",60.29]
[3,"JOSEPH SCHIOPPO",29,101,"00:01:02.250",60.72]
[3,"JOSEPH SCHIOPPO",29,101,"00:01:04.066",59]
[3,"JOSEPH SCHIOPPO",29,101,"00:01:03.206",59.8]
[3,"Jucimar Vieira",29,152,"00:01:07.355",56.12]
[3,"Jucimar Vieira",29,152,"00:01:03.881",59.17]
[3,"Jucimar Vieira",29,152,"00:01:03.400",59.62]
[3,"Jucimar Vieira",29,152,"00:01:03.780",59.27]
[3,"Jucimar Vieira",29,152,"00:01:18",48.46]
[3,"Jucimar Vieira",29,152,"00:01:03.878",59.18]
[3,"Jucimar Vieira",29,152,"00:01:02.995",60]
[3,"Jucimar Vieira",29,152,"00:01:03.251",59.76]
[3,"Jucimar Vieira",29,152,"00:01:03.078",59.93]
[3,"Jucimar Vieira",29,152,"00:01:03.580",59.45]
[3,"Jucimar Vieira",29,152,"00:01:02.936",60.06]
[3,"Jucimar Vieira",29,152,"00:01:02.934",60.06]
[3,"Jucimar Vieira",29,152,"00:01:02.615",60.37]
[3,"Jucimar Vieira",29,152,"00:01:02.400",60.58]
[3,"Jucimar Vieira",29,152,"00:01:12.128",52.41]
[3,"Jucimar Vieira",29,152,"00:01:02.796",60.19]
[3,"Jucimar Vieira",29,152,"00:01:03.326",59.69]
[3,"Jucimar Vieira",29,152,"00:01:03.168",59.84]
[3,"Jucimar Vieira",29,152,"00:01:02.763",60.23]
[3,"Jucimar Vieira",29,152,"00:01:03.027",59.97]
[3,"Jucimar Vieira",29,152,"00:01:02.997",60]
[3,"Jucimar Vieira",29,152,"00:01:02.920",60.08]
[3,"Jucimar Vieira",29,152,"00:01:03.605",59.43]
[3,"Jucimar Vieira",29,152,"00:01:10.015",53.99]
[3,"Jucimar Vieira",29,152,"00:01:10.872",53.34]
[3,"Jucimar Vieira",29,152,"00:01:03.399",59.62]
[3,"Jucimar Vieira",29,152,"00:01:03.430",59.59]
[3,"Jucimar Vieira",29,152,"00:01:03.319",59.7]
[3,"Jucimar Vieira",29,152,"00:01:02.961",60.04]
[3,"Reila Ricardo",29,154,"00:01:13.068",51.73]
[3,"Reila Ricardo",29,154,"00:01:05.454",57.75]
[3,"Reila Ricardo",29,154,7.4149305555555557E-4,59]
[3,"Reila Ricardo",29,154,7.3799768518518528E-4,59.28]
[3,"Reila Ricardo",29,154,7.3008101851851847E-4,59.92]
[3,"Reila Ricardo",29,154,7.2884259259259267E-4,60.03]
[3,"Reila Ricardo",29,154,7.2870370370370363E-4,60.04]
[3,"Reila Ricardo",29,154,7.2591435185185183E-4,60.27]
[3,"Reila Ricardo",29,154,7.269560185185186E-4,60.18]
[3,"Reila Ricardo",29,154,7.2749999999999996E-4,60.14]
[3,"Reila Ricardo",29,154,7.2462962962962976E-4,60.38]
[3,"Reila Ricardo",29,154,7.3252314814814805E-4,59.73]
[3,"Reila Ricardo",29,154,7.1979166666666665E-4,60.78]
[3,"Reila Ricardo",29,154,7.4802083333333329E-4,58.49]
[3,"Reila Ricardo",29,154,7.2909722222222223E-4,60.01]
[3,"Reila Ricardo",29,154,7.3317129629629633E-4,59.67]
[3,"Reila Ricardo",29,154,7.2618055555555554E-4,60.25]
[3,"Reila Ricardo",29,154,7.2674768518518531E-4,60.2]
[3,"Reila Ricardo",29,154,7.2616898148148139E-4,60.25]
[3,"Reila Ricardo",29,154,7.5947916666666666E-4,57.61]
[3,"Reila Ricardo",29,154,7.2927083333333318E-4,59.99]
[3,"Reila Ricardo",29,154,7.2399305555555552E-4,60.43]
[3,"Reila Ricardo",29,154,7.2827546296296301E-4,60.07]
[3,"Reila Ricardo",29,154,7.3174768518518511E-4,59.79]
[3,"Reila Ricardo",29,154,7.2922453703703702E-4,60]
[3,"Reila Ricardo",29,154,7.6359953703703702E-4,57.29]
[3,"Reila Ricardo",29,154,1.0844328703703704E-3,40.340000000000003]
[3,"Reila Ricardo",29,154,7.3224537037037041E-4,59.75]
[3,"Reila Ricardo",29,154,7.2923611111111117E-4,59.99]
[3,"Roberta Epifânio",28,115,9.2197916666666676E-4,47.45]
[3,"Roberta Epifânio",28,115,7.7592592592592589E-4,56.38]
[3,"Roberta Epifânio",28,115,7.6101851851851862E-4,57.49]
[3,"Roberta Epifânio",28,115,7.6975694444444444E-4,56.84]
[3,"Roberta Epifânio",28,115,7.5679398148148145E-4,57.81]
[3,"Roberta Epifânio",28,115,7.6103009259259255E-4,57.49]
[3,"Roberta Epifânio",28,115,7.5387731481481486E-4,58.03]
[3,"Roberta Epifânio",28,115,7.5965277777777782E-4,57.59]
[3,"Roberta Epifânio",28,115,7.5423611111111123E-4,58.01]
[3,"Roberta Epifânio",28,115,7.3953703703703692E-4,59.16]
[3,"Roberta Epifânio",28,115,7.3983796296296287E-4,59.13]
[3,"Roberta Epifânio",28,115,7.5834490740740734E-4,57.69]
[3,"Roberta Epifânio",28,115,7.4827546296296306E-4,58.47]
[3,"Roberta Epifânio",28,115,7.4107638888888888E-4,59.04]
[3,"Roberta Epifânio",28,115,7.6412037037037041E-4,57.26]
[3,"Roberta Epifânio",28,115,7.7682870370370373E-4,56.32]
[3,"Roberta Epifânio",28,115,7.6876157407407416E-4,56.91]
[3,"Roberta Epifânio",28,115,7.5645833333333327E-4,57.84]
[3,"Roberta Epifânio",28,115,7.6780092592592579E-4,56.98]
[3,"Roberta Epifânio",28,115,7.8646990740740728E-4,55.63]
[3,"Roberta Epifânio",28,115,7.496296296296296E-4,58.36]
[3,"Roberta Epifânio",28,115,7.6625E-4,57.1]
[3,"Roberta Epifânio",28,115,7.4587962962962965E-4,58.66]
[3,"Roberta Epifânio",28,115,7.5282407407407416E-4,58.11]
[3,"Roberta Epifânio",28,115,7.8532407407407414E-4,55.71]
[3,"Roberta Epifânio",28,115,7.4081018518518517E-4,59.06]
[3,"Roberta Epifânio",28,115,7.3649305555555566E-4,59.4]
[3,"Roberta Epifânio",28,115,7.3717592592592595E-4,59.35]

{"sheet":"ETAPA 2","index":9,"n_rows":2051,"n_cols":15,"rows_kept":2051,"cut":false,"hidden":false,"merged":[[0,0,0,5]]}
["Obs.: 1. Selecione o nome de um Piloto, 2. Com a tecla Ctrl pressionada, Selecione o seu nome e  3. Clique sobre o Gráfico (Habilite a macro)\n            Para as demais comparações Selecione o nome do Piloto e Clique sobre o Gráfico",null,null,null,null,null,"PILOTO",{"$f":"L$48","v":"Cláudio Dumont"},{"$f":"M$48","v":"Marcelo Pereira"},{"$f":"A2","v":"Wesley Bambirra"},null,null,"00:00:01"]
["Wesley Bambirra",null,null,null,null,null,"MÉDIA",{"$f":"AVERAGE(L$49:L$105)","v":"00:01:06.474"},{"$f":"AVERAGE(M$49:M$105)","v":"00:01:06.641"},{"$f":"AVERAGE(N$49:N$105)","v":"00:01:06.263"},null,null,{"$f":"M1","v":"00:00:01"}]
["Cláudio Dumont",null,null,null,null,null,"MAXIMA",{"$f":"LARGE(L$49:L$105,1)","v":"00:01:10.678"},{"$f":"LARGE(M$49:M$105,1)","v":"00:01:12.395"},{"$f":"LARGE(N$49:N$105,1)","v":"00:01:11.388"}]
["Marcelo Pereira",null,null,null,null,null,"MÍNIMA",{"$f":"SMALL(L$49:L$105,1)","v":"00:01:05.673"},{"$f":"SMALL(M$49:M$105,1)","v":"00:01:05.769"},{"$f":"SMALL(N$49:N$105,1)","v":"00:01:05.677"}]
["Daniel Nahum",null,null,null,null,null,"Desvio Padrão",{"$f":"_xlfn.STDEV.S(L$50:L$130)","v":"00:00:00.914"},{"$f":"_xlfn.STDEV.S(M$50:M$130)","v":"00:00:01.323"},{"$f":"_xlfn.STDEV.S(N$50:N$130)","v":"00:00:01.069"}]
["Rodrigo Mercadante",null,null,null,null,null,"TEMPO TOTAL",{"$f":"SUM(L$49:L$105,1)","v":1.0207730092592593},{"$f":"SUM(M$49:M$105,1)","v":1.0208252777777778},{"$f":"SUM(N$49:N$105,1)","v":1.0207070486111112}]
["Jarbas Reis"]
["Marcelo Marcondes"]
["Marcelo Campos"]
["Maurício Júnior"]
["Wesley Canuto"]
["Marcelo Sant'anna"]
["Guilherme Alves",null,null,null,null,null,null,null,null,{"$f":"SMALL(H4:J4,1)-K13","v":"00:01:05.423"},"00:00:00.250"]
["Alexandre Melillo",null,null,null,null,null,null,null,null,{"$f":"LARGE(H3:J3,1)+K13","v":"00:01:12.645"}]
["Marcelo Surerus"]
["Frederico Papatella"]
["Rodrigo Ricardo"]
["Guilherme Ruas"]
["Marcelo Clemente"]
["Reila Ricardo"]
["Délcio Ragazzi"]
["Jucimar Vieira"]
["Lucas Guimarães"]
["Luciano Robervine"]
["Raphael Reis"]
["Hélio Chagas"]
["Renato Amaral"]
["Leandro Malias"]
["Tati Marcondes"]
["Cláudio Naves"]
["Roberta Pifânio"]
["Pedro Mello"]
["Eduardo Henrique"]
["Marcelo Chagas"]
[]
[]
[]
[]
[]
[]
[]
[]
[]
[]
[]
[]
[]
[null,null,null,null,null,null,null,null,null,null,null,"Cláudio Dumont","Marcelo Pereira","Wesley Bambirra"]
[null,null,null,null,null,null,null,null,null,null,"NÚMERO VOLTAS","Cláudio Dumont","Marcelo Pereira","Wesley Bambirra"]
["ETAPA","PILOTO","NÚMERO VOLTAS","KART","Volta Tm","velocidade Media",null,null,null,null,1,"00:01:10.678","00:01:12.395","00:01:11.388"]
[2,"Wesley Bambirra",27,"110","00:01:11.388","55,47km/h",null,null,null,null,2,"00:01:06.772","00:01:08.667","00:01:06.996"]
[2,"Wesley Bambirra",27,"110","00:01:06.996","59,11km/h",null,null,null,null,3,"00:01:06.340","00:01:06.792","00:01:06.013"]
[2,"Wesley Bambirra",27,"110","00:01:06.013","59,99km/h",null,null,null,null,4,"00:01:06.250","00:01:06.290","00:01:06.069"]
[2,"Wesley Bambirra",27,"110","00:01:06.069","59,94km/h",null,null,null,null,5,"00:01:06.642","00:01:05.769","00:01:06.381"]
[2,"Wesley Bambirra",27,"110","00:01:06.381","59,66km/h",null,null,null,null,6,"00:01:05.972","00:01:06.724","00:01:06.009"]
[2,"Wesley Bambirra",27,"110","00:01:06.009","59,99km/h",null,null,null,null,7,"00:01:06.182","00:01:06.473","00:01:05.882"]
[2,"Wesley Bambirra",27,"110","00:01:05.882","60,11km/h",null,null,null,null,8,"00:01:05.673","00:01:05.914","00:01:05.827"]
[2,"Wesley Bambirra",27,"110","00:01:05.827","60,16km/h",null,null,null,null,9,"00:01:05.995","00:01:05.913","00:01:05.909"]
[2,"Wesley Bambirra",27,"110","00:01:05.909","60,08km/h",null,null,null,null,10,"00:01:05.788","00:01:06.015","00:01:05.951"]
[2,"Wesley Bambirra",27,"110","00:01:05.951","60,04km/h",null,null,null,null,11,"00:01:06.093","00:01:06.029","00:01:05.933"]
[2,"Wesley Bambirra",27,"110","00:01:05.933","60,06km/h",null,null,null,null,12,"00:01:06.281","00:01:06.223","00:01:05.931"]
[2,"Wesley Bambirra",27,"110","00:01:05.931","60,06km/h",null,null,null,null,13,"00:01:06.042","00:01:06.134","00:01:05.724"]
[2,"Wesley Bambirra",27,"110","00:01:05.724","60,25km/h",null,null,null,null,14,"00:01:06.248","00:01:05.947","00:01:05.677"]
[2,"Wesley Bambirra",27,"110","00:01:05.677","60,3km/h",null,null,null,null,15,"00:01:06.608","00:01:06.396","00:01:05.931"]
[2,"Wesley Bambirra",27,"110","00:01:05.931","60,06km/h",null,null,null,null,16,"00:01:06.647","00:01:06.419","00:01:05.902"]
[2,"Wesley Bambirra",27,"110","00:01:05.902","60,09km/h",null,null,null,null,17,"00:01:06.347","00:01:06.176","00:01:06.045"]
[2,"Wesley Bambirra",27,"110","00:01:06.045","59,96km/h",null,null,null,null,18,"00:01:06.151","00:01:06.169","00:01:05.997"]
[2,"Wesley Bambirra",27,"110","00:01:05.997","60km/h",null,null,null,null,19,"00:01:06.324","00:01:06.258","00:01:06.207"]
[2,"Wesley Bambirra",27,"110","00:01:06.207","59,81km/h",null,null,null,null,20,"00:01:06.122","00:01:06.318","00:01:05.925"]
[2,"Wesley Bambirra",27,"110","00:01:05.925","60,07km/h",null,null,null,null,21,"00:01:06.924","00:01:06.192","00:01:06.051"]
[2,"Wesley Bambirra",27,"110","00:01:06.051","59,95km/h",null,null,null,null,22,"00:01:06.142","00:01:06.279","00:01:06.533"]
[2,"Wesley Bambirra",27,"110","00:01:06.533","59,52km/h",null,null,null,null,23,"00:01:06.444","00:01:06.305","00:01:05.952"]
[2,"Wesley Bambirra",27,"110","00:01:05.952","60,04km/h",null,null,null,null,24,"00:01:06.199","00:01:06.191","00:01:06.152"]
[2,"Wesley Bambirra",27,"110","00:01:06.152","59,86km/h",null,null,null,null,25,"00:01:06.039","00:01:06.273","00:01:05.897"]
[2,"Wesley Bambirra",27,"110","00:01:05.897","60,09km/h",null,null,null,null,26,"00:01:06.484","00:01:08.373","00:01:06.871"]
[2,"Wesley Bambirra",27,"110","00:01:06.871","59,22km/h",null,null,null,null,27,"00:01:07.401","00:01:06.670","00:01:05.936"]
[2,"Wesley Bambirra",27,"110","00:01:05.936","60,06km/h",null,null,null,null,28]
[2,"Cláudio Dumont",27,"144","00:01:10.678","56,03km/h",null,null,null,null,29]
[2,"Cláudio Dumont",27,"144","00:01:06.772","59,31km/h",null,null,null,null,30]
[2,"Cláudio Dumont",27,"144","00:01:06.340","59,69km/h",null,null,null,null,31]
[2,"Cláudio Dumont",27,"144","00:01:06.250","59,77km/h",null,null,null,null,32]
[2,"Cláudio Dumont",27,"144","00:01:06.642","59,42km/h",null,null,null,null,33]
[2,"Cláudio Dumont",27,"144","00:01:05.972","60,03km/h",null,null,null,null,34]
[2,"Cláudio Dumont",27,"144","00:01:06.182","59,84km/h",null,null,null,null,35]
[2,"Cláudio Dumont",27,"144","00:01:05.673","60,3km/h",null,null,null,null,36]
[2,"Cláudio Dumont",27,"144","00:01:05.995","60km/h",null,null,null,null,37]
[2,"Cláudio Dumont",27,"144","00:01:05.788","60,19km/h",null,null,null,null,38]
[2,"Cláudio Dumont",27,"144","00:01:06.093","59,92km/h",null,null,null,null,39]
[2,"Cláudio Dumont",27,"144","00:01:06.281","59,75km/h",null,null,null,null,40]
[2,"Cláudio Dumont",27,"144","00:01:06.042","59,96km/h",null,null,null,null,41]
[2,"Cláudio Dumont",27,"144","00:01:06.248","59,78km/h",null,null,null,null,42]
[2,"Cláudio Dumont",27,"144","00:01:06.608","59,45km/h",null,null,null,null,43]
[2,"Cláudio Dumont",27,"144","00:01:06.647","59,42km/h",null,null,null,null,44]
[2,"Cláudio Dumont",27,"144","00:01:06.347","59,69km/h",null,null,null,null,45]
[2,"Cláudio Dumont",27,"144","00:01:06.151","59,86km/h",null,null,null,null,46]
[2,"Cláudio Dumont",27,"144","00:01:06.324","59,71km/h",null,null,null,null,47]
[2,"Cláudio Dumont",27,"144","00:01:06.122","59,89km/h",null,null,null,null,48]
[2,"Cláudio Dumont",27,"144","00:01:06.924","59,17km/h",null,null,null,null,49]
[2,"Cláudio Dumont",27,"144","00:01:06.142","59,87km/h",null,null,null,null,50]
[2,"Cláudio Dumont",27,"144","00:01:06.444","59,6km/h",null,null,null,null,51]
[2,"Cláudio Dumont",27,"144","00:01:06.199","59,82km/h",null,null,null,null,52]
[2,"Cláudio Dumont",27,"144","00:01:06.039","59,96km/h",null,null,null,null,53]
[2,"Cláudio Dumont",27,"144","00:01:06.484","59,56km/h",null,null,null,null,54]
[2,"Cláudio Dumont",27,"144","00:01:07.401","58,75km/h",null,null,null,null,55]
[2,"Marcelo Pereira",27,"106","00:01:12.395","54,7km/h",null,null,null,null,56]
[2,"Marcelo Pereira",27,"106","00:01:08.667","57,67km/h",null,null,null,null,57]
[2,"Marcelo Pereira",27,"106","00:01:06.792","59,29km/h",null,null,null,null,58]
[2,"Marcelo Pereira",27,"106","00:01:06.290","59,74km/h",null,null,null,null,59]
[2,"Marcelo Pereira",27,"106","00:01:05.769","60,21km/h",null,null,null,null,60]
[2,"Marcelo Pereira",27,"106","00:01:06.724","59,35km/h",null,null,null,null,61]
[2,"Marcelo Pereira",27,"106","00:01:06.473","59,57km/h",null,null,null,null,62]
[2,"Marcelo Pereira",27,"106","00:01:05.914","60,08km/h",null,null,null,null,63]
[2,"Marcelo Pereira",27,"106","00:01:05.913","60,08km/h"]
[2,"Marcelo Pereira",27,"106","00:01:06.015","59,99km/h"]
[2,"Marcelo Pereira",27,"106","00:01:06.029","59,97km/h"]
[2,"Marcelo Pereira",27,"106","00:01:06.223","59,8km/h"]
[2,"Marcelo Pereira",27,"106","00:01:06.134","59,88km/h"]
[2,"Marcelo Pereira",27,"106","00:01:05.947","60,05km/h"]
[2,"Marcelo Pereira",27,"106","00:01:06.396","59,64km/h"]
[2,"Marcelo Pereira",27,"106","00:01:06.419","59,62km/h"]
[2,"Marcelo Pereira",27,"106","00:01:06.176","59,84km/h"]
[2,"Marcelo Pereira",27,"106","00:01:06.169","59,85km/h"]
[2,"Marcelo Pereira",27,"106","00:01:06.258","59,77km/h"]
[2,"Marcelo Pereira",27,"106","00:01:06.318","59,71km/h"]
[2,"Marcelo Pereira",27,"106","00:01:06.192","59,83km/h"]
[2,"Marcelo Pereira",27,"106","00:01:06.279","59,75km/h"]
[2,"Marcelo Pereira",27,"106","00:01:06.305","59,72km/h"]
[2,"Marcelo Pereira",27,"106","00:01:06.191","59,83km/h"]
[2,"Marcelo Pereira",27,"106","00:01:06.273","59,75km/h"]
[2,"Marcelo Pereira",27,"106","00:01:08.373","57,92km/h"]
[2,"Marcelo Pereira",27,"106","00:01:06.670","59,4km/h"]
[2,"Daniel Nahum",27,"101","00:01:11.959","55,03km/h"]
[2,"Daniel Nahum",27,"101","00:01:08.366","57,92km/h"]
[2,"Daniel Nahum",27,"101","00:01:07.855","58,36km/h"]
[2,"Daniel Nahum",27,"101","00:01:06.654","59,41km/h"]
[2,"Daniel Nahum",27,"101","00:01:05.881","60,11km/h"]
[2,"Daniel Nahum",27,"101","00:01:06.537","59,52km/h"]
[2,"Daniel Nahum",27,"101","00:01:06.980","59,12km/h"]
[2,"Daniel Nahum",27,"101","00:01:06.206","59,81km/h"]
[2,"Daniel Nahum",27,"101","00:01:06.254","59,77km/h"]
[2,"Daniel Nahum",27,"101","00:01:06.694","59,38km/h"]
[2,"Daniel Nahum",27,"101","00:01:06.114","59,9km/h"]
[2,"Daniel Nahum",27,"101","00:01:06.022","59,98km/h"]
[2,"Daniel Nahum",27,"101","00:01:05.711","60,26km/h"]
[2,"Daniel Nahum",27,"101","00:01:05.798","60,18km/h"]
[2,"Daniel Nahum",27,"101","00:01:06.257","59,77km/h"]
[2,"Daniel Nahum",27,"101","00:01:05.697","60,28km/h"]
[2,"Daniel Nahum",27,"101","00:01:05.868","60,12km/h"]
[2,"Daniel Nahum",27,"101","00:01:06.219","59,8km/h"]
[2,"Daniel Nahum",27,"101","00:01:06.360","59,67km/h"]
[2,"Daniel Nahum",27,"101","00:01:06.014","59,99km/h"]
[2,"Daniel Nahum",27,"101","00:01:06.003","60km/h"]
[2,"Daniel Nahum",27,"101","00:01:06.270","59,76km/h"]
[2,"Daniel Nahum",27,"101","00:01:06.116","59,89km/h"]
[2,"Daniel Nahum",27,"101","00:01:06.326","59,71km/h"]
[2,"Daniel Nahum",27,"101","00:01:06.255","59,77km/h"]
[2,"Daniel Nahum",27,"101","00:01:08.033","58,21km/h"]
[2,"Daniel Nahum",27,"101","00:01:06.650","59,41km/h"]
[2,"Rodrigo Mercadante",27,"132","00:01:12.414","54,69km/h"]
[2,"Rodrigo Mercadante",27,"132","00:01:07.314","58,83km/h"]
[2,"Rodrigo Mercadante",27,"132","00:01:07.148","58,97km/h"]
[2,"Rodrigo Mercadante",27,"132","00:01:06.385","59,65km/h"]
[2,"Rodrigo Mercadante",27,"132","00:01:06.709","59,36km/h"]
[2,"Rodrigo Mercadante",27,"132","00:01:07.102","59,01km/h"]
[2,"Rodrigo Mercadante",27,"132","00:01:06.787","59,29km/h"]
[2,"Rodrigo Mercadante",27,"132","00:01:06.135","59,88km/h"]
[2,"Rodrigo Mercadante",27,"132","00:01:06.242","59,78km/h"]
[2,"Rodrigo Mercadante",27,"132","00:01:06.252","59,77km/h"]
[2,"Rodrigo Mercadante",27,"132","00:01:05.998","60km/h"]
[2,"Rodrigo Mercadante",27,"132","00:01:06.013","59,99km/h"]
[2,"Rodrigo Mercadante",27,"132","00:01:06.062","59,94km/h"]
[2,"Rodrigo Mercadante",27,"132","00:01:06.365","59,67km/h"]
[2,"Rodrigo Mercadante",27,"132","00:01:06.367","59,67km/h"]
[2,"Rodrigo Mercadante",27,"132","00:01:06.098","59,91km/h"]
[2,"Rodrigo Mercadante",27,"132","00:01:06.140","59,87km/h"]
[2,"Rodrigo Mercadante",27,"132","00:01:06.268","59,76km/h"]
[2,"Rodrigo Mercadante",27,"132","00:01:06.446","59,6km/h"]
[2,"Rodrigo Mercadante",27,"132","00:01:06.027","59,98km/h"]
[2,"Rodrigo Mercadante",27,"132","00:01:05.882","60,11km/h"]
[2,"Rodrigo Mercadante",27,"132","00:01:06.226","59,8km/h"]
[2,"Rodrigo Mercadante",27,"132","00:01:06.165","59,85km/h"]
[2,"Rodrigo Mercadante",27,"132","00:01:06.347","59,69km/h"]
[2,"Rodrigo Mercadante",27,"132","00:01:06.089","59,92km/h"]
[2,"Rodrigo Mercadante",27,"132","00:01:08.551","57,77km/h"]
[2,"Rodrigo Mercadante",27,"132","00:01:07.134","58,99km/h"]
[2,"Jarbas Reis",27,"116","00:01:12.676","54,49km/h"]
[2,"Jarbas Reis",27,"116","00:01:08.150","58,11km/h"]
[2,"Jarbas Reis",27,"116","00:01:06.990","59,11km/h"]
[2,"Jarbas Reis",27,"116","00:01:06.420","59,62km/h"]
[2,"Jarbas Reis",27,"116","00:01:05.963","60,03km/h"]
[2,"Jarbas Reis",27,"116","00:01:07.525","58,64km/h"]
[2,"Jarbas Reis",27,"116","00:01:07.398","58,76km/h"]
[2,"Jarbas Reis",27,"116","00:01:06.359","59,68km/h"]
[2,"Jarbas Reis",27,"116","00:01:06.553","59,5km/h"]
[2,"Jarbas Reis",27,"116","00:01:06.900","59,19km/h"]
[2,"Jarbas Reis",27,"116","00:01:06.810","59,27km/h"]
[2,"Jarbas Reis",27,"116","00:01:06.688","59,38km/h"]
[2,"Jarbas Reis",27,"116","00:01:05.890","60,1km/h"]
[2,"Jarbas Reis",27,"116","00:01:05.941","60,05km/h"]
[2,"Jarbas Reis",27,"116","00:01:05.982","60,02km/h"]
[2,"Jarbas Reis",27,"116","00:01:06.322","59,71km/h"]
[2,"Jarbas Reis",27,"116","00:01:05.912","60,08km/h"]
[2,"Jarbas Reis",27,"116","00:01:06.112","59,9km/h"]
[2,"Jarbas Reis",27,"116","00:01:06.282","59,74km/h"]
[2,"Jarbas Reis",27,"116","00:01:06.092","59,92km/h"]
[2,"Jarbas Reis",27,"116","00:01:06.562","59,49km/h"]
[2,"Jarbas Reis",27,"116","00:01:06.166","59,85km/h"]
[2,"Jarbas Reis",27,"116","00:01:06.019","59,98km/h"]
[2,"Jarbas Reis",27,"116","00:01:07.019","59,09km/h"]
[2,"Jarbas Reis",27,"116","00:01:06.140","59,87km/h"]
[2,"Jarbas Reis",27,"116","00:01:06.295","59,73km/h"]
[2,"Jarbas Reis",27,"116","00:01:06.502","59,55km/h"]
[2,"Marcelo Marcondes",27,"130","00:01:15.438","52,49km/h"]
[2,"Marcelo Marcondes",27,"130","00:01:07.313","58,83km/h"]
[2,"Marcelo Marcondes",27,"130","00:01:08.443","57,86km/h"]
[2,"Marcelo Marcondes",27,"130","00:01:07.136","58,98km/h"]
[2,"Marcelo Marcondes",27,"130","00:01:06.009","59,99km/h"]
[2,"Marcelo Marcondes",27,"130","00:01:05.987","60,01km/h"]
[2,"Marcelo Marcondes",27,"130","00:01:05.830","60,15km/h"]
[2,"Marcelo Marcondes",27,"130","00:01:05.758","60,22km/h"]
[2,"Marcelo Marcondes",27,"130","00:01:05.956","60,04km/h"]
[2,"Marcelo Marcondes",27,"130","00:01:06.285","59,74km/h"]
[2,"Marcelo Marcondes",27,"130","00:01:07.027","59,08km/h"]
[2,"Marcelo Marcondes",27,"130","00:01:06.984","59,12km/h"]
[2,"Marcelo Marcondes",27,"130","00:01:05.714","60,26km/h"]
[2,"Marcelo Marcondes",27,"130","00:01:06.108","59,9km/h"]
[2,"Marcelo Marcondes",27,"130","00:01:06.092","59,92km/h"]
[2,"Marcelo Marcondes",27,"130","00:01:06.177","59,84km/h"]
[2,"Marcelo Marcondes",27,"130","00:01:05.906","60,09km/h"]
[2,"Marcelo Marcondes",27,"130","00:01:05.657","60,31km/h"]
[2,"Marcelo Marcondes",27,"130","00:01:05.366","60,58km/h"]
[2,"Marcelo Marcondes",27,"130","00:01:06.052","59,95km/h"]
[2,"Marcelo Marcondes",27,"130","00:01:06.705","59,37km/h"]
[2,"Marcelo Marcondes",27,"130","00:01:06.549","59,51km/h"]
[2,"Marcelo Marcondes",27,"130","00:01:06.941","59,16km/h"]
[2,"Marcelo Marcondes",27,"130","00:01:06.330","59,7km/h"]
[2,"Marcelo Marcondes",27,"130","00:01:06.558","59,5km/h"]
[2,"Marcelo Marcondes",27,"130","00:01:06.517","59,53km/h"]
[2,"Marcelo Marcondes",27,"130","00:01:05.957","60,04km/h"]
[2,"Marcelo Campos",27,"120","00:01:14.924","52,85km/h"]
[2,"Marcelo Campos",27,"120","00:01:07.133","58,99km/h"]
[2,"Marcelo Campos",27,"120","00:01:08.444","57,86km/h"]
[2,"Marcelo Campos",27,"120","00:01:05.964","60,03km/h"]
[2,"Marcelo Campos",27,"120","00:01:06.729","59,34km/h"]
[2,"Marcelo Campos",27,"120","00:01:06.336","59,7km/h"]
[2,"Marcelo Campos",27,"120","00:01:05.911","60,08km/h"]
[2,"Marcelo Campos",27,"120","00:01:06.378","59,66km/h"]
[2,"Marcelo Campos",27,"120","00:01:05.985","60,01km/h"]
[2,"Marcelo Campos",27,"120","00:01:06.840","59,25km/h"]
[2,"Marcelo Campos",27,"120","00:01:06.609","59,45km/h"]
[2,"Marcelo Campos",27,"120","00:01:06.150","59,86km/h"]
[2,"Marcelo Campos",27,"120","00:01:05.912","60,08km/h"]
[2,"Marcelo Campos",27,"120","00:01:06.093","59,92km/h"]
[2,"Marcelo Campos",27,"120","00:01:06.025","59,98km/h"]
[2,"Marcelo Campos",27,"120","00:01:06.325","59,71km/h"]
[2,"Marcelo Campos",27,"120","00:01:06.036","59,97km/h"]
[2,"Marcelo Campos",27,"120","00:01:06.130","59,88km/h"]
[2,"Marcelo Campos",27,"120","00:01:06.295","59,73km/h"]
[2,"Marcelo Campos",27,"120","00:01:06.253","59,77km/h"]
[2,"Marcelo Campos",27,"120","00:01:07","59,1km/h"]
[2,"Marcelo Campos",27,"120","00:01:06.799","59,28km/h"]
[2,"Marcelo Campos",27,"120","00:01:06.679","59,39km/h"]
[2,"Marcelo Campos",27,"120","00:01:06.360","59,67km/h"]
[2,"Marcelo Campos",27,"120","00:01:06.840","59,25km/h"]
[2,"Marcelo Campos",27,"120","00:01:07.226","58,91km/h"]
[2,"Marcelo Campos",27,"120","00:01:06.273","59,75km/h"]
[2,"Maurício Júnior",27,"111","00:01:11.662","55,26km/h"]
[2,"Maurício Júnior",27,"111","00:01:07.603","58,58km/h"]
[2,"Maurício Júnior",27,"111","00:01:07.572","58,6km/h"]
[2,"Maurício Júnior",27,"111","00:01:06.865","59,22km/h"]
[2,"Maurício Júnior",27,"111","00:01:07.060","59,05km/h"]
[2,"Maurício Júnior",27,"111","00:01:07.806","58,4km/h"]
[2,"Maurício Júnior",27,"111","00:01:06.972","59,13km/h"]
[2,"Maurício Júnior",27,"111","00:01:06.545","59,51km/h"]
[2,"Maurício Júnior",27,"111","00:01:06.609","59,45km/h"]
[2,"Maurício Júnior",27,"111","00:01:07.172","58,95km/h"]
[2,"Maurício Júnior",27,"111","00:01:06.554","59,5km/h"]
[2,"Maurício Júnior",27,"111","00:01:07.341","58,81km/h"]
[2,"Maurício Júnior",27,"111","00:01:06.155","59,86km/h"]
[2,"Maurício Júnior",27,"111","00:01:05.836","60,15km/h"]
[2,"Maurício Júnior",27,"111","00:01:06.017","59,98km/h"]
[2,"Maurício Júnior",27,"111","00:01:06.372","59,66km/h"]
[2,"Maurício Júnior",27,"111","00:01:06.002","60km/h"]
[2,"Maurício Júnior",27,"111","00:01:05.991","60,01km/h"]
[2,"Maurício Júnior",27,"111","00:01:05.997","60km/h"]
[2,"Maurício Júnior",27,"111","00:01:06.276","59,75km/h"]
[2,"Maurício Júnior",27,"111","00:01:06.742","59,33km/h"]
[2,"Maurício Júnior",27,"111","00:01:06.367","59,67km/h"]
[2,"Maurício Júnior",27,"111","00:01:07.484","58,68km/h"]
[2,"Maurício Júnior",27,"111","00:01:07.134","58,99km/h"]
[2,"Maurício Júnior",27,"111","00:01:06.380","59,66km/h"]
[2,"Maurício Júnior",27,"111","00:01:06.753","59,32km/h"]
[2,"Maurício Júnior",27,"111","00:01:06.535","59,52km/h"]
[2,"Wesley Canuto",27,"102","00:01:14.989","52,81km/h"]
[2,"Wesley Canuto",27,"102","00:01:09.636","56,87km/h"]
[2,"Wesley Canuto",27,"102","00:01:07.907","58,32km/h"]
[2,"Wesley Canuto",27,"102","00:01:07.686","58,51km/h"]
[2,"Wesley Canuto",27,"102","00:01:06.154","59,86km/h"]
[2,"Wesley Canuto",27,"102","00:01:06.066","59,94km/h"]
[2,"Wesley Canuto",27,"102","00:01:06.205","59,81km/h"]
[2,"Wesley Canuto",27,"102","00:01:05.729","60,25km/h"]
[2,"Wesley Canuto",27,"102","00:01:06.260","59,76km/h"]
[2,"Wesley Canuto",27,"102","00:01:05.752","60,23km/h"]
[2,"Wesley Canuto",27,"102","00:01:05.825","60,16km/h"]
[2,"Wesley Canuto",27,"102","00:01:07.226","58,91km/h"]
[2,"Wesley Canuto",27,"102","00:01:07.029","59,08km/h"]
[2,"Wesley Canuto",27,"102","00:01:06.190","59,83km/h"]
[2,"Wesley Canuto",27,"102","00:01:05.963","60,03km/h"]
[2,"Wesley Canuto",27,"102","00:01:06.694","59,38km/h"]
[2,"Wesley Canuto",27,"102","00:01:06.048","59,96km/h"]
[2,"Wesley Canuto",27,"102","00:01:06.487","59,56km/h"]
[2,"Wesley Canuto",27,"102","00:01:05.987","60,01km/h"]
[2,"Wesley Canuto",27,"102","00:01:05.999","60km/h"]
[2,"Wesley Canuto",27,"102","00:01:05.922","60,07km/h"]
[2,"Wesley Canuto",27,"102","00:01:06.573","59,48km/h"]
[2,"Wesley Canuto",27,"102","00:01:06.148","59,87km/h"]
[2,"Wesley Canuto",27,"102","00:01:07.213","58,92km/h"]
[2,"Wesley Canuto",27,"102","00:01:05.898","60,09km/h"]
[2,"Wesley Canuto",27,"102","00:01:06.547","59,51km/h"]
[2,"Wesley Canuto",27,"102","00:01:06.478","59,57km/h"]
[2,"Marcelo Sant'anna",27,"104","00:01:12.231","54,82km/h"]
[2,"Marcelo Sant'anna",27,"104","00:01:08.552","57,77km/h"]
[2,"Marcelo Sant'anna",27,"104","00:01:07.913","58,31km/h"]
[2,"Marcelo Sant'anna",27,"104","00:01:06.687","59,38km/h"]
[2,"Marcelo Sant'anna",27,"104","00:01:06.741","59,33km/h"]
[2,"Marcelo Sant'anna",27,"104","00:01:07.217","58,91km/h"]
[2,"Marcelo Sant'anna",27,"104","00:01:06.645","59,42km/h"]
[2,"Marcelo Sant'anna",27,"104","00:01:06.479","59,57km/h"]
[2,"Marcelo Sant'anna",27,"104","00:01:06.340","59,69km/h"]
[2,"Marcelo Sant'anna",27,"104","00:01:06.831","59,25km/h"]
[2,"Marcelo Sant'anna",27,"104","00:01:06.951","59,15km/h"]
[2,"Marcelo Sant'anna",27,"104","00:01:07.453","58,71km/h"]
[2,"Marcelo Sant'anna",27,"104","00:01:07.584","58,59km/h"]
[2,"Marcelo Sant'anna",27,"104","00:01:06.459","59,59km/h"]
[2,"Marcelo Sant'anna",27,"104","00:01:06.392","59,65km/h"]
[2,"Marcelo Sant'anna",27,"104","00:01:06.804","59,28km/h"]
[2,"Marcelo Sant'anna",27,"104","00:01:06.500","59,55km/h"]
[2,"Marcelo Sant'anna",27,"104","00:01:06.520","59,53km/h"]
[2,"Marcelo Sant'anna",27,"104","00:01:06.350","59,68km/h"]
[2,"Marcelo Sant'anna",27,"104","00:01:06.249","59,77km/h"]
[2,"Marcelo Sant'anna",27,"104","00:01:06.403","59,64km/h"]
[2,"Marcelo Sant'anna",27,"104","00:01:06.944","59,15km/h"]
[2,"Marcelo Sant'anna",27,"104","00:01:07.059","59,05km/h"]
[2,"Marcelo Sant'anna",27,"104","00:01:06.780","59,3km/h"]
[2,"Marcelo Sant'anna",27,"104","00:01:06.698","59,37km/h"]
[2,"Marcelo Sant'anna",27,"104","00:01:06.773","59,31km/h"]
[2,"Marcelo Sant'anna",27,"104","00:01:07.350","58,8km/h"]
[2,"Guilherme Alves",27,"113","00:01:13.068","54,2km/h"]
[2,"Guilherme Alves",27,"113","00:01:08.936","57,44km/h"]
[2,"Guilherme Alves",27,"113","00:01:07.622","58,56km/h"]
[2,"Guilherme Alves",27,"113","00:01:06.772","59,31km/h"]
[2,"Guilherme Alves",27,"113","00:01:06.107","59,9km/h"]
[2,"Guilherme Alves",27,"113","00:01:06.625","59,44km/h"]
[2,"Guilherme Alves",27,"113","00:01:06.678","59,39km/h"]
[2,"Guilherme Alves",27,"113","00:01:07.156","58,97km/h"]
[2,"Guilherme Alves",27,"113","00:01:07.122","59km/h"]
[2,"Guilherme Alves",27,"113","00:01:06.695","59,37km/h"]
[2,"Guilherme Alves",27,"113","00:01:07.039","59,07km/h"]
[2,"Guilherme Alves",27,"113","00:01:07.609","58,57km/h"]
[2,"Guilherme Alves",27,"113","00:01:07.587","58,59km/h"]
[2,"Guilherme Alves",27,"113","00:01:06.911","59,18km/h"]
[2,"Guilherme Alves",27,"113","00:01:06.237","59,79km/h"]
[2,"Guilherme Alves",27,"113","00:01:06.782","59,3km/h"]
[2,"Guilherme Alves",27,"113","00:01:06.833","59,25km/h"]
[2,"Guilherme Alves",27,"113","00:01:06.278","59,75km/h"]
[2,"Guilherme Alves",27,"113","00:01:06.355","59,68km/h"]
[2,"Guilherme Alves",27,"113","00:01:06.312","59,72km/h"]
[2,"Guilherme Alves",27,"113","00:01:06.841","59,25km/h"]
[2,"Guilherme Alves",27,"113","00:01:06.617","59,44km/h"]
[2,"Guilherme Alves",27,"113","00:01:07.175","58,95km/h"]
[2,"Guilherme Alves",27,"113","00:01:06.813","59,27km/h"]
[2,"Guilherme Alves",27,"113","00:01:07.176","58,95km/h"]
[2,"Guilherme Alves",27,"113","00:01:06.815","59,27km/h"]
[2,"Guilherme Alves",27,"113","00:01:06.992","59,11km/h"]
[2,"Alexandre Melillo",27,"142","00:01:12.341","54,74km/h"]
[2,"Alexandre Melillo",27,"142","00:01:07.910","58,31km/h"]
[2,"Alexandre Melillo",27,"142","00:01:07.995","58,24km/h"]
[2,"Alexandre Melillo",27,"142","00:01:07.299","58,84km/h"]
[2,"Alexandre Melillo",27,"142","00:01:06.547","59,51km/h"]
[2,"Alexandre Melillo",27,"142","00:01:07.065","59,05km/h"]
[2,"Alexandre Melillo",27,"142","00:01:06.817","59,27km/h"]
[2,"Alexandre Melillo",27,"142","00:01:06.834","59,25km/h"]
[2,"Alexandre Melillo",27,"142","00:01:07.462","58,7km/h"]
[2,"Alexandre Melillo",27,"142","00:01:06.474","59,57km/h"]
[2,"Alexandre Melillo",27,"142","00:01:06.556","59,5km/h"]
[2,"Alexandre Melillo",27,"142","00:01:06.515","59,54km/h"]
[2,"Alexandre Melillo",27,"142","00:01:06.622","59,44km/h"]
[2,"Alexandre Melillo",27,"142","00:01:07.241","58,89km/h"]
[2,"Alexandre Melillo",27,"142","00:01:06.601","59,46km/h"]
[2,"Alexandre Melillo",27,"142","00:01:06.750","59,33km/h"]
[2,"Alexandre Melillo",27,"142","00:01:06.609","59,45km/h"]
[2,"Alexandre Melillo",27,"142","00:01:07.144","58,98km/h"]
[2,"Alexandre Melillo",27,"142","00:01:06.789","59,29km/h"]
[2,"Alexandre Melillo",27,"142","00:01:06.790","59,29km/h"]
[2,"Alexandre Melillo",27,"142","00:01:06.680","59,39km/h"]
[2,"Alexandre Melillo",27,"142","00:01:07.250","58,88km/h"]
[2,"Alexandre Melillo",27,"142","00:01:07.103","59,01km/h"]
[2,"Alexandre Melillo",27,"142","00:01:06.884","59,21km/h"]
[2,"Alexandre Melillo",27,"142","00:01:07.029","59,08km/h"]
[2,"Alexandre Melillo",27,"142","00:01:07","59,1km/h"]
[2,"Alexandre Melillo",27,"142","00:01:07.203","58,93km/h"]
[2,"Marcelo Surerus",27,"114","00:01:14.437","53,2km/h"]
[2,"Marcelo Surerus",27,"114","00:01:09.131","57,28km/h"]
[2,"Marcelo Surerus",27,"114","00:01:07.286","58,85km/h"]
[2,"Marcelo Surerus",27,"114","00:01:08.061","58,18km/h"]
[2,"Marcelo Surerus",27,"114","00:01:06.444","59,6km/h"]
[2,"Marcelo Surerus",27,"114","00:01:07.100","59,02km/h"]
[2,"Marcelo Surerus",27,"114","00:01:06.550","59,5km/h"]
[2,"Marcelo Surerus",27,"114","00:01:06.342","59,69km/h"]
[2,"Marcelo Surerus",27,"114","00:01:06.738","59,34km/h"]
[2,"Marcelo Surerus",27,"114","00:01:06.827","59,26km/h"]
[2,"Marcelo Surerus",27,"114","00:01:06.975","59,13km/h"]
[2,"Marcelo Surerus",27,"114","00:01:06.499","59,55km/h"]
[2,"Marcelo Surerus",27,"114","00:01:06.385","59,65km/h"]
[2,"Marcelo Surerus",27,"114","00:01:06.857","59,23km/h"]
[2,"Marcelo Surerus",27,"114","00:01:05.950","60,05km/h"]
[2,"Marcelo Surerus",27,"114","00:01:07.210","58,92km/h"]
[2,"Marcelo Surerus",27,"114","00:01:06.560","59,5km/h"]
[2,"Marcelo Surerus",27,"114","00:01:06.665","59,4km/h"]
[2,"Marcelo Surerus",27,"114","00:01:06.545","59,51km/h"]
[2,"Marcelo Surerus",27,"114","00:01:06.640","59,42km/h"]
[2,"Marcelo Surerus",27,"114","00:01:06.297","59,73km/h"]
[2,"Marcelo Surerus",27,"114","00:01:06.696","59,37km/h"]
[2,"Marcelo Surerus",27,"114","00:01:06.659","59,41km/h"]
[2,"Marcelo Surerus",27,"114","00:01:06.678","59,39km/h"]
[2,"Marcelo Surerus",27,"114","00:01:06.272","59,75km/h"]
[2,"Marcelo Surerus",27,"114","00:01:07.245","58,89km/h"]
[2,"Marcelo Surerus",27,"114","00:01:06.655","59,41km/h"]
[2,"Frederico Papatella",27,"136","00:01:12.763","54,42km/h"]
[2,"Frederico Papatella",27,"136","00:01:09.308","57,14km/h"]
[2,"Frederico Papatella",27,"136","00:01:10.370","56,27km/h"]
[2,"Frederico Papatella",27,"136","00:01:07.591","58,59km/h"]
[2,"Frederico Papatella",27,"136","00:01:07.313","58,83km/h"]
[2,"Frederico Papatella",27,"136","00:01:06.727","59,35km/h"]
[2,"Frederico Papatella",27,"136","00:01:07.129","58,99km/h"]
[2,"Frederico Papatella",27,"136","00:01:06.308","59,72km/h"]
[2,"Frederico Papatella",27,"136","00:01:07.327","58,82km/h"]
[2,"Frederico Papatella",27,"136","00:01:07.037","59,07km/h"]
[2,"Frederico Papatella",27,"136","00:01:07.003","59,1km/h"]
[2,"Frederico Papatella",27,"136","00:01:06.965","59,14km/h"]
[2,"Frederico Papatella",27,"136","00:01:06.716","59,36km/h"]
[2,"Frederico Papatella",27,"136","00:01:07.470","58,69km/h"]
[2,"Frederico Papatella",27,"136","00:01:07.492","58,67km/h"]
[2,"Frederico Papatella",27,"136","00:01:07.544","58,63km/h"]
[2,"Frederico Papatella",27,"136","00:01:07.408","58,75km/h"]
[2,"Frederico Papatella",27,"136","00:01:06.808","59,27km/h"]
[2,"Frederico Papatella",27,"136","00:01:06.886","59,21km/h"]
[2,"Frederico Papatella",27,"136","00:01:06.752","59,32km/h"]
[2,"Frederico Papatella",27,"136","00:01:06.987","59,12km/h"]
[2,"Frederico Papatella",27,"136","00:01:06.826","59,26km/h"]
[2,"Frederico Papatella",27,"136","00:01:06.744","59,33km/h"]
[2,"Frederico Papatella",27,"136","00:01:08.305","57,98km/h"]
[2,"Frederico Papatella",27,"136","00:01:06.946","59,15km/h"]
[2,"Frederico Papatella",27,"136","00:01:07.389","58,76km/h"]
[2,"Frederico Papatella",27,"136","00:01:07.585","58,59km/h"]
[2,"Rodrigo Ricardo",27,"153","00:01:12.457","54,65km/h"]
[2,"Rodrigo Ricardo",27,"153","00:01:08.895","57,48km/h"]
[2,"Rodrigo Ricardo",27,"153","00:01:08.566","57,75km/h"]
[2,"Rodrigo Ricardo",27,"153","00:01:07.410","58,74km/h"]
[2,"Rodrigo Ricardo",27,"153","00:01:06.801","59,28km/h"]
[2,"Rodrigo Ricardo",27,"153","00:01:06.829","59,26km/h"]
[2,"Rodrigo Ricardo",27,"153","00:01:06.931","59,17km/h"]
[2,"Rodrigo Ricardo",27,"153","00:01:07.231","58,9km/h"]
[2,"Rodrigo Ricardo",27,"153","00:01:06.799","59,28km/h"]
[2,"Rodrigo Ricardo",27,"153","00:01:07.202","58,93km/h"]
[2,"Rodrigo Ricardo",27,"153","00:01:07.244","58,89km/h"]
[2,"Rodrigo Ricardo",27,"153","00:01:07.334","58,81km/h"]
[2,"Rodrigo Ricardo",27,"153","00:01:07.038","59,07km/h"]
[2,"Rodrigo Ricardo",27,"153","00:01:06.859","59,23km/h"]
[2,"Rodrigo Ricardo",27,"153","00:01:07.608","58,57km/h"]
[2,"Rodrigo Ricardo",27,"153","00:01:07.527","58,64km/h"]
[2,"Rodrigo Ricardo",27,"153","00:01:07.235","58,9km/h"]
[2,"Rodrigo Ricardo",27,"153","00:01:06.986","59,12km/h"]
[2,"Rodrigo Ricardo",27,"153","00:01:07.260","58,88km/h"]
[2,"Rodrigo Ricardo",27,"153","00:01:07.472","58,69km/h"]
[2,"Rodrigo Ricardo",27,"153","00:01:07.663","58,53km/h"]
[2,"Rodrigo Ricardo",27,"153","00:01:07.381","58,77km/h"]
[2,"Rodrigo Ricardo",27,"153","00:01:07.734","58,46km/h"]
[2,"Rodrigo Ricardo",27,"153","00:01:10.204","56,41km/h"]
[2,"Rodrigo Ricardo",27,"153","00:01:07.554","58,62km/h"]
[2,"Rodrigo Ricardo",27,"153","00:01:07.460","58,7km/h"]
[2,"Rodrigo Ricardo",27,"153","00:01:07.183","58,94km/h"]
[2,"Guilherme Ruas",27,"103","00:01:16.132","52,01km/h"]
[2,"Guilherme Ruas",27,"103","00:01:09.585","56,91km/h"]
[2,"Guilherme Ruas",27,"103","00:01:08.132","58,12km/h"]
[2,"Guilherme Ruas",27,"103","00:01:07.647","58,54km/h"]
[2,"Guilherme Ruas",27,"103","00:01:07.083","59,03km/h"]
[2,"Guilherme Ruas",27,"103","00:01:06.946","59,15km/h"]
[2,"Guilherme Ruas",27,"103","00:01:07.045","59,06km/h"]
[2,"Guilherme Ruas",27,"103","00:01:10.295","56,33km/h"]
[2,"Guilherme Ruas",27,"103","00:01:06.674","59,39km/h"]
[2,"Guilherme Ruas",27,"103","00:01:07.255","58,88km/h"]
[2,"Guilherme Ruas",27,"103","00:01:06.809","59,27km/h"]
[2,"Guilherme Ruas",27,"103","00:01:07.222","58,91km/h"]
[2,"Guilherme Ruas",27,"103","00:01:07.259","58,88km/h"]
[2,"Guilherme Ruas",27,"103","00:01:06.753","59,32km/h"]
[2,"Guilherme Ruas",27,"103","00:01:07.048","59,06km/h"]
[2,"Guilherme Ruas",27,"103","00:01:06.890","59,2km/h"]
[2,"Guilherme Ruas",27,"103","00:01:07.206","58,92km/h"]
[2,"Guilherme Ruas",27,"103","00:01:07.008","59,1km/h"]
[2,"Guilherme Ruas",27,"103","00:01:07.013","59,09km/h"]
[2,"Guilherme Ruas",27,"103","00:01:07.183","58,94km/h"]
[2,"Guilherme Ruas",27,"103","00:01:07.221","58,91km/h"]
[2,"Guilherme Ruas",27,"103","00:01:06.694","59,38km/h"]
[2,"Guilherme Ruas",27,"103","00:01:07.311","58,83km/h"]
[2,"Guilherme Ruas",27,"103","00:01:07.292","58,85km/h"]
[2,"Guilherme Ruas",27,"103","00:01:06.999","59,11km/h"]
[2,"Guilherme Ruas",27,"103","00:01:07.061","59,05km/h"]
[2,"Guilherme Ruas",27,"103","00:01:07.512","58,66km/h"]
[2,"Marcelo Clemente",27,"127","00:01:15.812","52,23km/h"]
[2,"Marcelo Clemente",27,"127","00:01:08.781","57,57km/h"]
[2,"Marcelo Clemente",27,"127","00:01:07.518","58,65km/h"]
[2,"Marcelo Clemente",27,"127","00:01:37.799","40,49km/h"]
[2,"Marcelo Clemente",27,"127","00:01:24.522","46,85km/h"]
[2,"Marcelo Clemente",27,"127","00:01:06.013","59,99km/h"]
[2,"Marcelo Clemente",27,"127","00:01:05.345","60,6km/h"]
[2,"Marcelo Clemente",27,"127","00:01:06.313","59,72km/h"]
[2,"Marcelo Clemente",27,"127","00:01:05.121","60,81km/h"]
[2,"Marcelo Clemente",27,"127","00:01:05.023","60,9km/h"]
[2,"Marcelo Clemente",27,"127","00:01:05.306","60,64km/h"]
[2,"Marcelo Clemente",27,"127","00:01:04.900","61,02km/h"]
[2,"Marcelo Clemente",27,"127","00:01:04.852","61,06km/h"]
[2,"Marcelo Clemente",27,"127","00:01:04.921","61km/h"]
[2,"Marcelo Clemente",27,"127","00:01:05.237","60,7km/h"]
[2,"Marcelo Clemente",27,"127","00:01:04.957","60,96km/h"]
[2,"Marcelo Clemente",27,"127","00:01:06.154","59,86km/h"]
[2,"Marcelo Clemente",27,"127","00:01:05.412","60,54km/h"]
[2,"Marcelo Clemente",27,"127","00:01:05.952","60,04km/h"]
[2,"Marcelo Clemente",27,"127","00:01:05.810","60,17km/h"]
[2,"Marcelo Clemente",27,"127","00:01:04.844","61,07km/h"]
[2,"Marcelo Clemente",27,"127","00:01:06.207","59,81km/h"]
[2,"Marcelo Clemente",27,"127","00:01:05.283","60,66km/h"]
[2,"Marcelo Clemente",27,"127","00:01:05.097","60,83km/h"]
[2,"Marcelo Clemente",27,"127","00:01:05.221","60,72km/h"]
[2,"Marcelo Clemente",27,"127","00:01:05.161","60,77km/h"]
[2,"Marcelo Clemente",27,"127","00:01:05.717","60,26km/h"]
[2,"Reila Ricardo",27,"107","00:01:17.028","51,41km/h"]
[2,"Reila Ricardo",27,"107","00:01:09.854","56,69km/h"]
[2,"Reila Ricardo",27,"107","00:01:07.921","58,3km/h"]
[2,"Reila Ricardo",27,"107","00:01:08.833","57,53km/h"]
[2,"Reila Ricardo",27,"107","00:01:07.559","58,62km/h"]
[2,"Reila Ricardo",27,"107","00:01:07.372","58,78km/h"]
[2,"Reila Ricardo",27,"107","00:01:07.388","58,76km/h"]
[2,"Reila Ricardo",27,"107","00:01:07.411","58,74km/h"]
[2,"Reila Ricardo",27,"107","00:01:07.178","58,95km/h"]
[2,"Reila Ricardo",27,"107","00:01:08.134","58,12km/h"]
[2,"Reila Ricardo",27,"107","00:01:07.481","58,68km/h"]
[2,"Reila Ricardo",27,"107","00:01:06.858","59,23km/h"]
[2,"Reila Ricardo",27,"107","00:01:07.704","58,49km/h"]
[2,"Reila Ricardo",27,"107","00:01:07.410","58,74km/h"]
[2,"Reila Ricardo",27,"107","00:01:07.148","58,97km/h"]
[2,"Reila Ricardo",27,"107","00:01:07.577","58,6km/h"]
[2,"Reila Ricardo",27,"107","00:01:07.119","59km/h"]
[2,"Reila Ricardo",27,"107","00:01:07.772","58,43km/h"]
[2,"Reila Ricardo",27,"107","00:01:07.812","58,4km/h"]
[2,"Reila Ricardo",27,"107","00:01:07.687","58,5km/h"]
[2,"Reila Ricardo",27,"107","00:01:07.423","58,73km/h"]
[2,"Reila Ricardo",27,"107","00:01:07.495","58,67km/h"]
[2,"Reila Ricardo",27,"107","00:01:07.559","58,62km/h"]
[2,"Reila Ricardo",27,"107","00:01:07.783","58,42km/h"]
[2,"Reila Ricardo",27,"107","00:01:07.657","58,53km/h"]
[2,"Reila Ricardo",27,"107","00:01:07.495","58,67km/h"]
[2,"Reila Ricardo",27,"107","00:01:14.695","53,02km/h"]
[2,"Délcio Ragazzi",27,"128","00:01:14.800","52,94km/h"]
[2,"Délcio Ragazzi",27,"128","00:01:08.869","57,5km/h"]
[2,"Délcio Ragazzi",27,"128","00:01:18.911","50,18km/h"]
[2,"Délcio Ragazzi",27,"128","00:01:07.241","58,89km/h"]
[2,"Délcio Ragazzi",27,"128","00:01:07.265","58,87km/h"]
[2,"Délcio Ragazzi",27,"128","00:01:07.890","58,33km/h"]
[2,"Délcio Ragazzi",27,"128","00:01:14.429","53,21km/h"]
[2,"Délcio Ragazzi",27,"128","00:01:06.787","59,29km/h"]
[2,"Délcio Ragazzi",27,"128","00:01:07.356","58,79km/h"]
[2,"Délcio Ragazzi",27,"128","00:01:08.305","57,98km/h"]
[2,"Délcio Ragazzi",27,"128","00:01:06.962","59,14km/h"]
[2,"Délcio Ragazzi",27,"128","00:01:07.421","58,74km/h"]
[2,"Délcio Ragazzi",27,"128","00:01:07.867","58,35km/h"]
[2,"Délcio Ragazzi",27,"128","00:01:06.683","59,39km/h"]
[2,"Délcio Ragazzi",27,"128","00:01:06.814","59,27km/h"]
[2,"Délcio Ragazzi",27,"128","00:01:06.557","59,5km/h"]
[2,"Délcio Ragazzi",27,"128","00:01:07.589","58,59km/h"]
[2,"Délcio Ragazzi",27,"128","00:01:08.006","58,23km/h"]
[2,"Délcio Ragazzi",27,"128","00:01:07.959","58,27km/h"]
[2,"Délcio Ragazzi",27,"128","00:01:06.864","59,22km/h"]
[2,"Délcio Ragazzi",27,"128","00:01:06.955","59,14km/h"]
[2,"Délcio Ragazzi",27,"128","00:01:07.302","58,84km/h"]
[2,"Délcio Ragazzi",27,"128","00:01:06.737","59,34km/h"]
[2,"Délcio Ragazzi",27,"128","00:01:07.045","59,06km/h"]
[2,"Délcio Ragazzi",27,"128","00:01:06.884","59,21km/h"]
[2,"Délcio Ragazzi",27,"128","00:01:07.240","58,89km/h"]
[2,"Délcio Ragazzi",27,"128","00:01:07.249","58,89km/h"]
[2,"Jucimar Vieira",27,"138","00:01:15.680","52,33km/h"]
[2,"Jucimar Vieira",27,"138","00:01:09.609","56,89km/h"]
[2,"Jucimar Vieira",27,"138","00:01:07.756","58,45km/h"]
[2,"Jucimar Vieira",27,"138","00:01:08.870","57,5km/h"]
[2,"Jucimar Vieira",27,"138","00:01:07.579","58,6km/h"]
[2,"Jucimar Vieira",27,"138","00:01:07.081","59,03km/h"]
[2,"Jucimar Vieira",27,"138","00:01:08.021","58,22km/h"]
[2,"Jucimar Vieira",27,"138","00:01:08.917","57,46km/h"]
[2,"Jucimar Vieira",27,"138","00:01:08.195","58,07km/h"]
[2,"Jucimar Vieira",27,"138","00:01:08.039","58,2km/h"]
[2,"Jucimar Vieira",27,"138","00:01:14.747","52,98km/h"]
[2,"Jucimar Vieira",27,"138","00:01:07.854","58,36km/h"]
[2,"Jucimar Vieira",27,"138","00:01:07.448","58,71km/h"]
[2,"Jucimar Vieira",27,"138","00:01:06.754","59,32km/h"]
[2,"Jucimar Vieira",27,"138","00:01:07.354","58,79km/h"]
[2,"Jucimar Vieira",27,"138","00:01:06.971","59,13km/h"]
[2,"Jucimar Vieira",27,"138","00:01:07.991","58,24km/h"]
[2,"Jucimar Vieira",27,"138","00:01:08.523","57,79km/h"]
[2,"Jucimar Vieira",27,"138","00:01:07.241","58,89km/h"]
[2,"Jucimar Vieira",27,"138","00:01:07.358","58,79km/h"]
[2,"Jucimar Vieira",27,"138","00:01:07.693","58,5km/h"]
[2,"Jucimar Vieira",27,"138","00:01:07.748","58,45km/h"]
[2,"Jucimar Vieira",27,"138","00:01:06.796","59,28km/h"]
[2,"Jucimar Vieira",27,"138","00:01:07.165","58,96km/h"]
[2,"Jucimar Vieira",27,"138","00:01:06.682","59,39km/h"]
[2,"Jucimar Vieira",27,"138","00:01:07.327","58,82km/h"]
[2,"Jucimar Vieira",27,"138","00:01:07.149","58,97km/h"]
[2,"Lucas Guimarães",27,"149","00:01:13.070","54,19km/h"]
[2,"Lucas Guimarães",27,"149","00:01:08.752","57,6km/h"]
[2,"Lucas Guimarães",27,"149","00:01:09.491","56,99km/h"]
[2,"Lucas Guimarães",27,"149","00:01:08.406","57,89km/h"]
[2,"Lucas Guimarães",27,"149","00:01:07.795","58,41km/h"]
[2,"Lucas Guimarães",27,"149","00:01:07.668","58,52km/h"]
[2,"Lucas Guimarães",27,"149","00:01:07.835","58,38km/h"]
[2,"Lucas Guimarães",27,"149","00:01:07.776","58,43km/h"]
[2,"Lucas Guimarães",27,"149","00:01:07.698","58,5km/h"]
[2,"Lucas Guimarães",27,"149","00:01:08.110","58,14km/h"]
[2,"Lucas Guimarães",27,"149","00:01:07.514","58,65km/h"]
[2,"Lucas Guimarães",27,"149","00:01:08.058","58,19km/h"]
[2,"Lucas Guimarães",27,"149","00:01:08.969","57,42km/h"]
[2,"Lucas Guimarães",27,"149","00:01:07.823","58,39km/h"]
[2,"Lucas Guimarães",27,"149","00:01:07.637","58,55km/h"]
[2,"Lucas Guimarães",27,"149","00:01:07.453","58,71km/h"]
[2,"Lucas Guimarães",27,"149","00:01:07.833","58,38km/h"]
[2,"Lucas Guimarães",27,"149","00:01:08.466","57,84km/h"]
[2,"Lucas Guimarães",27,"149","00:01:07.899","58,32km/h"]
[2,"Lucas Guimarães",27,"149","00:01:07.814","58,4km/h"]
[2,"Lucas Guimarães",27,"149","00:01:07.324","58,82km/h"]
[2,"Lucas Guimarães",27,"149","00:01:16.272","51,92km/h"]
[2,"Lucas Guimarães",27,"149","00:01:07.750","58,45km/h"]
[2,"Lucas Guimarães",27,"149","00:01:07.614","58,57km/h"]
[2,"Lucas Guimarães",27,"149","00:01:08.329","57,95km/h"]
[2,"Lucas Guimarães",27,"149","00:01:07.877","58,34km/h"]
[2,"Lucas Guimarães",27,"149","00:01:08.368","57,92km/h"]
[2,"Luciano Robervine",26,"108","00:01:15.887","52,18km/h"]
[2,"Luciano Robervine",26,"108","00:01:09.735","56,79km/h"]
[2,"Luciano Robervine",26,"108","00:01:18.860","50,22km/h"]
[2,"Luciano Robervine",26,"108","00:01:07.613","58,57km/h"]
[2,"Luciano Robervine",26,"108","00:01:07.460","58,7km/h"]
[2,"Luciano Robervine",26,"108","00:01:07.985","58,25km/h"]
[2,"Luciano Robervine",26,"108","00:01:08.212","58,05km/h"]
[2,"Luciano Robervine",26,"108","00:01:07.638","58,55km/h"]
[2,"Luciano Robervine",26,"108","00:01:07.708","58,49km/h"]
[2,"Luciano Robervine",26,"108","00:01:07.101","59,02km/h"]
[2,"Luciano Robervine",26,"108","00:01:07.119","59km/h"]
[2,"Luciano Robervine",26,"108","00:01:06.636","59,43km/h"]
[2,"Luciano Robervine",26,"108","00:01:06.963","59,14km/h"]
[2,"Luciano Robervine",26,"108","00:01:07.307","58,83km/h"]
[2,"Luciano Robervine",26,"108","00:01:07.676","58,51km/h"]
[2,"Luciano Robervine",26,"108","00:01:06.979","59,12km/h"]
[2,"Luciano Robervine",26,"108","00:01:07.168","58,96km/h"]
[2,"Luciano Robervine",26,"108","00:01:07.124","59km/h"]
[2,"Luciano Robervine",26,"108","00:01:06.843","59,24km/h"]
[2,"Luciano Robervine",26,"108","00:01:06.867","59,22km/h"]
[2,"Luciano Robervine",26,"108","00:01:06.609","59,45km/h"]
[2,"Luciano Robervine",26,"108","00:01:24.885","46,65km/h"]
[2,"Luciano Robervine",26,"108","00:01:07.884","58,33km/h"]
[2,"Luciano Robervine",26,"108","00:01:08.159","58,1km/h"]
[2,"Luciano Robervine",26,"108","00:01:07.323","58,82km/h"]
[2,"Luciano Robervine",26,"108","00:01:06.937","59,16km/h"]
[2,"Raphael Reis",26,"133","00:01:13.360","53,98km/h"]
[2,"Raphael Reis",26,"133","00:01:08.635","57,7km/h"]
[2,"Raphael Reis",26,"133","00:01:13.112","54,16km/h"]
[2,"Raphael Reis",26,"133","00:01:08.518","57,8km/h"]
[2,"Raphael Reis",26,"133","00:01:07.723","58,47km/h"]
[2,"Raphael Reis",26,"133","00:01:08.100","58,15km/h"]
[2,"Raphael Reis",26,"133","00:01:08.304","57,98km/h"]
[2,"Raphael Reis",26,"133","00:01:09.457","57,01km/h"]
[2,"Raphael Reis",26,"133","00:01:07.945","58,28km/h"]
[2,"Raphael Reis",26,"133","00:01:08.402","57,89km/h"]
[2,"Raphael Reis",26,"133","00:01:09.124","57,29km/h"]
[2,"Raphael Reis",26,"133","00:01:08.385","57,91km/h"]
[2,"Raphael Reis",26,"133","00:01:08.089","58,16km/h"]
[2,"Raphael Reis",26,"133","00:01:07.829","58,38km/h"]
[2,"Raphael Reis",26,"133","00:01:08.779","57,58km/h"]
[2,"Raphael Reis",26,"133","00:01:07.783","58,42km/h"]
[2,"Raphael Reis",26,"133","00:01:09.222","57,21km/h"]
[2,"Raphael Reis",26,"133","00:01:09.315","57,13km/h"]
[2,"Raphael Reis",26,"133","00:01:09.849","56,69km/h"]
[2,"Raphael Reis",26,"133","00:01:08.231","58,04km/h"]
[2,"Raphael Reis",26,"133","00:01:08.974","57,41km/h"]
[2,"Raphael Reis",26,"133","00:01:08.585","57,74km/h"]
[2,"Raphael Reis",26,"133","00:01:09.257","57,18km/h"]
[2,"Raphael Reis",26,"133","00:01:08.495","57,81km/h"]
[2,"Raphael Reis",26,"133","00:01:09.763","56,76km/h"]
[2,"Raphael Reis",26,"133","00:01:08.826","57,54km/h"]
[2,"Hélio Chagas",26,"119","00:01:18.708","50,31km/h"]
[2,"Hélio Chagas",26,"119","00:01:09.406","57,06km/h"]
[2,"Hélio Chagas",26,"119","00:01:08.700","57,64km/h"]
[2,"Hélio Chagas",26,"119","00:01:07.677","58,51km/h"]
[2,"Hélio Chagas",26,"119","00:01:14.143","53,41km/h"]
[2,"Hélio Chagas",26,"119","00:01:08.016","58,22km/h"]
[2,"Hélio Chagas",26,"119","00:01:09.534","56,95km/h"]
[2,"Hélio Chagas",26,"119","00:01:08.427","57,87km/h"]
[2,"Hélio Chagas",26,"119","00:01:07.906","58,32km/h"]
[2,"Hélio Chagas",26,"119","00:01:08.718","57,63km/h"]
[2,"Hélio Chagas",26,"119","00:01:07.784","58,42km/h"]
[2,"Hélio Chagas",26,"119","00:01:07.339","58,81km/h"]
[2,"Hélio Chagas",26,"119","00:01:09.296","57,15km/h"]
[2,"Hélio Chagas",26,"119","00:01:07.657","58,53km/h"]
[2,"Hélio Chagas",26,"119","00:01:07.884","58,33km/h"]
[2,"Hélio Chagas",26,"119","00:01:07.565","58,61km/h"]
[2,"Hélio Chagas",26,"119","00:01:07.722","58,47km/h"]
[2,"Hélio Chagas",26,"119","00:01:07.738","58,46km/h"]
[2,"Hélio Chagas",26,"119","00:01:08.480","57,83km/h"]
[2,"Hélio Chagas",26,"119","00:01:07.077","59,04km/h"]
[2,"Hélio Chagas",26,"119","00:01:07.189","58,94km/h"]
[2,"Hélio Chagas",26,"119","00:01:08.087","58,16km/h"]
[2,"Hélio Chagas",26,"119","00:01:09.287","57,15km/h"]
[2,"Hélio Chagas",26,"119","00:01:08.433","57,87km/h"]
[2,"Hélio Chagas",26,"119","00:01:09.940","56,62km/h"]
[2,"Hélio Chagas",26,"119","00:01:08.879","57,49km/h"]
[2,"Renato Amaral",26,"129","00:01:14.932","52,85km/h"]
[2,"Renato Amaral",26,"129","00:01:11.601","55,31km/h"]
[2,"Renato Amaral",26,"129","00:01:08.506","57,81km/h"]
[2,"Renato Amaral",26,"129","00:01:09.485","56,99km/h"]
[2,"Renato Amaral",26,"129","00:01:23.355","47,51km/h"]
[2,"Renato Amaral",26,"129","00:01:08.255","58,02km/h"]
[2,"Renato Amaral",26,"129","00:01:07.982","58,25km/h"]
[2,"Renato Amaral",26,"129","00:01:07.321","58,82km/h"]
[2,"Renato Amaral",26,"129","00:01:07.706","58,49km/h"]
[2,"Renato Amaral",26,"129","00:01:07.275","58,86km/h"]
[2,"Renato Amaral",26,"129","00:01:07.606","58,57km/h"]
[2,"Renato Amaral",26,"129","00:01:07.274","58,86km/h"]
[2,"Renato Amaral",26,"129","00:01:07.393","58,76km/h"]
[2,"Renato Amaral",26,"129","00:01:07.884","58,33km/h"]
[2,"Renato Amaral",26,"129","00:01:07.934","58,29km/h"]
[2,"Renato Amaral",26,"129","00:01:08.073","58,17km/h"]
[2,"Renato Amaral",26,"129","00:01:08.729","57,62km/h"]
[2,"Renato Amaral",26,"129","00:01:08.065","58,18km/h"]
[2,"Renato Amaral",26,"129","00:01:08.580","57,74km/h"]
[2,"Renato Amaral",26,"129","00:01:10.196","56,41km/h"]
[2,"Renato Amaral",26,"129","00:01:08.431","57,87km/h"]
[2,"Renato Amaral",26,"129","00:01:08.915","57,46km/h"]
[2,"Renato Amaral",26,"129","00:01:09.578","56,91km/h"]
[2,"Renato Amaral",26,"129","00:01:09.222","57,21km/h"]
[2,"Renato Amaral",26,"129","00:01:11.030","55,75km/h"]
[2,"Renato Amaral",26,"129","00:01:11.268","55,56km/h"]
[2,"Leandro Malias",26,"146","00:01:16.127","52,02km/h"]
[2,"Leandro Malias",26,"146","00:01:10.346","56,29km/h"]
[2,"Leandro Malias",26,"146","00:01:09.308","57,14km/h"]
[2,"Leandro Malias",26,"146","00:01:08.969","57,42km/h"]
[2,"Leandro Malias",26,"146","00:01:09.306","57,14km/h"]
[2,"Leandro Malias",26,"146","00:01:10.600","56,09km/h"]
[2,"Leandro Malias",26,"146","00:01:10.172","56,43km/h"]
[2,"Leandro Malias",26,"146","00:01:08.348","57,94km/h"]
[2,"Leandro Malias",26,"146","00:01:08.375","57,92km/h"]
[2,"Leandro Malias",26,"146","00:01:08.632","57,7km/h"]
[2,"Leandro Malias",26,"146","00:01:08.005","58,23km/h"]
[2,"Leandro Malias",26,"146","00:01:08.222","58,05km/h"]
[2,"Leandro Malias",26,"146","00:01:08.268","58,01km/h"]
[2,"Leandro Malias",26,"146","00:01:08.608","57,72km/h"]
[2,"Leandro Malias",26,"146","00:01:07.925","58,3km/h"]
[2,"Leandro Malias",26,"146","00:01:08.113","58,14km/h"]
[2,"Leandro Malias",26,"146","00:01:09.070","57,33km/h"]
[2,"Leandro Malias",26,"146","00:01:08.828","57,53km/h"]
[2,"Leandro Malias",26,"146","00:01:08.193","58,07km/h"]
[2,"Leandro Malias",26,"146","00:01:10.926","55,83km/h"]
[2,"Leandro Malias",26,"146","00:01:10.733","55,99km/h"]
[2,"Leandro Malias",26,"146","00:01:08.800","57,56km/h"]
[2,"Leandro Malias",26,"146","00:01:13.259","54,05km/h"]
[2,"Leandro Malias",26,"146","00:01:09.495","56,98km/h"]
[2,"Leandro Malias",26,"146","00:01:08.813","57,55km/h"]
[2,"Leandro Malias",26,"146","00:01:08.798","57,56km/h"]
[2,"Tati Marcondes",26,"122","00:01:17.427","51,14km/h"]
[2,"Tati Marcondes",26,"122","00:01:10.210","56,4km/h"]
[2,"Tati Marcondes",26,"122","00:01:09.080","57,32km/h"]
[2,"Tati Marcondes",26,"122","00:01:08.607","57,72km/h"]
[2,"Tati Marcondes",26,"122","00:01:09.538","56,95km/h"]
[2,"Tati Marcondes",26,"122","00:01:09.622","56,88km/h"]
[2,"Tati Marcondes",26,"122","00:01:09.816","56,72km/h"]
[2,"Tati Marcondes",26,"122","00:01:08.105","58,15km/h"]
[2,"Tati Marcondes",26,"122","00:01:08.862","57,51km/h"]
[2,"Tati Marcondes",26,"122","00:01:08.927","57,45km/h"]
[2,"Tati Marcondes",26,"122","00:01:08.025","58,21km/h"]
[2,"Tati Marcondes",26,"122","00:01:08.090","58,16km/h"]
[2,"Tati Marcondes",26,"122","00:01:08.358","57,93km/h"]
[2,"Tati Marcondes",26,"122","00:01:08.002","58,23km/h"]
[2,"Tati Marcondes",26,"122","00:01:08.332","57,95km/h"]
[2,"Tati Marcondes",26,"122","00:01:08.218","58,05km/h"]
[2,"Tati Marcondes",26,"122","00:01:10.059","56,52km/h"]
[2,"Tati Marcondes",26,"122","00:01:08.991","57,4km/h"]
[2,"Tati Marcondes",26,"122","00:01:08.393","57,9km/h"]
[2,"Tati Marcondes",26,"122","00:01:09.662","56,85km/h"]
[2,"Tati Marcondes",26,"122","00:01:09.884","56,67km/h"]
[2,"Tati Marcondes",26,"122","00:01:11.322","55,52km/h"]
[2,"Tati Marcondes",26,"122","00:01:14.671","53,03km/h"]
[2,"Tati Marcondes",26,"122","00:01:09.159","57,26km/h"]
[2,"Tati Marcondes",26,"122","00:01:09.567","56,92km/h"]
[2,"Tati Marcondes",26,"122","00:01:09.366","57,09km/h"]
[2,"Cláudio Naves",26,"134","00:01:17.483","51,11km/h"]
[2,"Cláudio Naves",26,"134","00:01:10.022","56,55km/h"]
[2,"Cláudio Naves",26,"134","00:01:09.608","56,89km/h"]
[2,"Cláudio Naves",26,"134","00:01:08.150","58,11km/h"]
[2,"Cláudio Naves",26,"134","00:01:09.545","56,94km/h"]
[2,"Cláudio Naves",26,"134","00:01:08.867","57,5km/h"]
[2,"Cláudio Naves",26,"134","00:01:08.639","57,69km/h"]
[2,"Cláudio Naves",26,"134","00:01:09.029","57,37km/h"]
[2,"Cláudio Naves",26,"134","00:01:09.351","57,1km/h"]
[2,"Cláudio Naves",26,"134","00:01:07.571","58,61km/h"]
[2,"Cláudio Naves",26,"134","00:01:08.377","57,91km/h"]
[2,"Cláudio Naves",26,"134","00:01:08.684","57,66km/h"]
[2,"Cláudio Naves",26,"134","00:01:09.236","57,2km/h"]
[2,"Cláudio Naves",26,"134","00:01:08.132","58,12km/h"]
[2,"Cláudio Naves",26,"134","00:01:09.037","57,36km/h"]
[2,"Cláudio Naves",26,"134","00:01:08.602","57,72km/h"]
[2,"Cláudio Naves",26,"134","00:01:08.482","57,83km/h"]
[2,"Cláudio Naves",26,"134","00:01:13.396","53,95km/h"]
[2,"Cláudio Naves",26,"134","00:01:09.999","56,57km/h"]
[2,"Cláudio Naves",26,"134","00:01:11.862","55,11km/h"]
[2,"Cláudio Naves",26,"134","00:01:11.725","55,21km/h"]
[2,"Cláudio Naves",26,"134","00:01:12.209","54,84km/h"]
[2,"Cláudio Naves",26,"134","00:01:09.905","56,65km/h"]
[2,"Cláudio Naves",26,"134","00:01:10.221","56,39km/h"]
[2,"Cláudio Naves",26,"134","00:01:11.871","55,1km/h"]
[2,"Cláudio Naves",26,"134","00:01:09.434","57,03km/h"]
[2,"Roberta Pifânio",24,"112","00:01:17.245","51,27km/h"]
[2,"Roberta Pifânio",24,"112","00:01:13.059","54,2km/h"]
[2,"Roberta Pifânio",24,"112","00:01:12.392","54,7km/h"]
[2,"Roberta Pifânio",24,"112","00:01:13.471","53,9km/h"]
[2,"Roberta Pifânio",24,"112","00:01:16.255","51,93km/h"]
[2,"Roberta Pifânio",24,"112","00:01:15.590","52,39km/h"]
[2,"Roberta Pifânio",24,"112","00:01:15.424","52,5km/h"]
[2,"Roberta Pifânio",24,"112","00:01:15.222","52,64km/h"]
[2,"Roberta Pifânio",24,"112","00:01:22.376","48,07km/h"]
[2,"Roberta Pifânio",24,"112","00:01:14.263","53,32km/h"]
[2,"Roberta Pifânio",24,"112","00:01:14.766","52,97km/h"]
[2,"Roberta Pifânio",24,"112","00:01:37.800","40,49km/h"]
[2,"Roberta Pifânio",24,"112","00:01:13.792","53,66km/h"]
[2,"Roberta Pifânio",24,"112","00:01:15.683","52,32km/h"]
[2,"Roberta Pifânio",24,"112","00:01:21.636","48,51km/h"]
[2,"Roberta Pifânio",24,"112","00:01:18.990","50,13km/h"]
[2,"Roberta Pifânio",24,"112","00:01:16.506","51,76km/h"]
[2,"Roberta Pifânio",24,"112","00:01:17.563","51,06km/h"]
[2,"Roberta Pifânio",24,"112","00:01:18.539","50,42km/h"]
[2,"Roberta Pifânio",24,"112","00:01:15.502","52,45km/h"]
[2,"Roberta Pifânio",24,"112","00:01:15.314","52,58km/h"]
[2,"Roberta Pifânio",24,"112","00:01:13.730","53,71km/h"]
[2,"Roberta Pifânio",24,"112","00:01:15.171","52,68km/h"]
[2,"Roberta Pifânio",24,"112","00:01:13.532","53,85km/h"]
[2,"Pedro Mello",18,"140","00:01:17.678","50,98km/h"]
[2,"Pedro Mello",18,"140","00:01:09.179","57,24km/h"]
[2,"Pedro Mello",18,"140","00:01:07.836","58,38km/h"]
[2,"Pedro Mello",18,"140","00:01:07.820","58,39km/h",null,null,null,null,null,null,null,null,"Volta Tm"]
[2,"Pedro Mello",18,"140","00:01:09.035","57,36km/h",null,null,null,null,null,null,null,null,8.2061342592592602E-4]
[2,"Pedro Mello",18,"140","00:01:06.869","59,22km/h",null,null,null,null,null,null,null,null,7.6031250000000014E-4]
[2,"Pedro Mello",18,"140","00:01:06.850","59,24km/h",null,null,null,null,null,null,null,null,7.5597222222222222E-4]
[2,"Pedro Mello",18,"140","00:01:08.442","57,86km/h",null,null,null,null,null,null,null,null,8.0030092592592598E-4]
[2,"Pedro Mello",18,"140","00:01:07.688","58,5km/h",null,null,null,null,null,null,null,null,7.3923611111111108E-4]
[2,"Pedro Mello",18,"140","00:01:08.484","57,82km/h",null,null,null,null,null,null,null,null,7.3579861111111112E-4]
[2,"Pedro Mello",18,"140","00:01:10.255","56,37km/h",null,null,null,null,null,null,null,null,7.5108796296296295E-4]
[2,"Pedro Mello",18,"140","00:01:08.155","58,1km/h",null,null,null,null,null,null,null,null,7.4093749999999995E-4]
[2,"Pedro Mello",18,"140","00:01:07.102","59,01km/h",null,null,null,null,null,null,null,null,7.393171296296297E-4]
[2,"Pedro Mello",18,"140","00:01:07.783","58,42km/h",null,null,null,null,null,null,null,null,7.3083333333333333E-4]
[2,"Pedro Mello",18,"140","00:01:08.833","57,53km/h",null,null,null,null,null,null,null,null,7.3564814814814803E-4]
[2,"Pedro Mello",18,"140","00:01:07.631","58,55km/h",null,null,null,null,null,null,null,null,7.5065972222222233E-4]
[2,"Pedro Mello",18,"140","00:01:08.679","57,66km/h",null,null,null,null,null,null,null,null,7.3281249999999996E-4]
[2,"Pedro Mello",18,"140","00:01:08.967","57,42km/h",null,null,null,null,null,null,null,null,7.3491898148148136E-4]
[2,"Eduardo Henrique",14,"125","00:01:15.541","52,42km/h",null,null,null,null,null,null,null,null,7.3047453703703696E-4]
[2,"Eduardo Henrique",14,"125","00:01:10.689","56,02km/h",null,null,null,null,null,null,null,null,7.2789351851851845E-4]
[2,"Eduardo Henrique",14,"125","00:01:07.615","58,57km/h",null,null,null,null,null,null,null,null,7.267708333333335E-4]
[2,"Eduardo Henrique",14,"125","00:01:08.073","58,17km/h",null,null,null,null,null,null,null,null,7.258564814814814E-4]
[2,"Eduardo Henrique",14,"125","00:01:10.350","56,29km/h",null,null,null,null,null,null,null,null,7.2362268518518511E-4]
[2,"Eduardo Henrique",14,"125","00:01:06.496","59,55km/h",null,null,null,null,null,null,null,null,7.2398148148148137E-4]
[2,"Eduardo Henrique",14,"125","00:01:07.105","59,01km/h",null,null,null,null,null,null,null,null,7.2565972222222227E-4]
[2,"Eduardo Henrique",14,"125","00:01:07.541","58,63km/h",null,null,null,null,null,null,null,null,7.3024305555555559E-4]
[2,"Eduardo Henrique",14,"125","00:01:07.132","58,99km/h",null,null,null,null,null,null,null,null,7.4228009259259267E-4]
[2,"Eduardo Henrique",14,"125","00:01:07.570","58,61km/h",null,null,null,null,null,null,null,null,7.3493055555555551E-4]
[2,"Eduardo Henrique",14,"125","00:01:06.534","59,52km/h",null,null,null,null,null,null,null,null,7.4624999999999995E-4]
[2,"Eduardo Henrique",14,"125","00:01:07.144","58,98km/h",null,null,null,null,null,null,null,null,7.3689814814814809E-4]
[2,"Eduardo Henrique",14,"125","00:01:06.938","59,16km/h",null,null,null,null,null,null,null,null,7.3586805555555558E-4]
[2,"Eduardo Henrique",14,"125","00:01:14.523","53,14km/h",null,null,null,null,null,null,null,null,7.457870370370371E-4]
[2,"Marcelo Chagas",14,"137","00:01:15.255","52,62km/h"]
[2,"Marcelo Chagas",14,"137","00:01:11.270","55,56km/h"]
[2,"Marcelo Chagas",14,"137","00:01:07.021","59,09km/h"]
[2,"Marcelo Chagas",14,"137","00:01:09.125","57,29km/h"]
[2,"Marcelo Chagas",14,"137","00:01:08.887","57,49km/h"]
[2,"Marcelo Chagas",14,"137","00:01:07.383","58,77km/h"]
[2,"Marcelo Chagas",14,"137","00:01:06.843","59,24km/h"]
[2,"Marcelo Chagas",14,"137","00:01:07.519","58,65km/h"]
[2,"Marcelo Chagas",14,"137","00:01:06.416","59,62km/h"]
[2,"Marcelo Chagas",14,"137","00:01:09.071","57,33km/h"]
[2,"Marcelo Chagas",14,"137","00:01:06.978","59,12km/h"]
[2,"Marcelo Chagas",14,"137","00:01:06.977","59,12km/h"]
[2,"Marcelo Chagas",14,"137","00:01:07.054","59,06km/h"]
[2,"Marcelo Chagas",14,"137","00:01:13.991","53,52km/h"]
[]
[]
[]
[]
[]
[]
[]
[]
[]
[]
[]
[]
[]
[]
[]
[]
[]
[]
[]
[]
[]
[]
[]
[]
[]
[]
[]
[]
[]
[]
[]
[]
[]
[]
[]
[]
[]
[]
[]
[]
[]
[]
[]
[]
[]
[]
[]
[]
[]
[]
[]
[]
[]
[]
[]
[]
[]
[]
[]
[]
[]
[]
[]
[]
[]
[]
[]
[]
[]
[]
[]
[]
[]
[]
[]
[]
[]
[]
[]
[]
[]
[]
[]
[]
[]
[]
[]
[]
[]
[]
[]
[]
[]
[]
[]
[]
[]
[]
[]
[]
[]
[]
[]
[]
[]
[]
[]
[]
[]
[]
[]
[]
[]
[]
[]
[]
[]
[]
[]
[]
[]
[]
[]
[]
[]
[]
[]
[]
[]
[]
[]
[]
[]
[]
[]
[]
[]
[]
[]
[]
[]
[]
[]
[]
[]
[]
[]
[]
[]
[]
[]
[]
[]
[]
[]
[]
[]
[]
[]
[]
[]
[]
[]
[]
[]
[]
[]
[]
[]
[]
[]
[]
[]
[]
[]
[]
[]
[]
[]
[]
[]
[]
[]
[]
[]
[]
[]
[]
[]
[]
[]
[]
[]
[]
[]
[]
[]
[]
[]
[]
[]
[]
[]
[]
[]
[]
[]
[]
[]
[]
[]
[]
[]
[]
[]
[]
[]
[]
[]
[]
[]
[]
[]
[]
[]
[]
[]
[]
[]
[]
[]
[]
[]
[]
[]
[]
[]
[]
[]
[]
[]
[]
[]
[]
[]
[]
[]
[]
[]
[]
[]
[]
[]
[]
[]
[]
[]
[]
[]
[]
[]
[]
[]
[]
[]
[]
[]
[]
[]
[]
[]
[]
[]
[]
[]
[]
[]
[]
[]
[]
[]
[]
[]
[]
[]
[]
[]
[]
[]
[]
[]
[]
[]
[]
[]
[]
[]
[]
[]
[]
[]
[]
[]
[]
[]
[]
[]
[]
[]
[]
[]
[]
[]
[]
[]
[]
[]
[]
[]
[]
[]
[]
[]
[]
[]
[]
[]
[]
[]
[]
[]
[]
[]
[]
[]
[]
[]
[]
[]
[]
[]
[]
[]
[]
[]
[]
[]
[]
[]
[]
[]
[]
[]
[]
[]
[]
[]
[]
[]
[]
[]
[]
[]
[]
[]
[]
[]
[]
[]
[]
[]
[]
[]
[]
[]
[]
[]
[]
[]
[]
[]
[]
[]
[]
[]
[]
[]
[]
[]
[]
[]
[]
[]
[]
[]
[]
[]
[]
[]
[]
[]
[]
[]
[]
[]
[]
[]
[]
[]
[]
[]
[]
[]
[]
[]
[]
[]
[]
[]
[]
[]
[]
[]
[]
[]
[]
[]
[]
[]
[]
[]
[]
[]
[]
[]
[]
[]
[]
[]
[]
[]
[]
[]
[]
[]
[]
[]
[]
[]
[]
[]
[]
[]
[]
[]
[]
[]
[]
[]
[]
[]
[]
[]
[]
[]
[]
[]
[]
[]
[]
[]
[]
[]
[]
[]
[]
[]
[]
[]
[]
[]
[]
[]
[]
[]
[]
[]
[]
[]
[]
[]
[]
[]
[]
[]
[]
[]
[]
[]
[]
[]
[]
[]
[]
[]
[]
[]
[]
[]
[]
[]
[]
[]
[]
[]
[]
[]
[]
[]
[]
[]
[]
[]
[]
[]
[]
[]
[]
[]
[]
[]
[]
[]
[]
[]
[]
[]
[]
[]
[]
[]
[]
[]
[]
[]
[]
[]
[]
[]
[]
[]
[]
[]
[]
[]
[]
[]
[]
[]
[]
[]
[]
[]
[]
[]
[]
[]
[]
[]
[]
[]
[]
[]
[]
[]
[]
[]
[]
[]
[]
[]
[]
[]
[]
[]
[]
[]
[]
[]
[]
[]
[]
[]
[]
[]
[]
[]
[]
[]
[]
[]
[]
[]
[]
[]
[]
[]
[]
[]
[]
[]
[]
[]
[]
[]
[]
[]
[]
[]
[]
[]
[]
[]
[]
[]
[]
[]
[]
[]
[]
[]
[]
[]
[]
[]
[]
[]
[]
[]
[]
[]
[]
[]
[]
[]
[]
[]
[]
[]
[]
[]
[]
[]
[]
[]
[]
[]
[]
[]
[]
[]
[]
[]
[]
[]
[]
[]
[]
[]
[]
[]
[]
[]
[]
[]
[]
[]
[]
[]
[]
[]
[]
[]
[]
[]
[]
[]
[]
[]
[]
[]
[]
[]
[]
[]
[]
[]
[]
[]
[]
[]
[]
[]
[]
[]
[]
[]
[]
[]
[]
[]
[]
[]
[]
[]
[]
[]
[]
[]
[]
[]
[]
[]
[]
[]
[]
[]
[]
[]
[]
[]
[]
[]
[]
[]
[]
[]
[]
[]
[]
[]
[]
[]
[]
[]
[]
[]
[]
[]
[]
[]
[]
[]
[]
[]
[]
[]
[]
[]
[]
[]
[]
[]
[]
[]
[]
[]
[]
[]
[]
[]
[]
[]
[]
[]
[]
[]
[]
[]
[]
[]
[]
[]
[]
[]
[null,null,null,null,null,null,null,null,null,null,null,"Volta Tm","Volta Tm"]
[]
[]
[]
[]
[]
[]
[]
[]
[]
[]
[]
[]
[]
[]
[]
[]
[]
[]
[]
[]
[]
[]
[]
[]
[]
[]
[]
[]
[]
[]
[]
[]
[]
[]
[]
[]
[]
[]
[]
[]
[]
[]
[]
[]
[]
[]
[]
[]
[]
[]
[]
[]
[]
[]
[]
[]
[]
[]
[]
[]
[]
[]
[]
[]
[]
[]
[]
[]
[]
[]
[]
[]
[]
[]
[]
[]
[]
[]
[]
[]
[]
[]
[]
[]
[]
[]
[]
[]
[]
[]
[]
[]
[]
[]
[]
[]
[]
[]
[]
[]
[]
[]
[]
[]
[]
[]
[]
[]
[]
[]
[]
[]
[]
[]
[]
[]
[]
[]
[]
[]
[]
[]
[]
[]
[]
[]
[]
[]
[]
[]
[]
[]
[]
[]
[]
[]
[]
[]
[]
[]
[]
[]
[]
[]
[]
[]
[]
[]
[]
[]
[]
[]
[]
[]
[]
[]
[]
[]
[]
[]
[]
[]
[]
[]
[]
[]
[]
[]
[]
[]
[]
[]
[]
[]
[]
[]
[]
[]
[]
[]
[]
[]
[]
[]
[]
[]
[]
[]
[]
[]
[]
[]
[]
[]
[]
[]
[]
[]
[]
[]
[]
[]
[]
[]
[]
[]
[]
[]
[]
[]
[]
[]
[]
[]
[]
[]
[]
[]
[]
[]
[]
[]
[]
[]
[]
[]
[]
[]
[]
[]
[]
[]
[]
[]
[]
[]
[]
[]
[]
[]
[]
[]
[]
[]
[]
[]
[]
[]
[]
[]
[]
[]
[]
[]
[]
[]
[]
[]
[]
[]
[]
[]
[]
[]
[]
[]
[]
[]
[]
[]
[]
[]
[]
[]
[]
[]
[]
[]
[]
[]
[]
[]
[]
[]
[]
[]
[]
[]
[]
[]
[]
[]
[]
[]
[]
[]
[]
[]
[]
[]
[]
[]
[]
[]
[]
[]
[]
[]
[]
[]
[]
[]
[]
[]
[]
[]
[]
[]
[]
[]
[]
[]
[]
[]
[]
[]
[]
[]
[]
[]
[]
["PILOTO","ULTRAPASSAGENS",null,null,"Volta Tm"]
["Wilson Cristofani",0,null,null,"00:01:20.779"]
["DIEGO RODRIGUES",0,null,null,"00:01:16.448"]
["Joanês Golveia",1,null,null,"00:01:17.289"]
["Alexandre Melillo",2,null,null,"00:01:16.127"]
["Andreson Souza",0,null,null,"00:01:16.755"]
["Rafael Miranda",2,null,null,"00:01:16.080"]
["Anderson Teixeira",3,null,null,"00:01:15.857"]
["Luciano Brandão",2,null,null,"00:01:16.520"]
["Lúcio Santos",7,null,null,"00:01:16.357"]
["Leandro Leite",3,null,null,"00:01:15.750"]
["Guilherme Gonsalves",2,null,null,"00:01:15.782"]
["Gladystone Reis",0,null,null,"00:01:16.504"]
["Aparecido Faria",5,null,null,"00:01:16.205"]
["José Filho",7,null,null,"00:01:15.674"]
["João Ferreira",7,null,null,"00:01:15.438"]
[null,7,null,null,"00:01:16.746"]
[null,null,null,null,"00:01:15.691"]
[null,null,null,null,"00:01:15.329"]
[null,null,null,null,"00:01:15.616"]
[null,null,null,null,"00:01:15.483"]
[null,null,null,null,"00:01:15.715"]
[null,null,null,null,"00:01:24.109"]
[null,null,null,null,"00:01:29.259"]
[null,null,null,null,"00:01:34.959"]
[null,null,null,null,"00:01:03.824"]
[null,null,null,null,"00:01:04.490"]
[null,null,null,null,"00:01:05.192"]
[null,null,null,null,"00:01:03.579"]
[null,null,null,null,"00:01:04.659"]
[null,null,null,null,6.2215277777777779E-4]
[null,null,null,null,6.2060185185185178E-4]
[null,null,null,null,6.2089120370370369E-4]
[null,null,null,null,6.1916666666666674E-4]
[null,null,null,null,6.287847222222222E-4]
[null,null,null,null,6.2924768518518505E-4]
[null,null,null,null,6.317824074074074E-4]
[null,null,null,null,6.3106481481481488E-4]

{"sheet":"ETAPA 1","index":10,"n_rows":2051,"n_cols":15,"rows_kept":2051,"cut":false,"hidden":false,"merged":[[0,0,0,5]]}
["Obs.: 1. Selecione o nome de um Piloto, 2. Com a tecla Ctrl pressionada, Selecione o seu nome e  3. Clique sobre o Gráfico (Habilite a macro)\n            Para as demais comparações Selecione o nome do Piloto e Clique sobre o Gráfico",null,null,null,null,null,"PILOTO",{"$f":"L$48","v":"Marcelo Campos"},{"$f":"M$48","v":"Marcelo Pereira"},{"$f":"A2","v":"Daniel Nahum"},null,null,"00:00:01"]
["Daniel Nahum",null,null,null,null,null,"MÉDIA",{"$f":"AVERAGE(L$49:L$105)","v":"00:01:10.389"},{"$f":"AVERAGE(M$49:M$105)","v":"00:01:11.528"},{"$f":"AVERAGE(N$49:N$105)","v":"00:01:10.288"},null,null,{"$f":"M1","v":"00:00:01"}]
["Marcelo Campos",null,null,null,null,null,"MAXIMA",{"$f":"LARGE(L$49:L$105,1)","v":"00:01:13.010"},{"$f":"LARGE(M$49:M$105,1)","v":"00:01:14.791"},{"$f":"LARGE(N$49:N$105,1)","v":"00:01:13.706"}]
["Marcelo Pereira",null,null,null,null,null,"MÍNIMA",{"$f":"SMALL(L$49:L$105,1)","v":"00:01:09.775"},{"$f":"SMALL(M$49:M$105,1)","v":"00:01:10.817"},{"$f":"SMALL(N$49:N$105,1)","v":"00:01:09.837"}]
["Luciano Robervine",null,null,null,null,null,"Desvio Padrão",{"$f":"_xlfn.STDEV.S(L$50:L$130)","v":"00:00:00.793"},{"$f":"_xlfn.STDEV.S(M$50:M$130)","v":"00:00:01.091"},{"$f":"_xlfn.STDEV.S(N$50:N$130)","v":"00:00:00.871"}]
["Frederico Papatella",null,null,null,null,null,"TEMPO TOTAL",{"$f":"SUM(L$49:L$105,1)","v":1.0146643055555555},{"$f":"SUM(M$49:M$105,1)","v":1.0149016203703705},{"$f":"SUM(N$49:N$105,1)","v":1.0146433449074075}]
["Jarbas Reis"]
["Rodrigo Mercadante"]
["Cláudio Dumont"]
["Guilherme Alves"]
["Wesley Bambirra"]
["Marcelo Marcondes"]
["Alexandre Melillo",null,null,null,null,null,null,null,null,{"$f":"SMALL(H4:J4,1)-K13","v":"00:01:09.525"},"00:00:00.250"]
["Tati Marcondes",null,null,null,null,null,null,null,null,{"$f":"LARGE(H3:J3,1)+K13","v":"00:01:15.041"}]
["Raphael Reis"]
["Marcelo Surerus"]
["Maurício Júnior"]
["Rodrigo Ricardo"]
["Renato Amaral"]
["Leandro Malias"]
["Marcelo Sant'anna"]
["Délcio Ragazzi"]
["Marcelo Chagas"]
["Reila Ricardo"]
["Hélio Chagas"]
["Cláudio Naves"]
["Bernardo Freitas"]
["Marcelo Clemente"]
["Wesley Canuto"]
[]
[]
[]
[]
[]
[]
[]
[]
[]
[]
[]
[]
[]
[]
[]
[]
[]
[]
[null,null,null,null,null,null,null,null,null,null,null,"Marcelo Campos","Marcelo Pereira","Daniel Nahum"]
[null,null,null,null,null,null,null,null,null,null,"NÚMERO VOLTAS","Marcelo Campos","Marcelo Pereira","Daniel Nahum"]
["ETAPA","PILOTO","NÚMERO VOLTAS","KART","Volta Tm","velocidade Media",null,null,null,null,1,"00:01:13.010","00:01:14.791","00:01:13.706"]
[1,"Daniel Nahum",18,"123","00:01:13.706","58,61km/h",null,null,null,null,2,"00:01:10.628","00:01:11.330","00:01:10.274"]
[1,"Daniel Nahum",18,"123","00:01:10.274","61,47km/h",null,null,null,null,3,"00:01:10.387","00:01:11.504","00:01:10.230"]
[1,"Daniel Nahum",18,"123","00:01:10.230","61,51km/h",null,null,null,null,4,"00:01:10.240","00:01:11.160","00:01:10.244"]
[1,"Daniel Nahum",18,"123","00:01:10.244","61,5km/h",null,null,null,null,5,"00:01:10.684","00:01:11.042","00:01:10.452"]
[1,"Daniel Nahum",18,"123","00:01:10.452","61,32km/h",null,null,null,null,6,"00:01:10.085","00:01:11.003","00:01:10.096"]
[1,"Daniel Nahum",18,"123","00:01:10.096","61,63km/h",null,null,null,null,7,"00:01:10.273","00:01:11.058","00:01:10.197"]
[1,"Daniel Nahum",18,"123","00:01:10.197","61,54km/h",null,null,null,null,8,"00:01:10.182","00:01:10.914","00:01:10.202"]
[1,"Daniel Nahum",18,"123","00:01:10.202","61,54km/h",null,null,null,null,9,"00:01:09.989","00:01:11.322","00:01:09.951"]
[1,"Daniel Nahum",18,"123","00:01:09.951","61,76km/h",null,null,null,null,10,"00:01:09.909","00:01:10.919","00:01:10.010"]
[1,"Daniel Nahum",18,"123","00:01:10.010","61,71km/h",null,null,null,null,11,"00:01:09.927","00:01:10.817","00:01:09.873"]
[1,"Daniel Nahum",18,"123","00:01:09.873","61,83km/h",null,null,null,null,12,"00:01:10.016","00:01:11.171","00:01:10.064"]
[1,"Daniel Nahum",18,"123","00:01:10.064","61,66km/h",null,null,null,null,13,"00:01:10.089","00:01:10.854","00:01:10.030"]
[1,"Daniel Nahum",18,"123","00:01:10.030","61,69km/h",null,null,null,null,14,"00:01:09.899","00:01:11.071","00:01:09.886"]
[1,"Daniel Nahum",18,"123","00:01:09.886","61,81km/h",null,null,null,null,15,"00:01:09.984","00:01:11.434","00:01:09.989"]
[1,"Daniel Nahum",18,"123","00:01:09.989","61,72km/h",null,null,null,null,16,"00:01:09.775","00:01:11.454","00:01:09.837"]
[1,"Daniel Nahum",18,"123","00:01:09.837","61,86km/h",null,null,null,null,17,"00:01:10.173","00:01:11.562","00:01:09.849"]
[1,"Daniel Nahum",18,"123","00:01:09.849","61,85km/h",null,null,null,null,18,"00:01:11.746","00:01:14.094","00:01:10.295"]
[1,"Daniel Nahum",18,"123","00:01:10.295","61,46km/h",null,null,null,null,19]
[1,"Marcelo Campos",18,"104","00:01:13.010","59,17km/h",null,null,null,null,20]
[1,"Marcelo Campos",18,"104","00:01:10.628","61,17km/h",null,null,null,null,21]
[1,"Marcelo Campos",18,"104","00:01:10.387","61,37km/h",null,null,null,null,22]
[1,"Marcelo Campos",18,"104","00:01:10.240","61,5km/h",null,null,null,null,23]
[1,"Marcelo Campos",18,"104","00:01:10.684","61,12km/h",null,null,null,null,24]
[1,"Marcelo Campos",18,"104","00:01:10.085","61,64km/h",null,null,null,null,25]
[1,"Marcelo Campos",18,"104","00:01:10.273","61,47km/h",null,null,null,null,26]
[1,"Marcelo Campos",18,"104","00:01:10.182","61,55km/h",null,null,null,null,27]
[1,"Marcelo Campos",18,"104","00:01:09.989","61,72km/h",null,null,null,null,28]
[1,"Marcelo Campos",18,"104","00:01:09.909","61,79km/h",null,null,null,null,29]
[1,"Marcelo Campos",18,"104","00:01:09.927","61,78km/h",null,null,null,null,30]
[1,"Marcelo Campos",18,"104","00:01:10.016","61,7km/h",null,null,null,null,31]
[1,"Marcelo Campos",18,"104","00:01:10.089","61,64km/h",null,null,null,null,32]
[1,"Marcelo Campos",18,"104","00:01:09.899","61,8km/h",null,null,null,null,33]
[1,"Marcelo Campos",18,"104","00:01:09.984","61,73km/h",null,null,null,null,34]
[1,"Marcelo Campos",18,"104","00:01:09.775","61,91km/h",null,null,null,null,35]
[1,"Marcelo Campos",18,"104","00:01:10.173","61,56km/h",null,null,null,null,36]
[1,"Marcelo Campos",18,"104","00:01:11.746","60,21km/h",null,null,null,null,37]
[1,"Marcelo Pereira",18,"133","00:01:14.791","57,76km/h",null,null,null,null,38]
[1,"Marcelo Pereira",18,"133","00:01:11.330","60,56km/h",null,null,null,null,39]
[1,"Marcelo Pereira",18,"133","00:01:11.504","60,42km/h",null,null,null,null,40]
[1,"Marcelo Pereira",18,"133","00:01:11.160","60,71km/h",null,null,null,null,41]
[1,"Marcelo Pereira",18,"133","00:01:11.042","60,81km/h",null,null,null,null,42]
[1,"Marcelo Pereira",18,"133","00:01:11.003","60,84km/h",null,null,null,null,43]
[1,"Marcelo Pereira",18,"133","00:01:11.058","60,8km/h",null,null,null,null,44]
[1,"Marcelo Pereira",18,"133","00:01:10.914","60,92km/h",null,null,null,null,45]
[1,"Marcelo Pereira",18,"133","00:01:11.322","60,57km/h",null,null,null,null,46]
[1,"Marcelo Pereira",18,"133","00:01:10.919","60,91km/h",null,null,null,null,47]
[1,"Marcelo Pereira",18,"133","00:01:10.817","61km/h",null,null,null,null,48]
[1,"Marcelo Pereira",18,"133","00:01:11.171","60,7km/h",null,null,null,null,49]
[1,"Marcelo Pereira",18,"133","00:01:10.854","60,97km/h",null,null,null,null,50]
[1,"Marcelo Pereira",18,"133","00:01:11.071","60,78km/h",null,null,null,null,51]
[1,"Marcelo Pereira",18,"133","00:01:11.434","60,48km/h",null,null,null,null,52]
[1,"Marcelo Pereira",18,"133","00:01:11.454","60,46km/h",null,null,null,null,53]
[1,"Marcelo Pereira",18,"133","00:01:11.562","60,37km/h",null,null,null,null,54]
[1,"Marcelo Pereira",18,"133","00:01:14.094","58,3km/h",null,null,null,null,55]
[1,"Luciano Robervine",18,"124","00:01:14.499","57,99km/h",null,null,null,null,56]
[1,"Luciano Robervine",18,"124","00:01:11.539","60,39km/h",null,null,null,null,57]
[1,"Luciano Robervine",18,"124","00:01:11.425","60,48km/h",null,null,null,null,58]
[1,"Luciano Robervine",18,"124","00:01:11.114","60,75km/h",null,null,null,null,59]
[1,"Luciano Robervine",18,"124","00:01:10.975","60,87km/h",null,null,null,null,60]
[1,"Luciano Robervine",18,"124","00:01:11.100","60,76km/h",null,null,null,null,61]
[1,"Luciano Robervine",18,"124","00:01:11.004","60,84km/h",null,null,null,null,62]
[1,"Luciano Robervine",18,"124","00:01:11.096","60,76km/h",null,null,null,null,63]
[1,"Luciano Robervine",18,"124","00:01:11.234","60,65km/h"]
[1,"Luciano Robervine",18,"124","00:01:10.892","60,94km/h"]
[1,"Luciano Robervine",18,"124","00:01:10.927","60,91km/h"]
[1,"Luciano Robervine",18,"124","00:01:11.119","60,74km/h"]
[1,"Luciano Robervine",18,"124","00:01:10.781","61,03km/h"]
[1,"Luciano Robervine",18,"124","00:01:11.138","60,73km/h"]
[1,"Luciano Robervine",18,"124","00:01:11.715","60,24km/h"]
[1,"Luciano Robervine",18,"124","00:01:11.682","60,27km/h"]
[1,"Luciano Robervine",18,"124","00:01:11.551","60,38km/h"]
[1,"Luciano Robervine",18,"124","00:01:13.982","58,39km/h"]
[1,"Frederico Papatella",18,"129","00:01:15.444","57,26km/h"]
[1,"Frederico Papatella",18,"129","00:01:12.367","59,7km/h"]
[1,"Frederico Papatella",18,"129","00:01:12.587","59,51km/h"]
[1,"Frederico Papatella",18,"129","00:01:11.491","60,43km/h"]
[1,"Frederico Papatella",18,"129","00:01:10.735","61,07km/h"]
[1,"Frederico Papatella",18,"129","00:01:11.493","60,43km/h"]
[1,"Frederico Papatella",18,"129","00:01:10.829","60,99km/h"]
[1,"Frederico Papatella",18,"129","00:01:10.883","60,95km/h"]
[1,"Frederico Papatella",18,"129","00:01:11.102","60,76km/h"]
[1,"Frederico Papatella",18,"129","00:01:10.886","60,94km/h"]
[1,"Frederico Papatella",18,"129","00:01:10.988","60,86km/h"]
[1,"Frederico Papatella",18,"129","00:01:10.962","60,88km/h"]
[1,"Frederico Papatella",18,"129","00:01:10.757","61,05km/h"]
[1,"Frederico Papatella",18,"129","00:01:10.662","61,14km/h"]
[1,"Frederico Papatella",18,"129","00:01:10.744","61,07km/h"]
[1,"Frederico Papatella",18,"129","00:01:10.915","60,92km/h"]
[1,"Frederico Papatella",18,"129","00:01:10.890","60,94km/h"]
[1,"Frederico Papatella",18,"129","00:01:13.150","59,06km/h"]
[1,"Jarbas Reis",18,"144","00:01:15.998","56,84km/h"]
[1,"Jarbas Reis",18,"144","00:01:13.801","58,54km/h"]
[1,"Jarbas Reis",18,"144","00:01:11.785","60,18km/h"]
[1,"Jarbas Reis",18,"144","00:01:12.553","59,54km/h"]
[1,"Jarbas Reis",18,"144","00:01:12.071","59,94km/h"]
[1,"Jarbas Reis",18,"144","00:01:11.086","60,77km/h"]
[1,"Jarbas Reis",18,"144","00:01:12.401","59,67km/h"]
[1,"Jarbas Reis",18,"144","00:01:11.096","60,76km/h"]
[1,"Jarbas Reis",18,"144","00:01:10.655","61,14km/h"]
[1,"Jarbas Reis",18,"144","00:01:10.627","61,17km/h"]
[1,"Jarbas Reis",18,"144","00:01:10.634","61,16km/h"]
[1,"Jarbas Reis",18,"144","00:01:10.437","61,33km/h"]
[1,"Jarbas Reis",18,"144","00:01:10.216","61,52km/h"]
[1,"Jarbas Reis",18,"144","00:01:10.315","61,44km/h"]
[1,"Jarbas Reis",18,"144","00:01:11.284","60,6km/h"]
[1,"Jarbas Reis",18,"144","00:01:10.689","61,11km/h"]
[1,"Jarbas Reis",18,"144","00:01:10.498","61,28km/h"]
[1,"Jarbas Reis",18,"144","00:01:11.246","60,63km/h"]
[1,"Rodrigo Mercadante",18,"140","00:01:15.508","57,21km/h"]
[1,"Rodrigo Mercadante",18,"140","00:01:13.467","58,8km/h"]
[1,"Rodrigo Mercadante",18,"140","00:01:12.253","59,79km/h"]
[1,"Rodrigo Mercadante",18,"140","00:01:12.672","59,45km/h"]
[1,"Rodrigo Mercadante",18,"140","00:01:11.606","60,33km/h"]
[1,"Rodrigo Mercadante",18,"140","00:01:11.214","60,66km/h"]
[1,"Rodrigo Mercadante",18,"140","00:01:11.049","60,8km/h"]
[1,"Rodrigo Mercadante",18,"140","00:01:10.646","61,15km/h"]
[1,"Rodrigo Mercadante",18,"140","00:01:11.009","60,84km/h"]
[1,"Rodrigo Mercadante",18,"140","00:01:11.047","60,8km/h"]
[1,"Rodrigo Mercadante",18,"140","00:01:10.951","60,89km/h"]
[1,"Rodrigo Mercadante",18,"140","00:01:10.473","61,3km/h"]
[1,"Rodrigo Mercadante",18,"140","00:01:10.868","60,96km/h"]
[1,"Rodrigo Mercadante",18,"140","00:01:11.143","60,72km/h"]
[1,"Rodrigo Mercadante",18,"140","00:01:11.853","60,12km/h"]
[1,"Rodrigo Mercadante",18,"140","00:01:10.479","61,29km/h"]
[1,"Rodrigo Mercadante",18,"140","00:01:10.446","61,32km/h"]
[1,"Rodrigo Mercadante",18,"140","00:01:11.341","60,55km/h"]
[1,"Cláudio Dumont",18,"120","00:01:15.464","57,25km/h"]
[1,"Cláudio Dumont",18,"120","00:01:12.460","59,62km/h"]
[1,"Cláudio Dumont",18,"120","00:01:12.396","59,67km/h"]
[1,"Cláudio Dumont",18,"120","00:01:12.063","59,95km/h"]
[1,"Cláudio Dumont",18,"120","00:01:10.822","61km/h"]
[1,"Cláudio Dumont",18,"120","00:01:11.959","60,03km/h"]
[1,"Cláudio Dumont",18,"120","00:01:11.229","60,65km/h"]
[1,"Cláudio Dumont",18,"120","00:01:10.976","60,87km/h"]
[1,"Cláudio Dumont",18,"120","00:01:10.961","60,88km/h"]
[1,"Cláudio Dumont",18,"120","00:01:11.132","60,73km/h"]
[1,"Cláudio Dumont",18,"120","00:01:10.992","60,85km/h"]
[1,"Cláudio Dumont",18,"120","00:01:11.055","60,8km/h"]
[1,"Cláudio Dumont",18,"120","00:01:10.931","60,9km/h"]
[1,"Cláudio Dumont",18,"120","00:01:11.136","60,73km/h"]
[1,"Cláudio Dumont",18,"120","00:01:12.213","59,82km/h"]
[1,"Cláudio Dumont",18,"120","00:01:10.625","61,17km/h"]
[1,"Cláudio Dumont",18,"120","00:01:10.873","60,95km/h"]
[1,"Cláudio Dumont",18,"120","00:01:11.084","60,77km/h"]
[1,"Guilherme Alves",18,"126","00:01:14.760","57,78km/h"]
[1,"Guilherme Alves",18,"126","00:01:12.992","59,18km/h"]
[1,"Guilherme Alves",18,"126","00:01:11.815","60,15km/h"]
[1,"Guilherme Alves",18,"126","00:01:11.867","60,11km/h"]
[1,"Guilherme Alves",18,"126","00:01:11.800","60,17km/h"]
[1,"Guilherme Alves",18,"126","00:01:12.237","59,8km/h"]
[1,"Guilherme Alves",18,"126","00:01:11.850","60,13km/h"]
[1,"Guilherme Alves",18,"126","00:01:11.057","60,8km/h"]
[1,"Guilherme Alves",18,"126","00:01:11.063","60,79km/h"]
[1,"Guilherme Alves",18,"126","00:01:11.111","60,75km/h"]
[1,"Guilherme Alves",18,"126","00:01:11.344","60,55km/h"]
[1,"Guilherme Alves",18,"126","00:01:10.983","60,86km/h"]
[1,"Guilherme Alves",18,"126","00:01:11.041","60,81km/h"]
[1,"Guilherme Alves",18,"126","00:01:11.571","60,36km/h"]
[1,"Guilherme Alves",18,"126","00:01:11.154","60,71km/h"]
[1,"Guilherme Alves",18,"126","00:01:11.182","60,69km/h"]
[1,"Guilherme Alves",18,"126","00:01:11.281","60,61km/h"]
[1,"Guilherme Alves",18,"126","00:01:11.527","60,4km/h"]
[1,"Wesley Bambirra",18,"139","00:01:15.554","57,18km/h"]
[1,"Wesley Bambirra",18,"139","00:01:13.593","58,7km/h"]
[1,"Wesley Bambirra",18,"139","00:01:11.607","60,33km/h"]
[1,"Wesley Bambirra",18,"139","00:01:12.264","59,78km/h"]
[1,"Wesley Bambirra",18,"139","00:01:11.756","60,2km/h"]
[1,"Wesley Bambirra",18,"139","00:01:11.215","60,66km/h"]
[1,"Wesley Bambirra",18,"139","00:01:13.779","58,55km/h"]
[1,"Wesley Bambirra",18,"139","00:01:11.301","60,59km/h"]
[1,"Wesley Bambirra",18,"139","00:01:11.051","60,8km/h"]
[1,"Wesley Bambirra",18,"139","00:01:11.372","60,53km/h"]
[1,"Wesley Bambirra",18,"139","00:01:10.993","60,85km/h"]
[1,"Wesley Bambirra",18,"139","00:01:10.894","60,94km/h"]
[1,"Wesley Bambirra",18,"139","00:01:11.119","60,74km/h"]
[1,"Wesley Bambirra",18,"139","00:01:11.807","60,16km/h"]
[1,"Wesley Bambirra",18,"139","00:01:11.947","60,04km/h"]
[1,"Wesley Bambirra",18,"139","00:01:10.831","60,99km/h"]
[1,"Wesley Bambirra",18,"139","00:01:11.056","60,8km/h"]
[1,"Wesley Bambirra",18,"139","00:01:11.306","60,58km/h"]
[1,"Marcelo Marcondes",18,"117","00:01:15.099","57,52km/h"]
[1,"Marcelo Marcondes",18,"117","00:01:12.946","59,22km/h"]
[1,"Marcelo Marcondes",18,"117","00:01:12","60km/h"]
[1,"Marcelo Marcondes",18,"117","00:01:11.469","60,45km/h"]
[1,"Marcelo Marcondes",18,"117","00:01:11.797","60,17km/h"]
[1,"Marcelo Marcondes",18,"117","00:01:12.695","59,43km/h"]
[1,"Marcelo Marcondes",18,"117","00:01:15.083","57,54km/h"]
[1,"Marcelo Marcondes",18,"117","00:01:11.943","60,05km/h"]
[1,"Marcelo Marcondes",18,"117","00:01:11.072","60,78km/h"]
[1,"Marcelo Marcondes",18,"117","00:01:11.251","60,63km/h"]
[1,"Marcelo Marcondes",18,"117","00:01:11.082","60,77km/h"]
[1,"Marcelo Marcondes",18,"117","00:01:10.713","61,09km/h"]
[1,"Marcelo Marcondes",18,"117","00:01:11.025","60,82km/h"]
[1,"Marcelo Marcondes",18,"117","00:01:11.337","60,56km/h"]
[1,"Marcelo Marcondes",18,"117","00:01:11.475","60,44km/h"]
[1,"Marcelo Marcondes",18,"117","00:01:10.626","61,17km/h"]
[1,"Marcelo Marcondes",18,"117","00:01:11.201","60,67km/h"]
[1,"Marcelo Marcondes",18,"117","00:01:11.799","60,17km/h"]
[1,"Alexandre Melillo",18,"113","00:01:15.014","57,59km/h"]
[1,"Alexandre Melillo",18,"113","00:01:13.842","58,5km/h"]
[1,"Alexandre Melillo",18,"113","00:01:11.780","60,18km/h"]
[1,"Alexandre Melillo",18,"113","00:01:13.046","59,14km/h"]
[1,"Alexandre Melillo",18,"113","00:01:12.034","59,97km/h"]
[1,"Alexandre Melillo",18,"113","00:01:11.086","60,77km/h"]
[1,"Alexandre Melillo",18,"113","00:01:12.296","59,75km/h"]
[1,"Alexandre Melillo",18,"113","00:01:11.168","60,7km/h"]
[1,"Alexandre Melillo",18,"113","00:01:11.083","60,77km/h"]
[1,"Alexandre Melillo",18,"113","00:01:11.294","60,59km/h"]
[1,"Alexandre Melillo",18,"113","00:01:10.975","60,87km/h"]
[1,"Alexandre Melillo",18,"113","00:01:10.982","60,86km/h"]
[1,"Alexandre Melillo",18,"113","00:01:11.028","60,82km/h"]
[1,"Alexandre Melillo",18,"113","00:01:11.100","60,76km/h"]
[1,"Alexandre Melillo",18,"113","00:01:11.425","60,48km/h"]
[1,"Alexandre Melillo",18,"113","00:01:11.216","60,66km/h"]
[1,"Alexandre Melillo",18,"113","00:01:11.011","60,84km/h"]
[1,"Alexandre Melillo",18,"113","00:01:12.841","59,31km/h"]
[1,"Tati Marcondes",18,"116","00:01:16.563","56,42km/h"]
[1,"Tati Marcondes",18,"116","00:01:12.191","59,84km/h"]
[1,"Tati Marcondes",18,"116","00:01:12.183","59,85km/h"]
[1,"Tati Marcondes",18,"116","00:01:14.624","57,89km/h"]
[1,"Tati Marcondes",18,"116","00:01:11.472","60,44km/h"]
[1,"Tati Marcondes",18,"116","00:01:11.220","60,66km/h"]
[1,"Tati Marcondes",18,"116","00:01:12.054","59,96km/h"]
[1,"Tati Marcondes",18,"116","00:01:11.861","60,12km/h"]
[1,"Tati Marcondes",18,"116","00:01:10.910","60,92km/h"]
[1,"Tati Marcondes",18,"116","00:01:11.340","60,56km/h"]
[1,"Tati Marcondes",18,"116","00:01:11.127","60,74km/h"]
[1,"Tati Marcondes",18,"116","00:01:11.239","60,64km/h"]
[1,"Tati Marcondes",18,"116","00:01:11.191","60,68km/h"]
[1,"Tati Marcondes",18,"116","00:01:11.228","60,65km/h"]
[1,"Tati Marcondes",18,"116","00:01:11.171","60,7km/h"]
[1,"Tati Marcondes",18,"116","00:01:11.612","60,33km/h"]
[1,"Tati Marcondes",18,"116","00:01:11.114","60,75km/h"]
[1,"Tati Marcondes",18,"116","00:01:11.196","60,68km/h"]
[1,"Raphael Reis",18,"105","00:01:16.837","56,22km/h"]
[1,"Raphael Reis",18,"105","00:01:12.922","59,24km/h"]
[1,"Raphael Reis",18,"105","00:01:12.670","59,45km/h"]
[1,"Raphael Reis",18,"105","00:01:12.744","59,39km/h"]
[1,"Raphael Reis",18,"105","00:01:12.188","59,84km/h"]
[1,"Raphael Reis",18,"105","00:01:11.639","60,3km/h"]
[1,"Raphael Reis",18,"105","00:01:12.477","59,61km/h"]
[1,"Raphael Reis",18,"105","00:01:11.408","60,5km/h"]
[1,"Raphael Reis",18,"105","00:01:12.179","59,85km/h"]
[1,"Raphael Reis",18,"105","00:01:11.745","60,21km/h"]
[1,"Raphael Reis",18,"105","00:01:11.757","60,2km/h"]
[1,"Raphael Reis",18,"105","00:01:11.893","60,09km/h"]
[1,"Raphael Reis",18,"105","00:01:11.538","60,39km/h"]
[1,"Raphael Reis",18,"105","00:01:11.881","60,1km/h"]
[1,"Raphael Reis",18,"105","00:01:11.585","60,35km/h"]
[1,"Raphael Reis",18,"105","00:01:11.719","60,24km/h"]
[1,"Raphael Reis",18,"105","00:01:11.541","60,38km/h"]
[1,"Raphael Reis",18,"105","00:01:11.653","60,29km/h"]
[1,"Marcelo Surerus",18,"122","00:01:15.516","57,21km/h"]
[1,"Marcelo Surerus",18,"122","00:01:12.448","59,63km/h"]
[1,"Marcelo Surerus",18,"122","00:01:13.182","59,03km/h"]
[1,"Marcelo Surerus",18,"122","00:01:13.140","59,06km/h"]
[1,"Marcelo Surerus",18,"122","00:01:12.182","59,85km/h"]
[1,"Marcelo Surerus",18,"122","00:01:11.096","60,76km/h"]
[1,"Marcelo Surerus",18,"122","00:01:18.652","54,93km/h"]
[1,"Marcelo Surerus",18,"122","00:01:11.075","60,78km/h"]
[1,"Marcelo Surerus",18,"122","00:01:11.928","60,06km/h"]
[1,"Marcelo Surerus",18,"122","00:01:12.761","59,37km/h"]
[1,"Marcelo Surerus",18,"122","00:01:12.769","59,37km/h"]
[1,"Marcelo Surerus",18,"122","00:01:11.307","60,58km/h"]
[1,"Marcelo Surerus",18,"122","00:01:11.712","60,24km/h"]
[1,"Marcelo Surerus",18,"122","00:01:11.294","60,59km/h"]
[1,"Marcelo Surerus",18,"122","00:01:11.931","60,06km/h"]
[1,"Marcelo Surerus",18,"122","00:01:11.253","60,63km/h"]
[1,"Marcelo Surerus",18,"122","00:01:11.321","60,57km/h"]
[1,"Marcelo Surerus",18,"122","00:01:11.332","60,56km/h"]
[1,"Maurício Júnior",18,"114","00:01:16.380","56,56km/h"]
[1,"Maurício Júnior",18,"114","00:01:12.923","59,24km/h"]
[1,"Maurício Júnior",18,"114","00:01:12.680","59,44km/h"]
[1,"Maurício Júnior",18,"114","00:01:12.913","59,25km/h"]
[1,"Maurício Júnior",18,"114","00:01:12.333","59,72km/h"]
[1,"Maurício Júnior",18,"114","00:01:12.137","59,89km/h"]
[1,"Maurício Júnior",18,"114","00:01:11.945","60,05km/h"]
[1,"Maurício Júnior",18,"114","00:01:12.190","59,84km/h"]
[1,"Maurício Júnior",18,"114","00:01:12.245","59,8km/h"]
[1,"Maurício Júnior",18,"114","00:01:13.347","58,9km/h"]
[1,"Maurício Júnior",18,"114","00:01:12.713","59,41km/h"]
[1,"Maurício Júnior",18,"114","00:01:11.425","60,48km/h"]
[1,"Maurício Júnior",18,"114","00:01:11.734","60,22km/h"]
[1,"Maurício Júnior",18,"114","00:01:11.553","60,37km/h"]
[1,"Maurício Júnior",18,"114","00:01:11.612","60,33km/h"]
[1,"Maurício Júnior",18,"114","00:01:11.501","60,42km/h"]
[1,"Maurício Júnior",18,"114","00:01:11.954","60,04km/h"]
[1,"Maurício Júnior",18,"114","00:01:11.525","60,4km/h"]
[1,"Rodrigo Ricardo",18,"141","00:01:16.812","56,24km/h"]
[1,"Rodrigo Ricardo",18,"141","00:01:13.147","59,06km/h"]
[1,"Rodrigo Ricardo",18,"141","00:01:12.807","59,33km/h"]
[1,"Rodrigo Ricardo",18,"141","00:01:12.635","59,48km/h"]
[1,"Rodrigo Ricardo",18,"141","00:01:12.253","59,79km/h"]
[1,"Rodrigo Ricardo",18,"141","00:01:12.084","59,93km/h"]
[1,"Rodrigo Ricardo",18,"141","00:01:13.128","59,07km/h"]
[1,"Rodrigo Ricardo",18,"141","00:01:12.087","59,93km/h"]
[1,"Rodrigo Ricardo",18,"141","00:01:12.066","59,95km/h"]
[1,"Rodrigo Ricardo",18,"141","00:01:13.553","58,73km/h"]
[1,"Rodrigo Ricardo",18,"141","00:01:13.601","58,69km/h"]
[1,"Rodrigo Ricardo",18,"141","00:01:11.345","60,55km/h"]
[1,"Rodrigo Ricardo",18,"141","00:01:11.510","60,41km/h"]
[1,"Rodrigo Ricardo",18,"141","00:01:11.724","60,23km/h"]
[1,"Rodrigo Ricardo",18,"141","00:01:11.755","60,2km/h"]
[1,"Rodrigo Ricardo",18,"141","00:01:11.318","60,57km/h"]
[1,"Rodrigo Ricardo",18,"141","00:01:11.859","60,12km/h"]
[1,"Rodrigo Ricardo",18,"141","00:01:11.438","60,47km/h"]
[1,"Renato Amaral",18,"101","00:01:18.199","55,24km/h"]
[1,"Renato Amaral",18,"101","00:01:13.481","58,79km/h"]
[1,"Renato Amaral",18,"101","00:01:12.744","59,39km/h"]
[1,"Renato Amaral",18,"101","00:01:12.670","59,45km/h"]
[1,"Renato Amaral",18,"101","00:01:11.930","60,06km/h"]
[1,"Renato Amaral",18,"101","00:01:12.290","59,76km/h"]
[1,"Renato Amaral",18,"101","00:01:12.038","59,97km/h"]
[1,"Renato Amaral",18,"101","00:01:12.054","59,96km/h"]
[1,"Renato Amaral",18,"101","00:01:12.600","59,5km/h"]
[1,"Renato Amaral",18,"101","00:01:12.667","59,45km/h"]
[1,"Renato Amaral",18,"101","00:01:13.122","59,08km/h"]
[1,"Renato Amaral",18,"101","00:01:11.924","60,06km/h"]
[1,"Renato Amaral",18,"101","00:01:13.059","59,13km/h"]
[1,"Renato Amaral",18,"101","00:01:12.024","59,98km/h"]
[1,"Renato Amaral",18,"101","00:01:11.942","60,05km/h"]
[1,"Renato Amaral",18,"101","00:01:12.220","59,82km/h"]
[1,"Renato Amaral",18,"101","00:01:12.028","59,98km/h"]
[1,"Renato Amaral",18,"101","00:01:12.075","59,94km/h"]
[1,"Leandro Malias",18,"111","00:01:18.168","55,27km/h"]
[1,"Leandro Malias",18,"111","00:01:13.561","58,73km/h"]
[1,"Leandro Malias",18,"111","00:01:13.614","58,68km/h"]
[1,"Leandro Malias",18,"111","00:01:13.039","59,15km/h"]
[1,"Leandro Malias",18,"111","00:01:11.898","60,09km/h"]
[1,"Leandro Malias",18,"111","00:01:12.091","59,92km/h"]
[1,"Leandro Malias",18,"111","00:01:12.675","59,44km/h"]
[1,"Leandro Malias",18,"111","00:01:11.616","60,32km/h"]
[1,"Leandro Malias",18,"111","00:01:11.790","60,18km/h"]
[1,"Leandro Malias",18,"111","00:01:12.262","59,78km/h"]
[1,"Leandro Malias",18,"111","00:01:13.092","59,1km/h"]
[1,"Leandro Malias",18,"111","00:01:11.912","60,07km/h"]
[1,"Leandro Malias",18,"111","00:01:12.614","59,49km/h"]
[1,"Leandro Malias",18,"111","00:01:11.911","60,07km/h"]
[1,"Leandro Malias",18,"111","00:01:12.018","59,99km/h"]
[1,"Leandro Malias",18,"111","00:01:12.126","59,9km/h"]
[1,"Leandro Malias",18,"111","00:01:12.786","59,35km/h"]
[1,"Leandro Malias",18,"111","00:01:13.121","59,08km/h"]
[1,"Marcelo Sant'anna",18,"154","00:01:16.829","56,23km/h"]
[1,"Marcelo Sant'anna",18,"154","00:01:13.194","59,02km/h"]
[1,"Marcelo Sant'anna",18,"154","00:01:12.200","59,83km/h"]
[1,"Marcelo Sant'anna",18,"154","00:01:13.780","58,55km/h"]
[1,"Marcelo Sant'anna",18,"154","00:01:12.535","59,56km/h"]
[1,"Marcelo Sant'anna",18,"154","00:01:12.748","59,38km/h"]
[1,"Marcelo Sant'anna",18,"154","00:01:12.458","59,62km/h"]
[1,"Marcelo Sant'anna",18,"154","00:01:12.199","59,83km/h"]
[1,"Marcelo Sant'anna",18,"154","00:01:12.836","59,31km/h"]
[1,"Marcelo Sant'anna",18,"154","00:01:12.676","59,44km/h"]
[1,"Marcelo Sant'anna",18,"154","00:01:14.215","58,21km/h"]
[1,"Marcelo Sant'anna",18,"154","00:01:11.910","60,08km/h"]
[1,"Marcelo Sant'anna",18,"154","00:01:12.058","59,95km/h"]
[1,"Marcelo Sant'anna",18,"154","00:01:12.356","59,7km/h"]
[1,"Marcelo Sant'anna",18,"154","00:01:11.993","60,01km/h"]
[1,"Marcelo Sant'anna",18,"154","00:01:12.243","59,8km/h"]
[1,"Marcelo Sant'anna",18,"154","00:01:12.531","59,56km/h"]
[1,"Marcelo Sant'anna",18,"154","00:01:12.729","59,4km/h"]
[1,"Délcio Ragazzi",18,"115","00:01:16.138","56,74km/h"]
[1,"Délcio Ragazzi",18,"115","00:01:23.190","51,93km/h"]
[1,"Délcio Ragazzi",18,"115","00:01:12.372","59,69km/h"]
[1,"Délcio Ragazzi",18,"115","00:01:14.529","57,96km/h"]
[1,"Délcio Ragazzi",18,"115","00:01:12.636","59,47km/h"]
[1,"Délcio Ragazzi",18,"115","00:01:12.573","59,53km/h"]
[1,"Délcio Ragazzi",18,"115","00:01:12.028","59,98km/h"]
[1,"Délcio Ragazzi",18,"115","00:01:12.566","59,53km/h"]
[1,"Délcio Ragazzi",18,"115","00:01:12.022","59,98km/h"]
[1,"Délcio Ragazzi",18,"115","00:01:12.574","59,53km/h"]
[1,"Délcio Ragazzi",18,"115","00:01:12.113","59,91km/h"]
[1,"Délcio Ragazzi",18,"115","00:01:11.857","60,12km/h"]
[1,"Délcio Ragazzi",18,"115","00:01:11.957","60,04km/h"]
[1,"Délcio Ragazzi",18,"115","00:01:13.242","58,98km/h"]
[1,"Délcio Ragazzi",18,"115","00:01:12.084","59,93km/h"]
[1,"Délcio Ragazzi",18,"115","00:01:11.971","60,02km/h"]
[1,"Délcio Ragazzi",18,"115","00:01:13.596","58,7km/h"]
[1,"Délcio Ragazzi",18,"115","00:01:12.578","59,52km/h"]
[1,"Marcelo Chagas",18,"148","00:01:16.927","56,16km/h"]
[1,"Marcelo Chagas",18,"148","00:01:14.065","58,33km/h"]
[1,"Marcelo Chagas",18,"148","00:01:14.039","58,35km/h"]
[1,"Marcelo Chagas",18,"148","00:01:13.032","59,15km/h"]
[1,"Marcelo Chagas",18,"148","00:01:13.384","58,87km/h"]
[1,"Marcelo Chagas",18,"148","00:01:12.769","59,37km/h"]
[1,"Marcelo Chagas",18,"148","00:01:12.918","59,24km/h"]
[1,"Marcelo Chagas",18,"148","00:01:12.799","59,34km/h"]
[1,"Marcelo Chagas",18,"148","00:01:12.999","59,18km/h"]
[1,"Marcelo Chagas",18,"148","00:01:12.766","59,37km/h"]
[1,"Marcelo Chagas",18,"148","00:01:12.663","59,45km/h"]
[1,"Marcelo Chagas",18,"148","00:01:12.793","59,35km/h"]
[1,"Marcelo Chagas",18,"148","00:01:12.602","59,5km/h"]
[1,"Marcelo Chagas",18,"148","00:01:12.650","59,46km/h"]
[1,"Marcelo Chagas",18,"148","00:01:12.942","59,23km/h"]
[1,"Marcelo Chagas",18,"148","00:01:13.044","59,14km/h"]
[1,"Marcelo Chagas",18,"148","00:01:14.337","58,11km/h"]
[1,"Marcelo Chagas",18,"148","00:01:13.555","58,73km/h"]
[1,"Reila Ricardo",18,"138","00:01:17.253","55,92km/h"]
[1,"Reila Ricardo",18,"138","00:01:12.980","59,19km/h"]
[1,"Reila Ricardo",18,"138","00:01:12.661","59,45km/h"]
[1,"Reila Ricardo",18,"138","00:01:27.799","49,2km/h"]
[1,"Reila Ricardo",18,"138","00:01:13.058","59,13km/h"]
[1,"Reila Ricardo",18,"138","00:01:12.960","59,21km/h"]
[1,"Reila Ricardo",18,"138","00:01:12.829","59,32km/h"]
[1,"Reila Ricardo",18,"138","00:01:13.213","59,01km/h"]
[1,"Reila Ricardo",18,"138","00:01:13.075","59,12km/h"]
[1,"Reila Ricardo",18,"138","00:01:13.231","58,99km/h"]
[1,"Reila Ricardo",18,"138","00:01:12.977","59,2km/h"]
[1,"Reila Ricardo",18,"138","00:01:12.929","59,24km/h"]
[1,"Reila Ricardo",18,"138","00:01:12.084","59,93km/h"]
[1,"Reila Ricardo",18,"138","00:01:12.808","59,33km/h"]
[1,"Reila Ricardo",18,"138","00:01:12.820","59,32km/h"]
[1,"Reila Ricardo",18,"138","00:01:11.987","60,01km/h"]
[1,"Reila Ricardo",18,"138","00:01:14.434","58,04km/h"]
[1,"Reila Ricardo",18,"138","00:01:14.313","58,13km/h"]
[1,"Hélio Chagas",18,"119","00:01:17.950","55,42km/h"]
[1,"Hélio Chagas",18,"119","00:01:14.702","57,83km/h"]
[1,"Hélio Chagas",18,"119","00:01:14.027","58,36km/h"]
[1,"Hélio Chagas",18,"119","00:01:13.854","58,49km/h"]
[1,"Hélio Chagas",18,"119","00:01:13.295","58,94km/h"]
[1,"Hélio Chagas",18,"119","00:01:14.139","58,27km/h"]
[1,"Hélio Chagas",18,"119","00:01:13.330","58,91km/h"]
[1,"Hélio Chagas",18,"119","00:01:13.652","58,65km/h"]
[1,"Hélio Chagas",18,"119","00:01:12.808","59,33km/h"]
[1,"Hélio Chagas",18,"119","00:01:14.155","58,26km/h"]
[1,"Hélio Chagas",18,"119","00:01:13.143","59,06km/h"]
[1,"Hélio Chagas",18,"119","00:01:13.290","58,94km/h"]
[1,"Hélio Chagas",18,"119","00:01:13.689","58,62km/h"]
[1,"Hélio Chagas",18,"119","00:01:13.784","58,55km/h"]
[1,"Hélio Chagas",18,"119","00:01:13.976","58,4km/h"]
[1,"Hélio Chagas",18,"119","00:01:13.756","58,57km/h"]
[1,"Hélio Chagas",18,"119","00:01:15.067","57,55km/h"]
[1,"Hélio Chagas",18,"119","00:01:14.428","58,04km/h"]
[1,"Cláudio Naves",17,"150","00:01:18.106","55,31km/h"]
[1,"Cláudio Naves",17,"150","00:01:14.435","58,04km/h"]
[1,"Cláudio Naves",17,"150","00:01:13.943","58,42km/h"]
[1,"Cláudio Naves",17,"150","00:01:14.553","57,95km/h"]
[1,"Cláudio Naves",17,"150","00:01:13.903","58,46km/h"]
[1,"Cláudio Naves",17,"150","00:01:13.670","58,64km/h"]
[1,"Cláudio Naves",17,"150","00:01:13.520","58,76km/h"]
[1,"Cláudio Naves",17,"150","00:01:13.546","58,74km/h"]
[1,"Cláudio Naves",17,"150","00:01:14.188","58,23km/h"]
[1,"Cláudio Naves",17,"150","00:01:14.192","58,23km/h"]
[1,"Cláudio Naves",17,"150","00:01:13.650","58,66km/h"]
[1,"Cláudio Naves",17,"150","00:01:13.326","58,91km/h"]
[1,"Cláudio Naves",17,"150","00:01:14.911","57,67km/h"]
[1,"Cláudio Naves",17,"150","00:01:14.438","58,03km/h"]
[1,"Cláudio Naves",17,"150","00:01:13.773","58,56km/h"]
[1,"Cláudio Naves",17,"150","00:01:14.681","57,85km/h"]
[1,"Cláudio Naves",17,"150","00:01:14.884","57,69km/h"]
[1,"Bernardo Freitas",17,"152","00:01:17.347","55,85km/h"]
[1,"Bernardo Freitas",17,"152","00:01:15.202","57,45km/h"]
[1,"Bernardo Freitas",17,"152","00:01:17.006","56,1km/h"]
[1,"Bernardo Freitas",17,"152","00:01:19.592","54,28km/h"]
[1,"Bernardo Freitas",17,"152","00:01:13.030","59,15km/h"]
[1,"Bernardo Freitas",17,"152","00:01:13.006","59,17km/h"]
[1,"Bernardo Freitas",17,"152","00:01:35.165","45,39km/h"]
[1,"Bernardo Freitas",17,"152","00:01:11.865","60,11km/h"]
[1,"Bernardo Freitas",17,"152","00:01:11.532","60,39km/h"]
[1,"Bernardo Freitas",17,"152","00:01:11.549","60,38km/h"]
[1,"Bernardo Freitas",17,"152","00:01:11.633","60,31km/h"]
[1,"Bernardo Freitas",17,"152","00:01:11.619","60,32km/h"]
[1,"Bernardo Freitas",17,"152","00:01:11.836","60,14km/h"]
[1,"Bernardo Freitas",17,"152","00:01:12.405","59,66km/h"]
[1,"Bernardo Freitas",17,"152","00:01:11.486","60,43km/h"]
[1,"Bernardo Freitas",17,"152","00:01:11.414","60,49km/h"]
[1,"Bernardo Freitas",17,"152","00:01:11.566","60,36km/h"]
[1,"Marcelo Clemente",17,"109","00:01:17.347","55,85km/h"]
[1,"Marcelo Clemente",17,"109","00:01:15.202","57,45km/h"]
[1,"Marcelo Clemente",17,"109","00:01:17.006","56,1km/h"]
[1,"Marcelo Clemente",17,"109","00:01:19.592","54,28km/h"]
[1,"Marcelo Clemente",17,"109","00:01:13.030","59,15km/h"]
[1,"Marcelo Clemente",17,"109","00:01:13.006","59,17km/h"]
[1,"Marcelo Clemente",17,"109","00:01:35.216","45,37km/h"]
[1,"Marcelo Clemente",17,"109","00:01:11.868","60,11km/h"]
[1,"Marcelo Clemente",17,"109","00:01:11.526","60,4km/h"]
[1,"Marcelo Clemente",17,"109","00:01:11.509","60,41km/h"]
[1,"Marcelo Clemente",17,"109","00:01:11.655","60,29km/h"]
[1,"Marcelo Clemente",17,"109","00:01:11.646","60,3km/h"]
[1,"Marcelo Clemente",17,"109","00:01:11.832","60,14km/h"]
[1,"Marcelo Clemente",17,"109","00:01:12.380","59,68km/h"]
[1,"Marcelo Clemente",17,"109","00:01:11.521","60,4km/h"]
[1,"Marcelo Clemente",17,"109","00:01:11.409","60,5km/h"]
[1,"Marcelo Clemente",17,"109","00:01:11.517","60,41km/h"]
[1,"Wesley Canuto",3,"108","00:01:15.515","57,21km/h"]
[1,"Wesley Canuto",3,"108","00:01:13.585","58,71km/h"]
[1,"Wesley Canuto",3,"108","00:01:26.765","49,79km/h"]
[]
[]
[]
[]
[]
[]
[]
[]
[]
[]
[]
[]
[]
[]
[]
[]
[]
[]
[]
[]
[]
[]
[]
[]
[]
[]
[]
[]
[]
[]
[]
[]
[]
[]
[]
[]
[]
[]
[]
[]
[]
[]
[]
[]
[]
[]
[]
[]
[]
[]
[]
[]
[]
[]
[]
[]
[]
[]
[]
[]
[]
[]
[]
[]
[]
[]
[]
[]
[]
[]
[]
[]
[]
[]
[]
[]
[]
[]
[]
[]
[]
[]
[]
[]
[]
[]
[]
[]
[]
[]
[]
[]
[]
[]
[]
[]
[]
[]
[]
[]
[]
[]
[]
[]
[]
[]
[]
[]
[]
[]
[]
[]
[]
[]
[]
[]
[]
[]
[]
[]
[]
[]
[]
[]
[]
[]
[]
[]
[]
[]
[]
[]
[]
[]
[]
[]
[]
[]
[]
[]
[]
[]
[]
[]
[]
[]
[]
[]
[]
[]
[]
[]
[]
[]
[]
[]
[]
[]
[]
[]
[]
[]
[]
[]
[]
[]
[]
[]
[]
[]
[]
[]
[]
[]
[]
[]
[]
[]
[]
[]
[]
[]
[]
[]
[]
[]
[]
[]
[]
[]
[]
[]
[]
[]
[]
[]
[]
[]
[]
[]
[]
[]
[]
[]
[]
[]
[]
[]
[]
[]
[]
[]
[]
[]
[]
[]
[]
[]
[]
[]
[]
[]
[]
[]
[]
[]
[]
[]
[]
[]
[]
[]
[]
[]
[]
[]
[]
[]
[]
[]
[]
[]
[]
[]
[]
[]
[]
[]
[]
[]
[]
[]
[]
[]
[]
[]
[]
[]
[]
[]
[]
[]
[]
[]
[]
[]
[]
[]
[]
[]
[]
[]
[]
[]
[]
[]
[]
[]
[]
[]
[]
[]
[]
[]
[]
[]
[]
[]
[]
[]
[]
[]
[]
[]
[]
[]
[]
[]
[]
[]
[]
[]
[]
[]
[]
[]
[]
[]
[]
[]
[]
[]
[]
[]
[]
[]
[]
[null,null,null,null,null,null,null,null,null,null,null,null,null,null,"Volta Tm"]
[null,null,null,null,null,null,null,null,null,null,null,null,null,null,8.2061342592592602E-4]
[null,null,null,null,null,null,null,null,null,null,null,null,null,null,7.6031250000000014E-4]
[null,null,null,null,null,null,null,null,null,null,null,null,null,null,7.5597222222222222E-4]
[null,null,null,null,null,null,null,null,null,null,null,null,null,null,8.0030092592592598E-4]
[null,null,null,null,null,null,null,null,null,null,null,null,null,null,7.3923611111111108E-4]
[null,null,null,null,null,null,null,null,null,null,null,null,null,null,7.3579861111111112E-4]
[null,null,null,null,null,null,null,null,null,null,null,null,null,null,7.5108796296296295E-4]
[null,null,null,null,null,null,null,null,null,null,null,null,null,null,7.4093749999999995E-4]
[null,null,null,null,null,null,null,null,null,null,null,null,null,null,7.393171296296297E-4]
[null,null,null,null,null,null,null,null,null,null,null,null,null,null,7.3083333333333333E-4]
[null,null,null,null,null,null,null,null,null,null,null,null,null,null,7.3564814814814803E-4]
[null,null,null,null,null,null,null,null,null,null,null,null,null,null,7.5065972222222233E-4]
[null,null,null,null,null,null,null,null,null,null,null,null,null,null,7.3281249999999996E-4]
[null,null,null,null,null,null,null,null,null,null,null,null,null,null,7.3491898148148136E-4]
[null,null,null,null,null,null,null,null,null,null,null,null,null,null,7.3047453703703696E-4]
[null,null,null,null,null,null,null,null,null,null,null,null,null,null,7.2789351851851845E-4]
[null,null,null,null,null,null,null,null,null,null,null,null,null,null,7.267708333333335E-4]
[null,null,null,null,null,null,null,null,null,null,null,null,null,null,7.258564814814814E-4]
[null,null,null,null,null,null,null,null,null,null,null,null,null,null,7.2362268518518511E-4]
[null,null,null,null,null,null,null,null,null,null,null,null,null,null,7.2398148148148137E-4]
[null,null,null,null,null,null,null,null,null,null,null,null,null,null,7.2565972222222227E-4]
[null,null,null,null,null,null,null,null,null,null,null,null,null,null,7.3024305555555559E-4]
[null,null,null,null,null,null,null,null,null,null,null,null,null,null,7.4228009259259267E-4]
[null,null,null,null,null,null,null,null,null,null,null,null,null,null,7.3493055555555551E-4]
[null,null,null,null,null,null,null,null,null,null,null,null,null,null,7.4624999999999995E-4]
[null,null,null,null,null,null,null,null,null,null,null,null,null,null,7.3689814814814809E-4]
[null,null,null,null,null,null,null,null,null,null,null,null,null,null,7.3586805555555558E-4]
[null,null,null,null,null,null,null,null,null,null,null,null,null,null,7.457870370370371E-4]
[]
[]
[]
[]
[]
[]
[]
[]
[]
[]
[]
[]
[]
[]
[]
[]
[]
[]
[]
[]
[]
[]
[]
[]
[]
[]
[]
[]
[]
[]
[]
[]
[]
[]
[]
[]
[]
[]
[]
[]
[]
[]
[]
[]
[]
[]
[]
[]
[]
[]
[]
[]
[]
[]
[]
[]
[]
[]
[]
[]
[]
[]
[]
[]
[]
[]
[]
[]
[]
[]
[]
[]
[]
[]
[]
[]
[]
[]
[]
[]
[]
[]
[]
[]
[]
[]
[]
[]
[]
[]
[]
[]
[]
[]
[]
[]
[]
[]
[]
[]
[]
[]
[]
[]
[]
[]
[]
[]
[]
[]
[]
[]
[]
[]
[]
[]
[]
[]
[]
[]
[]
[]
[]
[]
[]
[]
[]
[]
[]
[]
[]
[]
[]
[]
[]
[]
[]
[]
[]
[]
[]
[]
[]
[]
[]
[]
[]
[]
[]
[]
[]
[]
[]
[]
[]
[]
[]
[]
[]
[]
[]
[]
[]
[]
[]
[]
[]
[]
[]
[]
[]
[]
[]
[]
[]
[]
[]
[]
[]
[]
[]
[]
[]
[]
[]
[]
[]
[]
[]
[]
[]
[]
[]
[]
[]
[]
[]
[]
[]
[]
[]
[]
[]
[]
[]
[]
[]
[]
[]
[]
[]
[]
[]
[]
[]
[]
[]
[]
[]
[]
[]
[]
[]
[]
[]
[]
[]
[]
[]
[]
[]
[]
[]
[]
[]
[]
[]
[]
[]
[]
[]
[]
[]
[]
[]
[]
[]
[]
[]
[]
[]
[]
[]
[]
[]
[]
[]
[]
[]
[]
[]
[]
[]
[]
[]
[]
[]
[]
[]
[]
[]
[]
[]
[]
[]
[]
[]
[]
[]
[]
[]
[]
[]
[]
[]
[]
[]
[]
[]
[]
[]
[]
[]
[]
[]
[]
[]
[]
[]
[]
[]
[]
[]
[]
[]
[]
[]
[]
[]
[]
[]
[]
[]
[]
[]
[]
[]
[]
[]
[]
[]
[]
[]
[]
[]
[]
[]
[]
[]
[]
[]
[]
[]
[]
[]
[]
[]
[]
[]
[]
[]
[]
[]
[]
[]
[]
[]
[]
[]
[]
[]
[]
[]
[]
[]
[]
[]
[]
[]
[]
[]
[]
[]
[]
[]
[]
[]
[]
[]
[]
[]
[]
[]
[]
[]
[]
[]
[]
[]
[]
[]
[]
[]
[]
[]
[]
[]
[]
[]
[]
[]
[]
[]
[]
[]
[]
[]
[]
[]
[]
[]
[]
[]
[]
[]
[]
[]
[]
[]
[]
[]
[]
[]
[]
[]
[]
[]
[]
[]
[]
[]
[]
[]
[]
[]
[]
[]
[]
[]
[]
[]
[]
[]
[]
[]
[]
[]
[]
[]
[]
[]
[]
[]
[]
[]
[]
[]
[]
[]
[]
[]
[]
[]
[]
[]
[]
[]
[]
[]
[]
[]
[]
[]
[]
[]
[]
[]
[]
[]
[]
[]
[]
[]
[]
[]
[]
[]
[]
[]
[]
[]
[]
[]
[]
[]
[]
[]
[]
[]
[]
[]
[]
[]
[]
[]
[]
[]
[]
[]
[]
[]
[]
[]
[]
[]
[]
[]
[]
[]
[]
[]
[]
[]
[]
[]
[]
[]
[]
[]
[]
[]
[]
[]
[]
[]
[]
[]
[]
[]
[]
[]
[]
[]
[]
[]
[]
[]
[]
[]
[]
[]
[]
[]
[]
[]
[]
[]
[]
[]
[]
[]
[]
[]
[]
[]
[]
[]
[]
[]
[]
[]
[]
[]
[]
[]
[]
[]
[]
[]
[]
[]
[]
[]
[]
[]
[]
[]
[]
[]
[]
[]
[]
[]
[]
[]
[]
[]
[]
[]
[]
[]
[]
[]
[]
[]
[]
[]
[]
[]
[]
[]
[]
[]
[]
[]
[]
[]
[]
[]
[]
[]
[]
[]
[]
[]
[]
[]
[]
[]
[]
[]
[]
[]
[]
[]
[]
[]
[]
[]
[]
[]
[]
[]
[]
[]
[]
[]
[]
[]
[]
[]
[]
[]
[]
[]
[]
[]
[]
[]
[]
[]
[]
[]
[]
[]
[]
[]
[]
[]
[]
[]
[]
[]
[]
[]
[]
[]
[]
[]
[]
[]
[]
[]
[]
[]
[]
[]
[]
[]
[]
[]
[]
[]
[]
[]
[]
[]
[]
[]
[]
[]
[]
[]
[]
[]
[]
[]
[]
[]
[]
[]
[]
[]
[]
[]
[]
[]
[]
[]
[]
[]
[]
[]
[]
[]
[]
[]
[]
[]
[]
[]
[]
[]
[]
[]
[]
[]
[]
[]
[]
[]
[]
[]
[]
[]
[]
[]
[]
[]
[]
[]
[]
[]
[]
[]
[]
[]
[]
[]
[]
[]
[]
[]
[]
[]
[]
[]
[]
[]
[]
[]
[]
[]
[]
[]
[]
[]
[]
[]
[]
[]
[]
[]
[]
[]
[]
[]
[]
[]
[]
[]
[]
[]
[]
[]
[]
[]
[]
[]
[]
[]
[]
[]
[]
[]
[]
[]
[]
[]
[null,null,null,null,null,null,null,null,null,null,null,"Volta Tm","Volta Tm"]
[]
[]
[]
[]
[]
[]
[]
[]
[]
[]
[]
[]
[]
[]
[]
[]
[]
[]
[]
[]
[]
[]
[]
[]
[]
[]
[]
[]
[]
[]
[]
[]
[]
[]
[]
[]
[]
[]
[]
[]
[]
[]
[]
[]
[]
[]
[]
[]
[]
[]
[]
[]
[]
[]
[]
[]
[]
[]
[]
[]
[]
[]
[]
[]
[]
[]
[]
[]
[]
[]
[]
[]
[]
[]
[]
[]
[]
[]
[]
[]
[]
[]
[]
[]
[]
[]
[]
[]
[]
[]
[]
[]
[]
[]
[]
[]
[]
[]
[]
[]
[]
[]
[]
[]
[]
[]
[]
[]
[]
[]
[]
[]
[]
[]
[]
[]
[]
[]
[]
[]
[]
[]
[]
[]
[]
[]
[]
[]
[]
[]
[]
[]
[]
[]
[]
[]
[]
[]
[]
[]
[]
[]
[]
[]
[]
[]
[]
[]
[]
[]
[]
[]
[]
[]
[]
[]
[]
[]
[]
[]
[]
[]
[]
[]
[]
[]
[]
[]
[]
[]
[]
[]
[]
[]
[]
[]
[]
[]
[]
[]
[]
[]
[]
[]
[]
[]
[]
[]
[]
[]
[]
[]
[]
[]
[]
[]
[]
[]
[]
[]
[]
[]
[]
[]
[]
[]
[]
[]
[]
[]
[]
[]
[]
[]
[]
[]
[]
[]
[]
[]
[]
[]
[]
[]
[]
[]
[]
[]
[]
[]
[]
[]
[]
[]
[]
[]
[]
[]
[]
[]
[]
[]
[]
[]
[]
[]
[]
[]
[]
[]
[]
[]
[]
[]
[]
[]
[]
[]
[]
[]
[]
[]
[]
[]
[]
[]
[]
[]
[]
[]
[]
[]
[]
[]
[]
[]
[]
[]
[]
[]
[]
[]
[]
[]
[]
[]
[]
[]
[]
[]
[]
[]
[]
[]
[]
[]
[]
[]
[]
[]
[]
[]
[]
[]
[]
[]
[]
[]
[]
[]
[]
[]
[]
[]
[]
[]
[]
[]
[]
[]
[]
[]
[]
[]
[]
[]
[]
[]
[]
[]
[]
["PILOTO","ULTRAPASSAGENS",null,null,"Volta Tm"]
["Wilson Cristofani",0,null,null,"00:01:20.779"]
["DIEGO RODRIGUES",0,null,null,"00:01:16.448"]
["Joanês Golveia",1,null,null,"00:01:17.289"]
["Alexandre Melillo",2,null,null,"00:01:16.127"]
["Andreson Souza",0,null,null,"00:01:16.755"]
["Rafael Miranda",2,null,null,"00:01:16.080"]
["Anderson Teixeira",3,null,null,"00:01:15.857"]
["Luciano Brandão",2,null,null,"00:01:16.520"]
["Lúcio Santos",7,null,null,"00:01:16.357"]
["Leandro Leite",3,null,null,"00:01:15.750"]
["Guilherme Gonsalves",2,null,null,"00:01:15.782"]
["Gladystone Reis",0,null,null,"00:01:16.504"]
["Aparecido Faria",5,null,null,"00:01:16.205"]
["José Filho",7,null,null,"00:01:15.674"]
["João Ferreira",7,null,null,"00:01:15.438"]
[null,7,null,null,"00:01:16.746"]
[null,null,null,null,"00:01:15.691"]
[null,null,null,null,"00:01:15.329"]
[null,null,null,null,"00:01:15.616"]
[null,null,null,null,"00:01:15.483"]
[null,null,null,null,"00:01:15.715"]
[null,null,null,null,"00:01:24.109"]
[null,null,null,null,"00:01:29.259"]
[null,null,null,null,"00:01:34.959"]
[null,null,null,null,"00:01:03.824"]
[null,null,null,null,"00:01:04.490"]
[null,null,null,null,"00:01:05.192"]
[null,null,null,null,"00:01:03.579"]
[null,null,null,null,"00:01:04.659"]
[null,null,null,null,6.2215277777777779E-4]
[null,null,null,null,6.2060185185185178E-4]
[null,null,null,null,6.2089120370370369E-4]
[null,null,null,null,6.1916666666666674E-4]
[null,null,null,null,6.287847222222222E-4]
[null,null,null,null,6.2924768518518505E-4]
[null,null,null,null,6.317824074074074E-4]
[null,null,null,null,6.3106481481481488E-4]